[jbosstools-builds] [Failure] jbosstools-nightly-3.1.0.M4 #34

jboss-qa-internal at redhat.com jboss-qa-internal at redhat.com
Sun Sep 6 15:14:42 EDT 2009


Public: 
https://hudson.jboss.org/hudson//job/jbosstools-nightly-3.1.0.M4/34
https://hudson.jboss.org/hudson//job/jbosstools-nightly-3.1.0.M4/34/testReport
https://hudson.jboss.org/hudson//job/jbosstools-nightly-3.1.0.M4/34/changes
https://hudson.jboss.org/hudson//job/jbosstools-nightly-3.1.0.M4/34/console

Internal:
http://hudson.qa.jboss.com/hudson/job/jbosstools-nightly-3.1.0.M4/34/
http://hudson.qa.jboss.com/hudson/job/jbosstools-nightly-3.1.0.M4/34//testReport
http://hudson.qa.jboss.com/hudson/job/jbosstools-nightly-3.1.0.M4/34//changes
http://hudson.qa.jboss.com/hudson/job/jbosstools-nightly-3.1.0.M4/34//console

--------------------------------------------------

Failed Tests:

15 tests failed.
FAILED:  SeamRefactoringAllTests

Error Message:
Component org.jboss.seam.mail.mailSession does not have java declaration.

Stack Trace:
junit.framework.AssertionFailedError: Component org.jboss.seam.mail.mailSession does not have java declaration.
	at org.jboss.tools.seam.core.test.refactoring.SeamComponentRefactoringTest.renameComponent(SeamComponentRefactoringTest.java:112)
	at org.jboss.tools.seam.core.test.refactoring.SeamComponentRefactoringTest.testJBIDE4447(SeamComponentRefactoringTest.java:93)
	at junit.extensions.TestDecorator.basicRun(TestDecorator.java:24)
	at junit.extensions.TestSetup$1.protect(TestSetup.java:21)
	at junit.extensions.TestSetup.run(TestSetup.java:25)
	at org.eclipse.test.EclipseTestRunner.run(EclipseTestRunner.java:354)
	at org.eclipse.test.EclipseTestRunner.run(EclipseTestRunner.java:206)
	at org.eclipse.test.UITestApplication$3.run(UITestApplication.java:195)
	at org.eclipse.swt.widgets.RunnableLock.run(RunnableLock.java:35)
	at org.eclipse.swt.widgets.Synchronizer.runAsyncMessages(Synchronizer.java:134)
	at org.eclipse.swt.widgets.Display.runAsyncMessages(Display.java:3468)
	at org.eclipse.swt.widgets.Display.readAndDispatch(Display.java:3115)
	at org.eclipse.ui.internal.Workbench.runEventLoop(Workbench.java:2405)
	at org.eclipse.ui.internal.Workbench.runUI(Workbench.java:2369)
	at org.eclipse.ui.internal.Workbench.access$4(Workbench.java:2221)
	at org.eclipse.ui.internal.Workbench$5.run(Workbench.java:500)
	at org.eclipse.core.databinding.observable.Realm.runWithDefault(Realm.java:332)
	at org.eclipse.ui.internal.Workbench.createAndRunWorkbench(Workbench.java:493)
	at org.eclipse.ui.PlatformUI.createAndRunWorkbench(PlatformUI.java:149)
	at org.eclipse.ui.internal.ide.application.IDEApplication.start(IDEApplication.java:113)
	at org.eclipse.test.UITestApplication.runApplication(UITestApplication.java:138)
	at org.eclipse.test.UITestApplication.run(UITestApplication.java:60)
	at org.eclipse.test.UITestApplication.start(UITestApplication.java:210)
	at org.eclipse.equinox.internal.app.EclipseAppHandle.run(EclipseAppHandle.java:194)
	at org.eclipse.core.runtime.internal.adaptor.EclipseAppLauncher.runApplication(EclipseAppLauncher.java:110)
	at org.eclipse.core.runtime.internal.adaptor.EclipseAppLauncher.start(EclipseAppLauncher.java:79)
	at org.eclipse.core.runtime.adaptor.EclipseStarter.run(EclipseStarter.java:368)
	at org.eclipse.core.runtime.adaptor.EclipseStarter.run(EclipseStarter.java:179)
	at org.eclipse.equinox.launcher.Main.invokeFramework(Main.java:559)
	at org.eclipse.equinox.launcher.Main.basicRun(Main.java:514)
	at org.eclipse.equinox.launcher.Main.run(Main.java:1311)
	at org.eclipse.equinox.launcher.Main.main(Main.java:1287)
	at org.eclipse.core.launcher.Main.main(Main.java:34)


FAILED:  JMXCoreAllTests

Error Message:
Failed to retrieve RMIServer stub: javax.naming.ServiceUnavailableException [Root exception is java.rmi.ConnectException: Connection refused to host: 127.0.0.1; nested exception is:   java.net.ConnectException: Connection refused]

Stack Trace:
java.io.IOException: Failed to retrieve RMIServer stub: javax.naming.ServiceUnavailableException [Root exception is java.rmi.ConnectException: Connection refused to host: 127.0.0.1; nested exception is: 
	java.net.ConnectException: Connection refused]
	at javax.management.remote.rmi.RMIConnector.connect(RMIConnector.java:317)
	at javax.management.remote.JMXConnectorFactory.connect(JMXConnectorFactory.java:248)
	at org.jboss.tools.jmx.core.providers.DefaultConnectionWrapper.connect(DefaultConnectionWrapper.java:80)
	at org.jboss.tools.jmx.core.tests.DefaultProviderTest.testConnection(DefaultProviderTest.java:116)
	at org.eclipse.test.EclipseTestRunner.run(EclipseTestRunner.java:354)
	at org.eclipse.test.EclipseTestRunner.run(EclipseTestRunner.java:206)
	at org.eclipse.test.UITestApplication$3.run(UITestApplication.java:195)
	at org.eclipse.swt.widgets.RunnableLock.run(RunnableLock.java:35)
	at org.eclipse.swt.widgets.Synchronizer.runAsyncMessages(Synchronizer.java:134)
	at org.eclipse.swt.widgets.Display.runAsyncMessages(Display.java:3468)
	at org.eclipse.swt.widgets.Display.readAndDispatch(Display.java:3115)
	at org.eclipse.ui.internal.Workbench.runEventLoop(Workbench.java:2405)
	at org.eclipse.ui.internal.Workbench.runUI(Workbench.java:2369)
	at org.eclipse.ui.internal.Workbench.access$4(Workbench.java:2221)
	at org.eclipse.ui.internal.Workbench$5.run(Workbench.java:500)
	at org.eclipse.core.databinding.observable.Realm.runWithDefault(Realm.java:332)
	at org.eclipse.ui.internal.Workbench.createAndRunWorkbench(Workbench.java:493)
	at org.eclipse.ui.PlatformUI.createAndRunWorkbench(PlatformUI.java:149)
	at org.eclipse.ui.internal.ide.application.IDEApplication.start(IDEApplication.java:113)
	at org.eclipse.test.UITestApplication.runApplication(UITestApplication.java:138)
	at org.eclipse.test.UITestApplication.run(UITestApplication.java:60)
	at org.eclipse.test.UITestApplication.start(UITestApplication.java:210)
	at org.eclipse.equinox.internal.app.EclipseAppHandle.run(EclipseAppHandle.java:194)
	at org.eclipse.core.runtime.internal.adaptor.EclipseAppLauncher.runApplication(EclipseAppLauncher.java:110)
	at org.eclipse.core.runtime.internal.adaptor.EclipseAppLauncher.start(EclipseAppLauncher.java:79)
	at org.eclipse.core.runtime.adaptor.EclipseStarter.run(EclipseStarter.java:368)
	at org.eclipse.core.runtime.adaptor.EclipseStarter.run(EclipseStarter.java:179)
	at org.eclipse.equinox.launcher.Main.invokeFramework(Main.java:559)
	at org.eclipse.equinox.launcher.Main.basicRun(Main.java:514)
	at org.eclipse.equinox.launcher.Main.run(Main.java:1311)
	at org.eclipse.equinox.launcher.Main.main(Main.java:1287)
	at org.eclipse.core.launcher.Main.main(Main.java:34)
Caused by: javax.naming.ServiceUnavailableException [Root exception is java.rmi.ConnectException: Connection refused to host: 127.0.0.1; nested exception is: 
	java.net.ConnectException: Connection refused]
	at com.sun.jndi.rmi.registry.RegistryContext.lookup(RegistryContext.java:97)
	at com.sun.jndi.toolkit.url.GenericURLContext.lookup(GenericURLContext.java:185)
	at javax.naming.InitialContext.lookup(InitialContext.java:351)
	at javax.management.remote.rmi.RMIConnector.findRMIServerJNDI(RMIConnector.java:1817)
	at javax.management.remote.rmi.RMIConnector.findRMIServer(RMIConnector.java:1787)
	at javax.management.remote.rmi.RMIConnector.connect(RMIConnector.java:259)
Caused by: java.rmi.ConnectException: Connection refused to host: 127.0.0.1; nested exception is: 
	java.net.ConnectException: Connection refused
	at sun.rmi.transport.tcp.TCPEndpoint.newSocket(TCPEndpoint.java:574)
	at sun.rmi.transport.tcp.TCPChannel.createConnection(TCPChannel.java:185)
	at sun.rmi.transport.tcp.TCPChannel.newConnection(TCPChannel.java:171)
	at sun.rmi.server.UnicastRef.newCall(UnicastRef.java:306)
	at sun.rmi.registry.RegistryImpl_Stub.lookup(Unknown Source)
	at com.sun.jndi.rmi.registry.RegistryContext.lookup(RegistryContext.java:93)
Caused by: java.net.ConnectException: Connection refused
	at java.net.PlainSocketImpl.socketConnect(Native Method)
	at java.net.PlainSocketImpl.doConnect(PlainSocketImpl.java:333)
	at java.net.PlainSocketImpl.connectToAddress(PlainSocketImpl.java:195)
	at java.net.PlainSocketImpl.connect(PlainSocketImpl.java:182)
	at java.net.SocksSocketImpl.connect(SocksSocketImpl.java:366)
	at java.net.Socket.connect(Socket.java:520)
	at java.net.Socket.connect(Socket.java:470)
	at java.net.Socket.<init>(Socket.java:367)
	at java.net.Socket.<init>(Socket.java:180)
	at sun.rmi.transport.proxy.RMIDirectSocketFactory.createSocket(RMIDirectSocketFactory.java:22)
	at sun.rmi.transport.proxy.RMIMasterSocketFactory.createSocket(RMIMasterSocketFactory.java:128)
	at sun.rmi.transport.tcp.TCPEndpoint.newSocket(TCPEndpoint.java:569)


FAILED:  ASArchivesIntegrationTestSuite

Error Message:
/qa/hudson_ws/workspace/jbosstools-nightly-3.1.0.M4/jbds-build/3.1.0.M4/200909061201/tests/workspace/.metadata/.plugins/org.jboss.ide.eclipse.as.archives.integration.test/server1/1/out.jar/a.txt (No such file or directory)

Stack Trace:
java.io.FileNotFoundException: /qa/hudson_ws/workspace/jbosstools-nightly-3.1.0.M4/jbds-build/3.1.0.M4/200909061201/tests/workspace/.metadata/.plugins/org.jboss.ide.eclipse.as.archives.integration.test/server1/1/out.jar/a.txt (No such file or directory)
	at java.io.FileInputStream.open(Native Method)
	at java.io.FileInputStream.<init>(FileInputStream.java:106)
	at org.jboss.ide.eclipse.as.archives.integration.test.BuildDeployTest.assertDeployContents(BuildDeployTest.java:313)
	at org.jboss.ide.eclipse.as.archives.integration.test.BuildDeployTest.testAll(BuildDeployTest.java:80)
	at org.eclipse.test.EclipseTestRunner.run(EclipseTestRunner.java:354)
	at org.eclipse.test.EclipseTestRunner.run(EclipseTestRunner.java:206)
	at org.eclipse.test.UITestApplication$3.run(UITestApplication.java:195)
	at org.eclipse.swt.widgets.RunnableLock.run(RunnableLock.java:35)
	at org.eclipse.swt.widgets.Synchronizer.runAsyncMessages(Synchronizer.java:134)
	at org.eclipse.swt.widgets.Display.runAsyncMessages(Display.java:3468)
	at org.eclipse.swt.widgets.Display.readAndDispatch(Display.java:3115)
	at org.eclipse.ui.internal.Workbench.runEventLoop(Workbench.java:2405)
	at org.eclipse.ui.internal.Workbench.runUI(Workbench.java:2369)
	at org.eclipse.ui.internal.Workbench.access$4(Workbench.java:2221)
	at org.eclipse.ui.internal.Workbench$5.run(Workbench.java:500)
	at org.eclipse.core.databinding.observable.Realm.runWithDefault(Realm.java:332)
	at org.eclipse.ui.internal.Workbench.createAndRunWorkbench(Workbench.java:493)
	at org.eclipse.ui.PlatformUI.createAndRunWorkbench(PlatformUI.java:149)
	at org.eclipse.ui.internal.ide.application.IDEApplication.start(IDEApplication.java:113)
	at org.eclipse.test.UITestApplication.runApplication(UITestApplication.java:138)
	at org.eclipse.test.UITestApplication.run(UITestApplication.java:60)
	at org.eclipse.test.UITestApplication.start(UITestApplication.java:210)
	at org.eclipse.equinox.internal.app.EclipseAppHandle.run(EclipseAppHandle.java:194)
	at org.eclipse.core.runtime.internal.adaptor.EclipseAppLauncher.runApplication(EclipseAppLauncher.java:110)
	at org.eclipse.core.runtime.internal.adaptor.EclipseAppLauncher.start(EclipseAppLauncher.java:79)
	at org.eclipse.core.runtime.adaptor.EclipseStarter.run(EclipseStarter.java:368)
	at org.eclipse.core.runtime.adaptor.EclipseStarter.run(EclipseStarter.java:179)
	at org.eclipse.equinox.launcher.Main.invokeFramework(Main.java:559)
	at org.eclipse.equinox.launcher.Main.basicRun(Main.java:514)
	at org.eclipse.equinox.launcher.Main.run(Main.java:1311)
	at org.eclipse.equinox.launcher.Main.main(Main.java:1287)
	at org.eclipse.core.launcher.Main.main(Main.java:34)


FAILED:  ASTestSuite

Error Message:
null

Stack Trace:
junit.framework.AssertionFailedError
	at org.jboss.ide.eclipse.as.test.publishing.JBIDE2512aTest.testJBIDE2512a(JBIDE2512aTest.java:52)
	at org.eclipse.test.EclipseTestRunner.run(EclipseTestRunner.java:354)
	at org.eclipse.test.EclipseTestRunner.run(EclipseTestRunner.java:206)
	at org.eclipse.test.UITestApplication$3.run(UITestApplication.java:195)
	at org.eclipse.swt.widgets.RunnableLock.run(RunnableLock.java:35)
	at org.eclipse.swt.widgets.Synchronizer.runAsyncMessages(Synchronizer.java:134)
	at org.eclipse.swt.widgets.Display.runAsyncMessages(Display.java:3468)
	at org.eclipse.swt.widgets.Display.readAndDispatch(Display.java:3115)
	at org.eclipse.ui.internal.Workbench.runEventLoop(Workbench.java:2405)
	at org.eclipse.ui.internal.Workbench.runUI(Workbench.java:2369)
	at org.eclipse.ui.internal.Workbench.access$4(Workbench.java:2221)
	at org.eclipse.ui.internal.Workbench$5.run(Workbench.java:500)
	at org.eclipse.core.databinding.observable.Realm.runWithDefault(Realm.java:332)
	at org.eclipse.ui.internal.Workbench.createAndRunWorkbench(Workbench.java:493)
	at org.eclipse.ui.PlatformUI.createAndRunWorkbench(PlatformUI.java:149)
	at org.eclipse.ui.internal.ide.application.IDEApplication.start(IDEApplication.java:113)
	at org.eclipse.test.UITestApplication.runApplication(UITestApplication.java:138)
	at org.eclipse.test.UITestApplication.run(UITestApplication.java:60)
	at org.eclipse.test.UITestApplication.start(UITestApplication.java:210)
	at org.eclipse.equinox.internal.app.EclipseAppHandle.run(EclipseAppHandle.java:194)
	at org.eclipse.core.runtime.internal.adaptor.EclipseAppLauncher.runApplication(EclipseAppLauncher.java:110)
	at org.eclipse.core.runtime.internal.adaptor.EclipseAppLauncher.start(EclipseAppLauncher.java:79)
	at org.eclipse.core.runtime.adaptor.EclipseStarter.run(EclipseStarter.java:368)
	at org.eclipse.core.runtime.adaptor.EclipseStarter.run(EclipseStarter.java:179)
	at org.eclipse.equinox.launcher.Main.invokeFramework(Main.java:559)
	at org.eclipse.equinox.launcher.Main.basicRun(Main.java:514)
	at org.eclipse.equinox.launcher.Main.run(Main.java:1311)
	at org.eclipse.equinox.launcher.Main.main(Main.java:1287)
	at org.eclipse.core.launcher.Main.main(Main.java:34)


FAILED:  BirtCoreTestSuite

Error Message:
org.jboss.tools.birt.core failed to load.

Stack Trace:
junit.framework.AssertionFailedError: org.jboss.tools.birt.core failed to load.
	at org.jboss.tools.tests.AbstractPluginsLoadTest.isPluginResolved(AbstractPluginsLoadTest.java:108)
	at org.jboss.tools.tests.AbstractPluginsLoadTest.testBundlesAreLoadedFor(AbstractPluginsLoadTest.java:71)
	at org.jboss.tools.birt.core.test.BirtCoreTestSuite$BirtPluginsLoadTest.testBirtPluginsAreResolvedAndActivated(BirtCoreTestSuite.java:24)
	at org.eclipse.test.EclipseTestRunner.run(EclipseTestRunner.java:354)
	at org.eclipse.test.EclipseTestRunner.run(EclipseTestRunner.java:206)
	at org.eclipse.test.CoreTestApplication.runTests(CoreTestApplication.java:35)
	at org.eclipse.test.CoreTestApplication.run(CoreTestApplication.java:31)
	at org.eclipse.equinox.internal.app.EclipseAppContainer.callMethodWithException(EclipseAppContainer.java:574)
	at org.eclipse.equinox.internal.app.EclipseAppHandle.run(EclipseAppHandle.java:196)
	at org.eclipse.core.runtime.internal.adaptor.EclipseAppLauncher.runApplication(EclipseAppLauncher.java:110)
	at org.eclipse.core.runtime.internal.adaptor.EclipseAppLauncher.start(EclipseAppLauncher.java:79)
	at org.eclipse.core.runtime.adaptor.EclipseStarter.run(EclipseStarter.java:368)
	at org.eclipse.core.runtime.adaptor.EclipseStarter.run(EclipseStarter.java:179)
	at org.eclipse.equinox.launcher.Main.invokeFramework(Main.java:559)
	at org.eclipse.equinox.launcher.Main.basicRun(Main.java:514)
	at org.eclipse.equinox.launcher.Main.run(Main.java:1311)
	at org.eclipse.equinox.launcher.Main.main(Main.java:1287)
	at org.eclipse.core.launcher.Main.main(Main.java:34)


FAILED:  CommonExtAllTests

Error Message:
null

Stack Trace:
junit.framework.AssertionFailedError
	at org.jboss.tools.common.text.ext.test.OpenOnsTest.testUseBeanClassOpenOn(OpenOnsTest.java:345)
	at junit.extensions.TestDecorator.basicRun(TestDecorator.java:24)
	at junit.extensions.TestSetup$1.protect(TestSetup.java:21)
	at junit.extensions.TestSetup.run(TestSetup.java:25)
	at org.eclipse.test.EclipseTestRunner.run(EclipseTestRunner.java:354)
	at org.eclipse.test.EclipseTestRunner.run(EclipseTestRunner.java:206)
	at org.eclipse.test.UITestApplication$3.run(UITestApplication.java:195)
	at org.eclipse.swt.widgets.RunnableLock.run(RunnableLock.java:35)
	at org.eclipse.swt.widgets.Synchronizer.runAsyncMessages(Synchronizer.java:134)
	at org.eclipse.swt.widgets.Display.runAsyncMessages(Display.java:3468)
	at org.eclipse.swt.widgets.Display.readAndDispatch(Display.java:3115)
	at org.eclipse.ui.internal.Workbench.runEventLoop(Workbench.java:2405)
	at org.eclipse.ui.internal.Workbench.runUI(Workbench.java:2369)
	at org.eclipse.ui.internal.Workbench.access$4(Workbench.java:2221)
	at org.eclipse.ui.internal.Workbench$5.run(Workbench.java:500)
	at org.eclipse.core.databinding.observable.Realm.runWithDefault(Realm.java:332)
	at org.eclipse.ui.internal.Workbench.createAndRunWorkbench(Workbench.java:493)
	at org.eclipse.ui.PlatformUI.createAndRunWorkbench(PlatformUI.java:149)
	at org.eclipse.ui.internal.ide.application.IDEApplication.start(IDEApplication.java:113)
	at org.eclipse.test.UITestApplication.runApplication(UITestApplication.java:138)
	at org.eclipse.test.UITestApplication.run(UITestApplication.java:60)
	at org.eclipse.test.UITestApplication.start(UITestApplication.java:210)
	at org.eclipse.equinox.internal.app.EclipseAppHandle.run(EclipseAppHandle.java:194)
	at org.eclipse.core.runtime.internal.adaptor.EclipseAppLauncher.runApplication(EclipseAppLauncher.java:110)
	at org.eclipse.core.runtime.internal.adaptor.EclipseAppLauncher.start(EclipseAppLauncher.java:79)
	at org.eclipse.core.runtime.adaptor.EclipseStarter.run(EclipseStarter.java:368)
	at org.eclipse.core.runtime.adaptor.EclipseStarter.run(EclipseStarter.java:179)
	at org.eclipse.equinox.launcher.Main.invokeFramework(Main.java:559)
	at org.eclipse.equinox.launcher.Main.basicRun(Main.java:514)
	at org.eclipse.equinox.launcher.Main.run(Main.java:1311)
	at org.eclipse.equinox.launcher.Main.main(Main.java:1287)
	at org.eclipse.core.launcher.Main.main(Main.java:34)


FAILED:  ESBAllTests

Error Message:
Attribute dest name is not found in object Providers/JBossMQ/quickstartGwChannel/Filter 

Stack Trace:
junit.framework.AssertionFailedError: Attribute dest name is not found in object Providers/JBossMQ/quickstartGwChannel/Filter

	at org.jboss.tools.esb.core.test.ESBModelTest.testJMSExample(ESBModelTest.java:80)
	at org.eclipse.test.EclipseTestRunner.run(EclipseTestRunner.java:354)
	at org.eclipse.test.EclipseTestRunner.run(EclipseTestRunner.java:206)
	at org.eclipse.test.UITestApplication$3.run(UITestApplication.java:195)
	at org.eclipse.swt.widgets.RunnableLock.run(RunnableLock.java:35)
	at org.eclipse.swt.widgets.Synchronizer.runAsyncMessages(Synchronizer.java:134)
	at org.eclipse.swt.widgets.Display.runAsyncMessages(Display.java:3468)
	at org.eclipse.swt.widgets.Display.readAndDispatch(Display.java:3115)
	at org.eclipse.ui.internal.Workbench.runEventLoop(Workbench.java:2405)
	at org.eclipse.ui.internal.Workbench.runUI(Workbench.java:2369)
	at org.eclipse.ui.internal.Workbench.access$4(Workbench.java:2221)
	at org.eclipse.ui.internal.Workbench$5.run(Workbench.java:500)
	at org.eclipse.core.databinding.observable.Realm.runWithDefault(Realm.java:332)
	at org.eclipse.ui.internal.Workbench.createAndRunWorkbench(Workbench.java:493)
	at org.eclipse.ui.PlatformUI.createAndRunWorkbench(PlatformUI.java:149)
	at org.eclipse.ui.internal.ide.application.IDEApplication.start(IDEApplication.java:113)
	at org.eclipse.test.UITestApplication.runApplication(UITestApplication.java:138)
	at org.eclipse.test.UITestApplication.run(UITestApplication.java:60)
	at org.eclipse.test.UITestApplication.start(UITestApplication.java:210)
	at org.eclipse.equinox.internal.app.EclipseAppHandle.run(EclipseAppHandle.java:194)
	at org.eclipse.core.runtime.internal.adaptor.EclipseAppLauncher.runApplication(EclipseAppLauncher.java:110)
	at org.eclipse.core.runtime.internal.adaptor.EclipseAppLauncher.start(EclipseAppLauncher.java:79)
	at org.eclipse.core.runtime.adaptor.EclipseStarter.run(EclipseStarter.java:368)
	at org.eclipse.core.runtime.adaptor.EclipseStarter.run(EclipseStarter.java:179)
	at org.eclipse.equinox.launcher.Main.invokeFramework(Main.java:559)
	at org.eclipse.equinox.launcher.Main.basicRun(Main.java:514)
	at org.eclipse.equinox.launcher.Main.run(Main.java:1311)
	at org.eclipse.equinox.launcher.Main.main(Main.java:1287)
	at org.eclipse.core.launcher.Main.main(Main.java:34)


FAILED:  ESBAllTests

Error Message:
Attribute bus id ref is not found in object Services/myFileListener/Listeners/FtpGateway 

Stack Trace:
junit.framework.AssertionFailedError: Attribute bus id ref is not found in object Services/myFileListener/Listeners/FtpGateway

	at org.jboss.tools.esb.core.test.ESBModelTest.testFTPExample(ESBModelTest.java:123)
	at org.eclipse.test.EclipseTestRunner.run(EclipseTestRunner.java:354)
	at org.eclipse.test.EclipseTestRunner.run(EclipseTestRunner.java:206)
	at org.eclipse.test.UITestApplication$3.run(UITestApplication.java:195)
	at org.eclipse.swt.widgets.RunnableLock.run(RunnableLock.java:35)
	at org.eclipse.swt.widgets.Synchronizer.runAsyncMessages(Synchronizer.java:134)
	at org.eclipse.swt.widgets.Display.runAsyncMessages(Display.java:3468)
	at org.eclipse.swt.widgets.Display.readAndDispatch(Display.java:3115)
	at org.eclipse.ui.internal.Workbench.runEventLoop(Workbench.java:2405)
	at org.eclipse.ui.internal.Workbench.runUI(Workbench.java:2369)
	at org.eclipse.ui.internal.Workbench.access$4(Workbench.java:2221)
	at org.eclipse.ui.internal.Workbench$5.run(Workbench.java:500)
	at org.eclipse.core.databinding.observable.Realm.runWithDefault(Realm.java:332)
	at org.eclipse.ui.internal.Workbench.createAndRunWorkbench(Workbench.java:493)
	at org.eclipse.ui.PlatformUI.createAndRunWorkbench(PlatformUI.java:149)
	at org.eclipse.ui.internal.ide.application.IDEApplication.start(IDEApplication.java:113)
	at org.eclipse.test.UITestApplication.runApplication(UITestApplication.java:138)
	at org.eclipse.test.UITestApplication.run(UITestApplication.java:60)
	at org.eclipse.test.UITestApplication.start(UITestApplication.java:210)
	at org.eclipse.equinox.internal.app.EclipseAppHandle.run(EclipseAppHandle.java:194)
	at org.eclipse.core.runtime.internal.adaptor.EclipseAppLauncher.runApplication(EclipseAppLauncher.java:110)
	at org.eclipse.core.runtime.internal.adaptor.EclipseAppLauncher.start(EclipseAppLauncher.java:79)
	at org.eclipse.core.runtime.adaptor.EclipseStarter.run(EclipseStarter.java:368)
	at org.eclipse.core.runtime.adaptor.EclipseStarter.run(EclipseStarter.java:179)
	at org.eclipse.equinox.launcher.Main.invokeFramework(Main.java:559)
	at org.eclipse.equinox.launcher.Main.basicRun(Main.java:514)
	at org.eclipse.equinox.launcher.Main.run(Main.java:1311)
	at org.eclipse.equinox.launcher.Main.main(Main.java:1287)
	at org.eclipse.core.launcher.Main.main(Main.java:34)


FAILED:  ESBAllTests

Error Message:
Attribute bus id ref is not found in object Services/myJmsListener/Listeners/HibernateGateway 

Stack Trace:
junit.framework.AssertionFailedError: Attribute bus id ref is not found in object Services/myJmsListener/Listeners/HibernateGateway

	at org.jboss.tools.esb.core.test.ESBModelTest.testHibernateExample(ESBModelTest.java:152)
	at org.eclipse.test.EclipseTestRunner.run(EclipseTestRunner.java:354)
	at org.eclipse.test.EclipseTestRunner.run(EclipseTestRunner.java:206)
	at org.eclipse.test.UITestApplication$3.run(UITestApplication.java:195)
	at org.eclipse.swt.widgets.RunnableLock.run(RunnableLock.java:35)
	at org.eclipse.swt.widgets.Synchronizer.runAsyncMessages(Synchronizer.java:134)
	at org.eclipse.swt.widgets.Display.runAsyncMessages(Display.java:3468)
	at org.eclipse.swt.widgets.Display.readAndDispatch(Display.java:3115)
	at org.eclipse.ui.internal.Workbench.runEventLoop(Workbench.java:2405)
	at org.eclipse.ui.internal.Workbench.runUI(Workbench.java:2369)
	at org.eclipse.ui.internal.Workbench.access$4(Workbench.java:2221)
	at org.eclipse.ui.internal.Workbench$5.run(Workbench.java:500)
	at org.eclipse.core.databinding.observable.Realm.runWithDefault(Realm.java:332)
	at org.eclipse.ui.internal.Workbench.createAndRunWorkbench(Workbench.java:493)
	at org.eclipse.ui.PlatformUI.createAndRunWorkbench(PlatformUI.java:149)
	at org.eclipse.ui.internal.ide.application.IDEApplication.start(IDEApplication.java:113)
	at org.eclipse.test.UITestApplication.runApplication(UITestApplication.java:138)
	at org.eclipse.test.UITestApplication.run(UITestApplication.java:60)
	at org.eclipse.test.UITestApplication.start(UITestApplication.java:210)
	at org.eclipse.equinox.internal.app.EclipseAppHandle.run(EclipseAppHandle.java:194)
	at org.eclipse.core.runtime.internal.adaptor.EclipseAppLauncher.runApplication(EclipseAppLauncher.java:110)
	at org.eclipse.core.runtime.internal.adaptor.EclipseAppLauncher.start(EclipseAppLauncher.java:79)
	at org.eclipse.core.runtime.adaptor.EclipseStarter.run(EclipseStarter.java:368)
	at org.eclipse.core.runtime.adaptor.EclipseStarter.run(EclipseStarter.java:179)
	at org.eclipse.equinox.launcher.Main.invokeFramework(Main.java:559)
	at org.eclipse.equinox.launcher.Main.basicRun(Main.java:514)
	at org.eclipse.equinox.launcher.Main.run(Main.java:1311)
	at org.eclipse.equinox.launcher.Main.main(Main.java:1287)
	at org.eclipse.core.launcher.Main.main(Main.java:34)


FAILED:  ESBAllTests

Error Message:
Attribute bus id ref is not found in object Services/MyWssService/Listeners/Http-Gateway 

Stack Trace:
junit.framework.AssertionFailedError: Attribute bus id ref is not found in object Services/MyWssService/Listeners/Http-Gateway

	at org.jboss.tools.esb.core.test.ESBModelTest.testJBRExample(ESBModelTest.java:181)
	at org.eclipse.test.EclipseTestRunner.run(EclipseTestRunner.java:354)
	at org.eclipse.test.EclipseTestRunner.run(EclipseTestRunner.java:206)
	at org.eclipse.test.UITestApplication$3.run(UITestApplication.java:195)
	at org.eclipse.swt.widgets.RunnableLock.run(RunnableLock.java:35)
	at org.eclipse.swt.widgets.Synchronizer.runAsyncMessages(Synchronizer.java:134)
	at org.eclipse.swt.widgets.Display.runAsyncMessages(Display.java:3468)
	at org.eclipse.swt.widgets.Display.readAndDispatch(Display.java:3115)
	at org.eclipse.ui.internal.Workbench.runEventLoop(Workbench.java:2405)
	at org.eclipse.ui.internal.Workbench.runUI(Workbench.java:2369)
	at org.eclipse.ui.internal.Workbench.access$4(Workbench.java:2221)
	at org.eclipse.ui.internal.Workbench$5.run(Workbench.java:500)
	at org.eclipse.core.databinding.observable.Realm.runWithDefault(Realm.java:332)
	at org.eclipse.ui.internal.Workbench.createAndRunWorkbench(Workbench.java:493)
	at org.eclipse.ui.PlatformUI.createAndRunWorkbench(PlatformUI.java:149)
	at org.eclipse.ui.internal.ide.application.IDEApplication.start(IDEApplication.java:113)
	at org.eclipse.test.UITestApplication.runApplication(UITestApplication.java:138)
	at org.eclipse.test.UITestApplication.run(UITestApplication.java:60)
	at org.eclipse.test.UITestApplication.start(UITestApplication.java:210)
	at org.eclipse.equinox.internal.app.EclipseAppHandle.run(EclipseAppHandle.java:194)
	at org.eclipse.core.runtime.internal.adaptor.EclipseAppLauncher.runApplication(EclipseAppLauncher.java:110)
	at org.eclipse.core.runtime.internal.adaptor.EclipseAppLauncher.start(EclipseAppLauncher.java:79)
	at org.eclipse.core.runtime.adaptor.EclipseStarter.run(EclipseStarter.java:368)
	at org.eclipse.core.runtime.adaptor.EclipseStarter.run(EclipseStarter.java:179)
	at org.eclipse.equinox.launcher.Main.invokeFramework(Main.java:559)
	at org.eclipse.equinox.launcher.Main.basicRun(Main.java:514)
	at org.eclipse.equinox.launcher.Main.run(Main.java:1311)
	at org.eclipse.equinox.launcher.Main.main(Main.java:1287)
	at org.eclipse.core.launcher.Main.main(Main.java:34)


FAILED:  ESBAllTests

Error Message:
Attribute bus id ref is not found in object Services/myFileListener/Listeners/FileGateway 

Stack Trace:
junit.framework.AssertionFailedError: Attribute bus id ref is not found in object Services/myFileListener/Listeners/FileGateway

	at org.jboss.tools.esb.core.test.ESBModelTest.testFSExample(ESBModelTest.java:215)
	at org.eclipse.test.EclipseTestRunner.run(EclipseTestRunner.java:354)
	at org.eclipse.test.EclipseTestRunner.run(EclipseTestRunner.java:206)
	at org.eclipse.test.UITestApplication$3.run(UITestApplication.java:195)
	at org.eclipse.swt.widgets.RunnableLock.run(RunnableLock.java:35)
	at org.eclipse.swt.widgets.Synchronizer.runAsyncMessages(Synchronizer.java:134)
	at org.eclipse.swt.widgets.Display.runAsyncMessages(Display.java:3468)
	at org.eclipse.swt.widgets.Display.readAndDispatch(Display.java:3115)
	at org.eclipse.ui.internal.Workbench.runEventLoop(Workbench.java:2405)
	at org.eclipse.ui.internal.Workbench.runUI(Workbench.java:2369)
	at org.eclipse.ui.internal.Workbench.access$4(Workbench.java:2221)
	at org.eclipse.ui.internal.Workbench$5.run(Workbench.java:500)
	at org.eclipse.core.databinding.observable.Realm.runWithDefault(Realm.java:332)
	at org.eclipse.ui.internal.Workbench.createAndRunWorkbench(Workbench.java:493)
	at org.eclipse.ui.PlatformUI.createAndRunWorkbench(PlatformUI.java:149)
	at org.eclipse.ui.internal.ide.application.IDEApplication.start(IDEApplication.java:113)
	at org.eclipse.test.UITestApplication.runApplication(UITestApplication.java:138)
	at org.eclipse.test.UITestApplication.run(UITestApplication.java:60)
	at org.eclipse.test.UITestApplication.start(UITestApplication.java:210)
	at org.eclipse.equinox.internal.app.EclipseAppHandle.run(EclipseAppHandle.java:194)
	at org.eclipse.core.runtime.internal.adaptor.EclipseAppLauncher.runApplication(EclipseAppLauncher.java:110)
	at org.eclipse.core.runtime.internal.adaptor.EclipseAppLauncher.start(EclipseAppLauncher.java:79)
	at org.eclipse.core.runtime.adaptor.EclipseStarter.run(EclipseStarter.java:368)
	at org.eclipse.core.runtime.adaptor.EclipseStarter.run(EclipseStarter.java:179)
	at org.eclipse.equinox.launcher.Main.invokeFramework(Main.java:559)
	at org.eclipse.equinox.launcher.Main.basicRun(Main.java:514)
	at org.eclipse.equinox.launcher.Main.run(Main.java:1311)
	at org.eclipse.equinox.launcher.Main.main(Main.java:1287)
	at org.eclipse.core.launcher.Main.main(Main.java:34)


FAILED:  ESBAllTests

Error Message:
Attribute bus id ref is not found in object Services/myJmsListener/Listeners/SqlGateway 

Stack Trace:
junit.framework.AssertionFailedError: Attribute bus id ref is not found in object Services/myJmsListener/Listeners/SqlGateway

	at org.jboss.tools.esb.core.test.ESBModelTest.testSQLExample(ESBModelTest.java:250)
	at org.eclipse.test.EclipseTestRunner.run(EclipseTestRunner.java:354)
	at org.eclipse.test.EclipseTestRunner.run(EclipseTestRunner.java:206)
	at org.eclipse.test.UITestApplication$3.run(UITestApplication.java:195)
	at org.eclipse.swt.widgets.RunnableLock.run(RunnableLock.java:35)
	at org.eclipse.swt.widgets.Synchronizer.runAsyncMessages(Synchronizer.java:134)
	at org.eclipse.swt.widgets.Display.runAsyncMessages(Display.java:3468)
	at org.eclipse.swt.widgets.Display.readAndDispatch(Display.java:3115)
	at org.eclipse.ui.internal.Workbench.runEventLoop(Workbench.java:2405)
	at org.eclipse.ui.internal.Workbench.runUI(Workbench.java:2369)
	at org.eclipse.ui.internal.Workbench.access$4(Workbench.java:2221)
	at org.eclipse.ui.internal.Workbench$5.run(Workbench.java:500)
	at org.eclipse.core.databinding.observable.Realm.runWithDefault(Realm.java:332)
	at org.eclipse.ui.internal.Workbench.createAndRunWorkbench(Workbench.java:493)
	at org.eclipse.ui.PlatformUI.createAndRunWorkbench(PlatformUI.java:149)
	at org.eclipse.ui.internal.ide.application.IDEApplication.start(IDEApplication.java:113)
	at org.eclipse.test.UITestApplication.runApplication(UITestApplication.java:138)
	at org.eclipse.test.UITestApplication.run(UITestApplication.java:60)
	at org.eclipse.test.UITestApplication.start(UITestApplication.java:210)
	at org.eclipse.equinox.internal.app.EclipseAppHandle.run(EclipseAppHandle.java:194)
	at org.eclipse.core.runtime.internal.adaptor.EclipseAppLauncher.runApplication(EclipseAppLauncher.java:110)
	at org.eclipse.core.runtime.internal.adaptor.EclipseAppLauncher.start(EclipseAppLauncher.java:79)
	at org.eclipse.core.runtime.adaptor.EclipseStarter.run(EclipseStarter.java:368)
	at org.eclipse.core.runtime.adaptor.EclipseStarter.run(EclipseStarter.java:179)
	at org.eclipse.equinox.launcher.Main.invokeFramework(Main.java:559)
	at org.eclipse.equinox.launcher.Main.basicRun(Main.java:514)
	at org.eclipse.equinox.launcher.Main.run(Main.java:1311)
	at org.eclipse.equinox.launcher.Main.main(Main.java:1287)
	at org.eclipse.core.launcher.Main.main(Main.java:34)


FAILED:  HibernateUiTestSuite

Error Message:
null

Stack Trace:
junit.framework.AssertionFailedError
	at org.jboss.tools.hibernate.ui.diagram.editors.actions.test.ExportImageActionTest.testAction(ExportImageActionTest.java:103)
	at org.eclipse.test.EclipseTestRunner.run(EclipseTestRunner.java:354)
	at org.eclipse.test.EclipseTestRunner.run(EclipseTestRunner.java:206)
	at org.eclipse.test.UITestApplication$3.run(UITestApplication.java:195)
	at org.eclipse.swt.widgets.RunnableLock.run(RunnableLock.java:35)
	at org.eclipse.swt.widgets.Synchronizer.runAsyncMessages(Synchronizer.java:134)
	at org.eclipse.swt.widgets.Display.runAsyncMessages(Display.java:3468)
	at org.eclipse.swt.widgets.Display.readAndDispatch(Display.java:3115)
	at org.eclipse.ui.internal.Workbench.runEventLoop(Workbench.java:2405)
	at org.eclipse.ui.internal.Workbench.runUI(Workbench.java:2369)
	at org.eclipse.ui.internal.Workbench.access$4(Workbench.java:2221)
	at org.eclipse.ui.internal.Workbench$5.run(Workbench.java:500)
	at org.eclipse.core.databinding.observable.Realm.runWithDefault(Realm.java:332)
	at org.eclipse.ui.internal.Workbench.createAndRunWorkbench(Workbench.java:493)
	at org.eclipse.ui.PlatformUI.createAndRunWorkbench(PlatformUI.java:149)
	at org.eclipse.ui.internal.ide.application.IDEApplication.start(IDEApplication.java:113)
	at org.eclipse.test.UITestApplication.runApplication(UITestApplication.java:138)
	at org.eclipse.test.UITestApplication.run(UITestApplication.java:60)
	at org.eclipse.test.UITestApplication.start(UITestApplication.java:210)
	at org.eclipse.equinox.internal.app.EclipseAppHandle.run(EclipseAppHandle.java:194)
	at org.eclipse.core.runtime.internal.adaptor.EclipseAppLauncher.runApplication(EclipseAppLauncher.java:110)
	at org.eclipse.core.runtime.internal.adaptor.EclipseAppLauncher.start(EclipseAppLauncher.java:79)
	at org.eclipse.core.runtime.adaptor.EclipseStarter.run(EclipseStarter.java:368)
	at org.eclipse.core.runtime.adaptor.EclipseStarter.run(EclipseStarter.java:179)
	at org.eclipse.equinox.launcher.Main.invokeFramework(Main.java:559)
	at org.eclipse.equinox.launcher.Main.basicRun(Main.java:514)
	at org.eclipse.equinox.launcher.Main.run(Main.java:1311)
	at org.eclipse.equinox.launcher.Main.main(Main.java:1287)
	at org.eclipse.core.launcher.Main.main(Main.java:34)


FAILED:  SmooksCoreAllTests

Error Message:
Unable to filter InputStream for target profile [org.milyn.profile.Profile#default_profile].

Stack Trace:
org.milyn.SmooksException: Unable to filter InputStream for target profile [org.milyn.profile.Profile#default_profile].
	at org.milyn.delivery.dom.SmooksDOMFilter.filter(SmooksDOMFilter.java:306)
	at org.milyn.delivery.dom.SmooksDOMFilter.doFilter(SmooksDOMFilter.java:250)
	at org.milyn.delivery.dom.SmooksDOMFilter.doFilter(SmooksDOMFilter.java:223)
	at org.milyn.Smooks._filter(Smooks.java:470)
	at org.milyn.Smooks.filterSource(Smooks.java:448)
	at org.milyn.Smooks.filterSource(Smooks.java:422)
	at org.jboss.tools.smooks.configuration.editors.edi.EDIDataParser.parseEDIFile(EDIDataParser.java:249)
	at org.jboss.tools.smooks.configuration.editors.edi.EDIDataParser.parseEDIFile(EDIDataParser.java:207)
	at org.jboss.tools.smooks.configuration.editors.edi.EDIDataParser.parseEDIFile(EDIDataParser.java:197)
	at org.jboss.tools.smooks.configuration.editors.edi.EDIDataParser.parseEDIFile(EDIDataParser.java:146)
	at org.jboss.tools.smooks.test.ediparser.EDIParserTest.testEDIParser(EDIParserTest.java:69)
	at org.eclipse.test.EclipseTestRunner.run(EclipseTestRunner.java:354)
	at org.eclipse.test.EclipseTestRunner.run(EclipseTestRunner.java:206)
	at org.eclipse.test.CoreTestApplication.runTests(CoreTestApplication.java:35)
	at org.eclipse.test.CoreTestApplication.run(CoreTestApplication.java:31)
	at org.eclipse.equinox.internal.app.EclipseAppContainer.callMethodWithException(EclipseAppContainer.java:574)
	at org.eclipse.equinox.internal.app.EclipseAppHandle.run(EclipseAppHandle.java:196)
	at org.eclipse.equinox.internal.app.MainApplicationLauncher.run(MainApplicationLauncher.java:32)
	at org.eclipse.core.runtime.internal.adaptor.EclipseAppLauncher.runApplication(EclipseAppLauncher.java:110)
	at org.eclipse.core.runtime.internal.adaptor.EclipseAppLauncher.start(EclipseAppLauncher.java:79)
	at org.eclipse.core.runtime.adaptor.EclipseStarter.run(EclipseStarter.java:368)
	at org.eclipse.core.runtime.adaptor.EclipseStarter.run(EclipseStarter.java:179)
	at org.eclipse.equinox.launcher.Main.invokeFramework(Main.java:559)
	at org.eclipse.equinox.launcher.Main.basicRun(Main.java:514)
	at org.eclipse.equinox.launcher.Main.run(Main.java:1311)
	at org.eclipse.equinox.launcher.Main.main(Main.java:1287)
	at org.eclipse.core.launcher.Main.main(Main.java:34)
Caused by: java.lang.IllegalStateException: Invalid EDI mapping model config specified for org.milyn.smooks.edi.EDIReader.  Unable to access URI based mapping model [/org/jboss/tools/smooks/test/ediparser/edi-to-xml-order-mapping.xml].  Target Profile(s) [org.milyn.profile.profile#default_profile].
	at org.milyn.smooks.edi.EDIReader.getMappingConfigData(EDIReader.java:204)
	at org.milyn.smooks.edi.EDIReader.getMappingModel(EDIReader.java:142)
	at org.milyn.smooks.edi.EDIReader.parse(EDIReader.java:110)
	at org.milyn.delivery.dom.DOMParser.parse(DOMParser.java:120)
	at org.milyn.delivery.dom.DOMParser.parse(DOMParser.java:88)
	at org.milyn.delivery.dom.SmooksDOMFilter.filter(SmooksDOMFilter.java:302)
Caused by: java.io.IOException: Failed to access data stream for resource [/org/jboss/tools/smooks/test/ediparser/edi-to-xml-order-mapping.xml]. Tried filesystem, classpath and URL.
	at org.milyn.resource.URIResourceLocator.getResource(URIResourceLocator.java:123)
	at org.milyn.resource.URIResourceLocator.getResource(URIResourceLocator.java:82)
	at org.milyn.smooks.edi.EDIReader.getMappingConfigData(EDIReader.java:195)


FAILED:  <init>

Error Message:
Class not found "org.jboss.tools.tests.ToolsAllTests"

Stack Trace:
org.eclipse.test.EclipseTestRunner$TestFailedException: Class not found "org.jboss.tools.tests.ToolsAllTests"
	at org.eclipse.test.EclipseTestRunner.runFailed(EclipseTestRunner.java:283)
	at org.eclipse.test.EclipseTestRunner.getTest(EclipseTestRunner.java:245)
	at org.eclipse.test.EclipseTestRunner.<init>(EclipseTestRunner.java:220)
	at org.eclipse.test.EclipseTestRunner.run(EclipseTestRunner.java:204)
	at org.eclipse.test.UITestApplication$3.run(UITestApplication.java:195)
	at org.eclipse.swt.widgets.RunnableLock.run(RunnableLock.java:35)
	at org.eclipse.swt.widgets.Synchronizer.runAsyncMessages(Synchronizer.java:134)
	at org.eclipse.swt.widgets.Display.runAsyncMessages(Display.java:3468)
	at org.eclipse.swt.widgets.Display.readAndDispatch(Display.java:3115)
	at org.eclipse.ui.internal.Workbench.runEventLoop(Workbench.java:2405)
	at org.eclipse.ui.internal.Workbench.runUI(Workbench.java:2369)
	at org.eclipse.ui.internal.Workbench.access$4(Workbench.java:2221)
	at org.eclipse.ui.internal.Workbench$5.run(Workbench.java:500)
	at org.eclipse.core.databinding.observable.Realm.runWithDefault(Realm.java:332)
	at org.eclipse.ui.internal.Workbench.createAndRunWorkbench(Workbench.java:493)
	at org.eclipse.ui.PlatformUI.createAndRunWorkbench(PlatformUI.java:149)
	at org.eclipse.ui.internal.ide.application.IDEApplication.start(IDEApplication.java:113)
	at org.eclipse.test.UITestApplication.runApplication(UITestApplication.java:138)
	at org.eclipse.test.UITestApplication.run(UITestApplication.java:60)
	at org.eclipse.test.UITestApplication.start(UITestApplication.java:210)
	at org.eclipse.equinox.internal.app.EclipseAppHandle.run(EclipseAppHandle.java:194)
	at org.eclipse.core.runtime.internal.adaptor.EclipseAppLauncher.runApplication(EclipseAppLauncher.java:110)
	at org.eclipse.core.runtime.internal.adaptor.EclipseAppLauncher.start(EclipseAppLauncher.java:79)
	at org.eclipse.core.runtime.adaptor.EclipseStarter.run(EclipseStarter.java:368)
	at org.eclipse.core.runtime.adaptor.EclipseStarter.run(EclipseStarter.java:179)
	at org.eclipse.equinox.launcher.Main.invokeFramework(Main.java:559)
	at org.eclipse.equinox.launcher.Main.basicRun(Main.java:514)
	at org.eclipse.equinox.launcher.Main.run(Main.java:1311)
	at org.eclipse.equinox.launcher.Main.main(Main.java:1287)
	at org.eclipse.core.launcher.Main.main(Main.java:34)




--------------------------------------------------

Changes:

[ge0ffrey] pas: 12 & 13 are now initializable

[ge0ffrey] pas: requiredPatientEquipment

[ge0ffrey] pas: departmentMiminumAge & departmentMaxinumAge

[ge0ffrey] pas: move rules around

[ge0ffrey] pas: femaleInMaleRoom & maleInFemaleRoom

[ge0ffrey] Official spec: if equipment is required then a duplicate preffered constraint should be ignored



--------------------------------------------------

Console log:

[...truncated 160705 lines...]
    [style] Warning: the task name <style> is deprecated. Use <xslt> instead.
    [style] Processing /qa/hudson_ws/workspace/jbosstools-nightly-3.1.0.M4/jbds-build/3.1.0.M4/200909061201/logInfo.xml to /qa/hudson_ws/workspace/jbosstools-nightly-3.1.0.M4/jbds-build/3.1.0.M4/200909061201/logInfo/jmx-warnings.html
    [style] Loading stylesheet /qa/hudson_ws/workspace/jbosstools-nightly-3.1.0.M4/org.jboss.ide.eclipse.releng/builders/product/buildResults/logInfo-builder.xsl
    [style] Warning: the task name <style> is deprecated. Use <xslt> instead.
    [style] Processing /qa/hudson_ws/workspace/jbosstools-nightly-3.1.0.M4/jbds-build/3.1.0.M4/200909061201/logInfo.xml to /qa/hudson_ws/workspace/jbosstools-nightly-3.1.0.M4/jbds-build/3.1.0.M4/200909061201/logInfo/drools-ide-errors.html
    [style] Loading stylesheet /qa/hudson_ws/workspace/jbosstools-nightly-3.1.0.M4/org.jboss.ide.eclipse.releng/builders/product/buildResults/logInfo-builder.xsl
    [style] Warning: the task name <style> is deprecated. Use <xslt> instead.
    [style] Processing /qa/hudson_ws/workspace/jbosstools-nightly-3.1.0.M4/jbds-build/3.1.0.M4/200909061201/logInfo.xml to /qa/hudson_ws/workspace/jbosstools-nightly-3.1.0.M4/jbds-build/3.1.0.M4/200909061201/logInfo/drools-ide-warnings.html
    [style] Loading stylesheet /qa/hudson_ws/workspace/jbosstools-nightly-3.1.0.M4/org.jboss.ide.eclipse.releng/builders/product/buildResults/logInfo-builder.xsl
    [style] Warning: the task name <style> is deprecated. Use <xslt> instead.
    [style] Processing /qa/hudson_ws/workspace/jbosstools-nightly-3.1.0.M4/jbds-build/3.1.0.M4/200909061201/logInfo.xml to /qa/hudson_ws/workspace/jbosstools-nightly-3.1.0.M4/jbds-build/3.1.0.M4/200909061201/logInfo/archives-errors.html
    [style] Loading stylesheet /qa/hudson_ws/workspace/jbosstools-nightly-3.1.0.M4/org.jboss.ide.eclipse.releng/builders/product/buildResults/logInfo-builder.xsl
    [style] Warning: the task name <style> is deprecated. Use <xslt> instead.
    [style] Processing /qa/hudson_ws/workspace/jbosstools-nightly-3.1.0.M4/jbds-build/3.1.0.M4/200909061201/logInfo.xml to /qa/hudson_ws/workspace/jbosstools-nightly-3.1.0.M4/jbds-build/3.1.0.M4/200909061201/logInfo/archives-warnings.html
    [style] Loading stylesheet /qa/hudson_ws/workspace/jbosstools-nightly-3.1.0.M4/org.jboss.ide.eclipse.releng/builders/product/buildResults/logInfo-builder.xsl
    [style] Warning: the task name <style> is deprecated. Use <xslt> instead.
    [style] Processing /qa/hudson_ws/workspace/jbosstools-nightly-3.1.0.M4/jbds-build/3.1.0.M4/200909061201/logInfo.xml to /qa/hudson_ws/workspace/jbosstools-nightly-3.1.0.M4/jbds-build/3.1.0.M4/200909061201/logInfo/xulrunner-errors.html
    [style] Loading stylesheet /qa/hudson_ws/workspace/jbosstools-nightly-3.1.0.M4/org.jboss.ide.eclipse.releng/builders/product/buildResults/logInfo-builder.xsl
    [style] Warning: the task name <style> is deprecated. Use <xslt> instead.
    [style] Processing /qa/hudson_ws/workspace/jbosstools-nightly-3.1.0.M4/jbds-build/3.1.0.M4/200909061201/logInfo.xml to /qa/hudson_ws/workspace/jbosstools-nightly-3.1.0.M4/jbds-build/3.1.0.M4/200909061201/logInfo/xulrunner-warnings.html
    [style] Loading stylesheet /qa/hudson_ws/workspace/jbosstools-nightly-3.1.0.M4/org.jboss.ide.eclipse.releng/builders/product/buildResults/logInfo-builder.xsl
    [style] Warning: the task name <style> is deprecated. Use <xslt> instead.
    [style] Processing /qa/hudson_ws/workspace/jbosstools-nightly-3.1.0.M4/jbds-build/3.1.0.M4/200909061201/logInfo.xml to /qa/hudson_ws/workspace/jbosstools-nightly-3.1.0.M4/jbds-build/3.1.0.M4/200909061201/logInfo/richfaces-errors.html
    [style] Loading stylesheet /qa/hudson_ws/workspace/jbosstools-nightly-3.1.0.M4/org.jboss.ide.eclipse.releng/builders/product/buildResults/logInfo-builder.xsl
    [style] Warning: the task name <style> is deprecated. Use <xslt> instead.
    [style] Processing /qa/hudson_ws/workspace/jbosstools-nightly-3.1.0.M4/jbds-build/3.1.0.M4/200909061201/logInfo.xml to /qa/hudson_ws/workspace/jbosstools-nightly-3.1.0.M4/jbds-build/3.1.0.M4/200909061201/logInfo/richfaces-warnings.html
    [style] Loading stylesheet /qa/hudson_ws/workspace/jbosstools-nightly-3.1.0.M4/org.jboss.ide.eclipse.releng/builders/product/buildResults/logInfo-builder.xsl
    [style] Warning: the task name <style> is deprecated. Use <xslt> instead.
    [style] Processing /qa/hudson_ws/workspace/jbosstools-nightly-3.1.0.M4/jbds-build/3.1.0.M4/200909061201/logInfo.xml to /qa/hudson_ws/workspace/jbosstools-nightly-3.1.0.M4/jbds-build/3.1.0.M4/200909061201/logInfo/jbpm-convert-errors.html
    [style] Loading stylesheet /qa/hudson_ws/workspace/jbosstools-nightly-3.1.0.M4/org.jboss.ide.eclipse.releng/builders/product/buildResults/logInfo-builder.xsl
    [style] Warning: the task name <style> is deprecated. Use <xslt> instead.
    [style] Processing /qa/hudson_ws/workspace/jbosstools-nightly-3.1.0.M4/jbds-build/3.1.0.M4/200909061201/logInfo.xml to /qa/hudson_ws/workspace/jbosstools-nightly-3.1.0.M4/jbds-build/3.1.0.M4/200909061201/logInfo/jbpm-convert-warnings.html
    [style] Loading stylesheet /qa/hudson_ws/workspace/jbosstools-nightly-3.1.0.M4/org.jboss.ide.eclipse.releng/builders/product/buildResults/logInfo-builder.xsl
    [style] Warning: the task name <style> is deprecated. Use <xslt> instead.
    [style] Processing /qa/hudson_ws/workspace/jbosstools-nightly-3.1.0.M4/jbds-build/3.1.0.M4/200909061201/logInfo.xml to /qa/hudson_ws/workspace/jbosstools-nightly-3.1.0.M4/jbds-build/3.1.0.M4/200909061201/logInfo/freemarker-errors.html
    [style] Loading stylesheet /qa/hudson_ws/workspace/jbosstools-nightly-3.1.0.M4/org.jboss.ide.eclipse.releng/builders/product/buildResults/logInfo-builder.xsl
    [style] Warning: the task name <style> is deprecated. Use <xslt> instead.
    [style] Processing /qa/hudson_ws/workspace/jbosstools-nightly-3.1.0.M4/jbds-build/3.1.0.M4/200909061201/logInfo.xml to /qa/hudson_ws/workspace/jbosstools-nightly-3.1.0.M4/jbds-build/3.1.0.M4/200909061201/logInfo/freemarker-warnings.html
    [style] Loading stylesheet /qa/hudson_ws/workspace/jbosstools-nightly-3.1.0.M4/org.jboss.ide.eclipse.releng/builders/product/buildResults/logInfo-builder.xsl
    [style] Warning: the task name <style> is deprecated. Use <xslt> instead.
    [style] Processing /qa/hudson_ws/workspace/jbosstools-nightly-3.1.0.M4/jbds-build/3.1.0.M4/200909061201/logInfo.xml to /qa/hudson_ws/workspace/jbosstools-nightly-3.1.0.M4/jbds-build/3.1.0.M4/200909061201/logInfo/hibernate-tools-errors.html
    [style] Loading stylesheet /qa/hudson_ws/workspace/jbosstools-nightly-3.1.0.M4/org.jboss.ide.eclipse.releng/builders/product/buildResults/logInfo-builder.xsl
    [style] Warning: the task name <style> is deprecated. Use <xslt> instead.
    [style] Processing /qa/hudson_ws/workspace/jbosstools-nightly-3.1.0.M4/jbds-build/3.1.0.M4/200909061201/logInfo.xml to /qa/hudson_ws/workspace/jbosstools-nightly-3.1.0.M4/jbds-build/3.1.0.M4/200909061201/logInfo/hibernate-tools-warnings.html
    [style] Loading stylesheet /qa/hudson_ws/workspace/jbosstools-nightly-3.1.0.M4/org.jboss.ide.eclipse.releng/builders/product/buildResults/logInfo-builder.xsl
    [style] Warning: the task name <style> is deprecated. Use <xslt> instead.
    [style] Processing /qa/hudson_ws/workspace/jbosstools-nightly-3.1.0.M4/jbds-build/3.1.0.M4/200909061201/logInfo.xml to /qa/hudson_ws/workspace/jbosstools-nightly-3.1.0.M4/jbds-build/3.1.0.M4/200909061201/logInfo/struts-errors.html
    [style] Loading stylesheet /qa/hudson_ws/workspace/jbosstools-nightly-3.1.0.M4/org.jboss.ide.eclipse.releng/builders/product/buildResults/logInfo-builder.xsl
    [style] Warning: the task name <style> is deprecated. Use <xslt> instead.
    [style] Processing /qa/hudson_ws/workspace/jbosstools-nightly-3.1.0.M4/jbds-build/3.1.0.M4/200909061201/logInfo.xml to /qa/hudson_ws/workspace/jbosstools-nightly-3.1.0.M4/jbds-build/3.1.0.M4/200909061201/logInfo/struts-warnings.html
    [style] Loading stylesheet /qa/hudson_ws/workspace/jbosstools-nightly-3.1.0.M4/org.jboss.ide.eclipse.releng/builders/product/buildResults/logInfo-builder.xsl
    [style] Warning: the task name <style> is deprecated. Use <xslt> instead.
    [style] Processing /qa/hudson_ws/workspace/jbosstools-nightly-3.1.0.M4/jbds-build/3.1.0.M4/200909061201/logInfo.xml to /qa/hudson_ws/workspace/jbosstools-nightly-3.1.0.M4/jbds-build/3.1.0.M4/200909061201/logInfo/jbpm-errors.html
    [style] Loading stylesheet /qa/hudson_ws/workspace/jbosstools-nightly-3.1.0.M4/org.jboss.ide.eclipse.releng/builders/product/buildResults/logInfo-builder.xsl
    [style] Warning: the task name <style> is deprecated. Use <xslt> instead.
    [style] Processing /qa/hudson_ws/workspace/jbosstools-nightly-3.1.0.M4/jbds-build/3.1.0.M4/200909061201/logInfo.xml to /qa/hudson_ws/workspace/jbosstools-nightly-3.1.0.M4/jbds-build/3.1.0.M4/200909061201/logInfo/jbpm-warnings.html
    [style] Loading stylesheet /qa/hudson_ws/workspace/jbosstools-nightly-3.1.0.M4/org.jboss.ide.eclipse.releng/builders/product/buildResults/logInfo-builder.xsl
    [style] Warning: the task name <style> is deprecated. Use <xslt> instead.
    [style] Processing /qa/hudson_ws/workspace/jbosstools-nightly-3.1.0.M4/jbds-build/3.1.0.M4/200909061201/logInfo.xml to /qa/hudson_ws/workspace/jbosstools-nightly-3.1.0.M4/jbds-build/3.1.0.M4/200909061201/logInfo/jbpm4-errors.html
    [style] Loading stylesheet /qa/hudson_ws/workspace/jbosstools-nightly-3.1.0.M4/org.jboss.ide.eclipse.releng/builders/product/buildResults/logInfo-builder.xsl
    [style] Warning: the task name <style> is deprecated. Use <xslt> instead.
    [style] Processing /qa/hudson_ws/workspace/jbosstools-nightly-3.1.0.M4/jbds-build/3.1.0.M4/200909061201/logInfo.xml to /qa/hudson_ws/workspace/jbosstools-nightly-3.1.0.M4/jbds-build/3.1.0.M4/200909061201/logInfo/jbpm4-warnings.html
    [style] Loading stylesheet /qa/hudson_ws/workspace/jbosstools-nightly-3.1.0.M4/org.jboss.ide.eclipse.releng/builders/product/buildResults/logInfo-builder.xsl
    [style] Warning: the task name <style> is deprecated. Use <xslt> instead.
    [style] Processing /qa/hudson_ws/workspace/jbosstools-nightly-3.1.0.M4/jbds-build/3.1.0.M4/200909061201/logInfo.xml to /qa/hudson_ws/workspace/jbosstools-nightly-3.1.0.M4/jbds-build/3.1.0.M4/200909061201/logInfo/as-errors.html
    [style] Loading stylesheet /qa/hudson_ws/workspace/jbosstools-nightly-3.1.0.M4/org.jboss.ide.eclipse.releng/builders/product/buildResults/logInfo-builder.xsl
    [style] Warning: the task name <style> is deprecated. Use <xslt> instead.
    [style] Processing /qa/hudson_ws/workspace/jbosstools-nightly-3.1.0.M4/jbds-build/3.1.0.M4/200909061201/logInfo.xml to /qa/hudson_ws/workspace/jbosstools-nightly-3.1.0.M4/jbds-build/3.1.0.M4/200909061201/logInfo/as-warnings.html
    [style] Loading stylesheet /qa/hudson_ws/workspace/jbosstools-nightly-3.1.0.M4/org.jboss.ide.eclipse.releng/builders/product/buildResults/logInfo-builder.xsl
    [style] Warning: the task name <style> is deprecated. Use <xslt> instead.
    [style] Processing /qa/hudson_ws/workspace/jbosstools-nightly-3.1.0.M4/jbds-build/3.1.0.M4/200909061201/logInfo.xml to /qa/hudson_ws/workspace/jbosstools-nightly-3.1.0.M4/jbds-build/3.1.0.M4/200909061201/logInfo/bpel-errors.html
    [style] Loading stylesheet /qa/hudson_ws/workspace/jbosstools-nightly-3.1.0.M4/org.jboss.ide.eclipse.releng/builders/product/buildResults/logInfo-builder.xsl
    [style] Warning: the task name <style> is deprecated. Use <xslt> instead.
    [style] Processing /qa/hudson_ws/workspace/jbosstools-nightly-3.1.0.M4/jbds-build/3.1.0.M4/200909061201/logInfo.xml to /qa/hudson_ws/workspace/jbosstools-nightly-3.1.0.M4/jbds-build/3.1.0.M4/200909061201/logInfo/bpel-warnings.html
    [style] Loading stylesheet /qa/hudson_ws/workspace/jbosstools-nightly-3.1.0.M4/org.jboss.ide.eclipse.releng/builders/product/buildResults/logInfo-builder.xsl
    [style] Warning: the task name <style> is deprecated. Use <xslt> instead.
    [style] Processing /qa/hudson_ws/workspace/jbosstools-nightly-3.1.0.M4/jbds-build/3.1.0.M4/200909061201/logInfo.xml to /qa/hudson_ws/workspace/jbosstools-nightly-3.1.0.M4/jbds-build/3.1.0.M4/200909061201/logInfo/seam-errors.html
    [style] Loading stylesheet /qa/hudson_ws/workspace/jbosstools-nightly-3.1.0.M4/org.jboss.ide.eclipse.releng/builders/product/buildResults/logInfo-builder.xsl
    [style] Warning: the task name <style> is deprecated. Use <xslt> instead.
    [style] Processing /qa/hudson_ws/workspace/jbosstools-nightly-3.1.0.M4/jbds-build/3.1.0.M4/200909061201/logInfo.xml to /qa/hudson_ws/workspace/jbosstools-nightly-3.1.0.M4/jbds-build/3.1.0.M4/200909061201/logInfo/seam-warnings.html
    [style] Loading stylesheet /qa/hudson_ws/workspace/jbosstools-nightly-3.1.0.M4/org.jboss.ide.eclipse.releng/builders/product/buildResults/logInfo-builder.xsl
    [style] Warning: the task name <style> is deprecated. Use <xslt> instead.
    [style] Processing /qa/hudson_ws/workspace/jbosstools-nightly-3.1.0.M4/jbds-build/3.1.0.M4/200909061201/logInfo.xml to /qa/hudson_ws/workspace/jbosstools-nightly-3.1.0.M4/jbds-build/3.1.0.M4/200909061201/logInfo/maven-errors.html
    [style] Loading stylesheet /qa/hudson_ws/workspace/jbosstools-nightly-3.1.0.M4/org.jboss.ide.eclipse.releng/builders/product/buildResults/logInfo-builder.xsl
    [style] Warning: the task name <style> is deprecated. Use <xslt> instead.
    [style] Processing /qa/hudson_ws/workspace/jbosstools-nightly-3.1.0.M4/jbds-build/3.1.0.M4/200909061201/logInfo.xml to /qa/hudson_ws/workspace/jbosstools-nightly-3.1.0.M4/jbds-build/3.1.0.M4/200909061201/logInfo/maven-warnings.html
    [style] Loading stylesheet /qa/hudson_ws/workspace/jbosstools-nightly-3.1.0.M4/org.jboss.ide.eclipse.releng/builders/product/buildResults/logInfo-builder.xsl
    [style] Warning: the task name <style> is deprecated. Use <xslt> instead.
    [style] Processing /qa/hudson_ws/workspace/jbosstools-nightly-3.1.0.M4/jbds-build/3.1.0.M4/200909061201/logInfo.xml to /qa/hudson_ws/workspace/jbosstools-nightly-3.1.0.M4/jbds-build/3.1.0.M4/200909061201/logInfo/examples-errors.html
    [style] Loading stylesheet /qa/hudson_ws/workspace/jbosstools-nightly-3.1.0.M4/org.jboss.ide.eclipse.releng/builders/product/buildResults/logInfo-builder.xsl
    [style] Warning: the task name <style> is deprecated. Use <xslt> instead.
    [style] Processing /qa/hudson_ws/workspace/jbosstools-nightly-3.1.0.M4/jbds-build/3.1.0.M4/200909061201/logInfo.xml to /qa/hudson_ws/workspace/jbosstools-nightly-3.1.0.M4/jbds-build/3.1.0.M4/200909061201/logInfo/examples-warnings.html
    [style] Loading stylesheet /qa/hudson_ws/workspace/jbosstools-nightly-3.1.0.M4/org.jboss.ide.eclipse.releng/builders/product/buildResults/logInfo-builder.xsl
    [style] Warning: the task name <style> is deprecated. Use <xslt> instead.
    [style] Processing /qa/hudson_ws/workspace/jbosstools-nightly-3.1.0.M4/jbds-build/3.1.0.M4/200909061201/logInfo.xml to /qa/hudson_ws/workspace/jbosstools-nightly-3.1.0.M4/jbds-build/3.1.0.M4/200909061201/logInfo/esb-errors.html
    [style] Loading stylesheet /qa/hudson_ws/workspace/jbosstools-nightly-3.1.0.M4/org.jboss.ide.eclipse.releng/builders/product/buildResults/logInfo-builder.xsl
    [style] Warning: the task name <style> is deprecated. Use <xslt> instead.
    [style] Processing /qa/hudson_ws/workspace/jbosstools-nightly-3.1.0.M4/jbds-build/3.1.0.M4/200909061201/logInfo.xml to /qa/hudson_ws/workspace/jbosstools-nightly-3.1.0.M4/jbds-build/3.1.0.M4/200909061201/logInfo/esb-warnings.html
    [style] Loading stylesheet /qa/hudson_ws/workspace/jbosstools-nightly-3.1.0.M4/org.jboss.ide.eclipse.releng/builders/product/buildResults/logInfo-builder.xsl
    [style] Warning: the task name <style> is deprecated. Use <xslt> instead.
    [style] Processing /qa/hudson_ws/workspace/jbosstools-nightly-3.1.0.M4/jbds-build/3.1.0.M4/200909061201/logInfo.xml to /qa/hudson_ws/workspace/jbosstools-nightly-3.1.0.M4/jbds-build/3.1.0.M4/200909061201/logInfo/ws-errors.html
    [style] Loading stylesheet /qa/hudson_ws/workspace/jbosstools-nightly-3.1.0.M4/org.jboss.ide.eclipse.releng/builders/product/buildResults/logInfo-builder.xsl
    [style] Warning: the task name <style> is deprecated. Use <xslt> instead.
    [style] Processing /qa/hudson_ws/workspace/jbosstools-nightly-3.1.0.M4/jbds-build/3.1.0.M4/200909061201/logInfo.xml to /qa/hudson_ws/workspace/jbosstools-nightly-3.1.0.M4/jbds-build/3.1.0.M4/200909061201/logInfo/ws-warnings.html
    [style] Loading stylesheet /qa/hudson_ws/workspace/jbosstools-nightly-3.1.0.M4/org.jboss.ide.eclipse.releng/builders/product/buildResults/logInfo-builder.xsl
    [style] Warning: the task name <style> is deprecated. Use <xslt> instead.
    [style] Processing /qa/hudson_ws/workspace/jbosstools-nightly-3.1.0.M4/jbds-build/3.1.0.M4/200909061201/logInfo.xml to /qa/hudson_ws/workspace/jbosstools-nightly-3.1.0.M4/jbds-build/3.1.0.M4/200909061201/logInfo/birt-errors.html
    [style] Loading stylesheet /qa/hudson_ws/workspace/jbosstools-nightly-3.1.0.M4/org.jboss.ide.eclipse.releng/builders/product/buildResults/logInfo-builder.xsl
    [style] Warning: the task name <style> is deprecated. Use <xslt> instead.
    [style] Processing /qa/hudson_ws/workspace/jbosstools-nightly-3.1.0.M4/jbds-build/3.1.0.M4/200909061201/logInfo.xml to /qa/hudson_ws/workspace/jbosstools-nightly-3.1.0.M4/jbds-build/3.1.0.M4/200909061201/logInfo/birt-warnings.html
    [style] Loading stylesheet /qa/hudson_ws/workspace/jbosstools-nightly-3.1.0.M4/org.jboss.ide.eclipse.releng/builders/product/buildResults/logInfo-builder.xsl
    [style] Warning: the task name <style> is deprecated. Use <xslt> instead.
    [style] Processing /qa/hudson_ws/workspace/jbosstools-nightly-3.1.0.M4/jbds-build/3.1.0.M4/200909061201/logInfo.xml to /qa/hudson_ws/workspace/jbosstools-nightly-3.1.0.M4/jbds-build/3.1.0.M4/200909061201/logInfo/portlet-errors.html
    [style] Loading stylesheet /qa/hudson_ws/workspace/jbosstools-nightly-3.1.0.M4/org.jboss.ide.eclipse.releng/builders/product/buildResults/logInfo-builder.xsl
    [style] Warning: the task name <style> is deprecated. Use <xslt> instead.
    [style] Processing /qa/hudson_ws/workspace/jbosstools-nightly-3.1.0.M4/jbds-build/3.1.0.M4/200909061201/logInfo.xml to /qa/hudson_ws/workspace/jbosstools-nightly-3.1.0.M4/jbds-build/3.1.0.M4/200909061201/logInfo/portlet-warnings.html
    [style] Loading stylesheet /qa/hudson_ws/workspace/jbosstools-nightly-3.1.0.M4/org.jboss.ide.eclipse.releng/builders/product/buildResults/logInfo-builder.xsl
    [style] Warning: the task name <style> is deprecated. Use <xslt> instead.
    [style] Processing /qa/hudson_ws/workspace/jbosstools-nightly-3.1.0.M4/jbds-build/3.1.0.M4/200909061201/logInfo.xml to /qa/hudson_ws/workspace/jbosstools-nightly-3.1.0.M4/jbds-build/3.1.0.M4/200909061201/logInfo/smooks-errors.html
    [style] Loading stylesheet /qa/hudson_ws/workspace/jbosstools-nightly-3.1.0.M4/org.jboss.ide.eclipse.releng/builders/product/buildResults/logInfo-builder.xsl
    [style] Warning: the task name <style> is deprecated. Use <xslt> instead.
    [style] Processing /qa/hudson_ws/workspace/jbosstools-nightly-3.1.0.M4/jbds-build/3.1.0.M4/200909061201/logInfo.xml to /qa/hudson_ws/workspace/jbosstools-nightly-3.1.0.M4/jbds-build/3.1.0.M4/200909061201/logInfo/smooks-warnings.html
    [style] Loading stylesheet /qa/hudson_ws/workspace/jbosstools-nightly-3.1.0.M4/org.jboss.ide.eclipse.releng/builders/product/buildResults/logInfo-builder.xsl
    [style] Warning: the task name <style> is deprecated. Use <xslt> instead.
    [style] Processing /qa/hudson_ws/workspace/jbosstools-nightly-3.1.0.M4/jbds-build/3.1.0.M4/200909061201/logInfo.xml to /qa/hudson_ws/workspace/jbosstools-nightly-3.1.0.M4/jbds-build/3.1.0.M4/200909061201/logInfo/tptp-errors.html
    [style] Loading stylesheet /qa/hudson_ws/workspace/jbosstools-nightly-3.1.0.M4/org.jboss.ide.eclipse.releng/builders/product/buildResults/logInfo-builder.xsl
    [style] Warning: the task name <style> is deprecated. Use <xslt> instead.
    [style] Processing /qa/hudson_ws/workspace/jbosstools-nightly-3.1.0.M4/jbds-build/3.1.0.M4/200909061201/logInfo.xml to /qa/hudson_ws/workspace/jbosstools-nightly-3.1.0.M4/jbds-build/3.1.0.M4/200909061201/logInfo/tptp-warnings.html
    [style] Loading stylesheet /qa/hudson_ws/workspace/jbosstools-nightly-3.1.0.M4/org.jboss.ide.eclipse.releng/builders/product/buildResults/logInfo-builder.xsl
    [style] Warning: the task name <style> is deprecated. Use <xslt> instead.
    [style] Processing /qa/hudson_ws/workspace/jbosstools-nightly-3.1.0.M4/jbds-build/3.1.0.M4/200909061201/logInfo.xml to /qa/hudson_ws/workspace/jbosstools-nightly-3.1.0.M4/jbds-build/3.1.0.M4/200909061201/logInfo/tests-errors.html
    [style] Loading stylesheet /qa/hudson_ws/workspace/jbosstools-nightly-3.1.0.M4/org.jboss.ide.eclipse.releng/builders/product/buildResults/logInfo-builder.xsl
    [style] Warning: the task name <style> is deprecated. Use <xslt> instead.
    [style] Processing /qa/hudson_ws/workspace/jbosstools-nightly-3.1.0.M4/jbds-build/3.1.0.M4/200909061201/logInfo.xml to /qa/hudson_ws/workspace/jbosstools-nightly-3.1.0.M4/jbds-build/3.1.0.M4/200909061201/logInfo/tests-warnings.html
    [style] Loading stylesheet /qa/hudson_ws/workspace/jbosstools-nightly-3.1.0.M4/org.jboss.ide.eclipse.releng/builders/product/buildResults/logInfo-builder.xsl

update.builds.xml:

build.results:
     [copy] Copying 1 file to /qa/hudson_ws/workspace/jbosstools-nightly-3.1.0.M4/jbds-build/3.1.0.M4/200909061201
     [copy] Copying 1 file to /qa/hudson_ws/workspace/jbosstools-nightly-3.1.0.M4/jbds-build
     [copy] Copying 1 file to /qa/hudson_ws/workspace/jbosstools-nightly-3.1.0.M4/org.jboss.ide.eclipse.releng/builders/product
     [copy] Copying 1 file to /qa/hudson_ws/workspace/jbosstools-nightly-3.1.0.M4/jbds-build/3.1.0.M4/200909061201
     [copy] Copying 42 files to /qa/hudson_ws/workspace/jbosstools-nightly-3.1.0.M4/jbds-build/3.1.0.M4/200909061201/images
     [copy] Copying 4 files to /qa/hudson_ws/workspace/jbosstools-nightly-3.1.0.M4/jbds-build/3.1.0.M4/200909061201/script
     [copy] Copying 1 file to /qa/hudson_ws/workspace/jbosstools-nightly-3.1.0.M4/jbds-build/3.1.0.M4/200909061201
     [xslt] Processing /qa/hudson_ws/workspace/jbosstools-nightly-3.1.0.M4/jbds-build/3.1.0.M4/200909061201/download.xml to /qa/hudson_ws/workspace/jbosstools-nightly-3.1.0.M4/jbds-build/3.1.0.M4/200909061201/download-snippet.txt
     [xslt] Loading stylesheet /qa/hudson_ws/workspace/jbosstools-nightly-3.1.0.M4/org.jboss.ide.eclipse.releng/builders/product/buildResults/download.xsl

post-build:

publish.results:

send.notification.email:
     [mail] Failed to initialise MIME mail: javax/mail/MessagingException

publish.log:

init:

clean.all.subfolders:

BUILD SUCCESSFUL
Total time: 188 minutes 33 seconds
++ buildTypeString=nightly
++ buildResult=0
++ cd ../configs/jbds
++ zip build.log.zip build.log
updating: build.log (deflated 95%)
++ cd ../..
+++ date +%s
++ endtime=1252264375
+++ echo 'scale=2; (1252264375 - 1252253020)/60'
+++ bc -l
++ elapsed=189.25
++ echo 'Elapsed time: 189.25mins.'
Elapsed time: 189.25mins.
++ [[ 0 != 0 ]]
++ [[ '' == \l\o\c\a\l ]]
+++ cat /qa/hudson_ws/workspace/jbosstools-nightly-3.1.0.M4/jbds-build/buildData.properties
+++ grep product.releaseNumber
+++ perl -ne 's/[\s\t]+product.releaseNumber=//g;print;'
++ version=3.1.0.M4
+++ cat /qa/hudson_ws/workspace/jbosstools-nightly-3.1.0.M4/jbds-build/buildData.properties
+++ grep upload.to
+++ perl -ne 's/[\s\t]+upload.to=//g;print;'
++ builddir=nightly/3.1.0.M4/200909061201
+++ cat /qa/hudson_ws/workspace/jbosstools-nightly-3.1.0.M4/jbds-build/buildData.properties
+++ grep product.buildDesc
+++ perl -ne 's/[\s\t]+product.buildDesc=//g; print;'
++ buildtype=nightly
+++ grep product.releaseNumber
+++ cat /qa/hudson_ws/workspace/jbosstools-nightly-3.1.0.M4/jbds-build/buildData.properties
+++ perl -ne 's/[\s\t]+product.releaseNumber=//g; print;'
++ releaseNumber=3.1.0.M4
+++ cat /qa/hudson_ws/workspace/jbosstools-nightly-3.1.0.M4/jbds-build/buildData.properties
+++ grep product.buildTimestamp
+++ perl -ne 's/[\s\t]+product.buildTimestamp=//g; print;'
++ timestamp=200909061201
++ [[ '' == '' ]]
++ DESTINATION=jbossqa at filemgmt.jboss.org:/htdocs/jbosstools
++ echo 'Destination to publish build results is jbossqa at filemgmt.jboss.org:/htdocs/jbosstools'
Destination to publish build results is jbossqa at filemgmt.jboss.org:/htdocs/jbosstools
++ scp -r /qa/hudson_ws/workspace/jbosstools-nightly-3.1.0.M4/jbds-build/3.1.0.M4 jbossqa at filemgmt.jboss.org:/htdocs/jbosstools/builds/nightly/
Permission denied (publickey,gssapi-with-mic).
lost connection
Terminating xvnc.
Killing Xvnc process ID 17478
Recording test results
Description not found.
Recording Emma reports jbds-build/coverage.xml
Recording plot data
Saving plot series data from: /qa/hudson_ws/workspace/jbosstools-nightly-3.1.0.M4/jbds-build/3.1.0.M4/200909061201/tests/test-results/emma-coverage/archives/lines.properties
Saving plot series data from: /qa/hudson_ws/workspace/jbosstools-nightly-3.1.0.M4/jbds-build/3.1.0.M4/200909061201/tests/test-results/emma-coverage/as/lines.properties
Saving plot series data from: /qa/hudson_ws/workspace/jbosstools-nightly-3.1.0.M4/jbds-build/3.1.0.M4/200909061201/tests/test-results/emma-coverage/hibernate-tools/lines.properties
Saving plot series data from: /qa/hudson_ws/workspace/jbosstools-nightly-3.1.0.M4/jbds-build/3.1.0.M4/200909061201/tests/test-results/emma-coverage/jbpm-convert/lines.properties
Saving plot series data from: /qa/hudson_ws/workspace/jbosstools-nightly-3.1.0.M4/jbds-build/3.1.0.M4/200909061201/tests/test-results/emma-coverage/jmx/lines.properties
Saving plot series data from: /qa/hudson_ws/workspace/jbosstools-nightly-3.1.0.M4/jbds-build/3.1.0.M4/200909061201/tests/test-results/emma-coverage/bpel/lines.properties
Saving plot series data from: /qa/hudson_ws/workspace/jbosstools-nightly-3.1.0.M4/jbds-build/3.1.0.M4/200909061201/tests/test-results/emma-coverage/common/lines.properties
Saving plot series data from: /qa/hudson_ws/workspace/jbosstools-nightly-3.1.0.M4/jbds-build/3.1.0.M4/200909061201/tests/test-results/emma-coverage/struts/lines.properties
Saving plot series data from: /qa/hudson_ws/workspace/jbosstools-nightly-3.1.0.M4/jbds-build/3.1.0.M4/200909061201/tests/test-results/emma-coverage/jsf/lines.properties
Saving plot series data from: /qa/hudson_ws/workspace/jbosstools-nightly-3.1.0.M4/jbds-build/3.1.0.M4/200909061201/tests/test-results/emma-coverage/jst/lines.properties
Saving plot series data from: /qa/hudson_ws/workspace/jbosstools-nightly-3.1.0.M4/jbds-build/3.1.0.M4/200909061201/tests/test-results/emma-coverage/seam/lines.properties
Saving plot series data from: /qa/hudson_ws/workspace/jbosstools-nightly-3.1.0.M4/jbds-build/3.1.0.M4/200909061201/tests/test-results/emma-coverage/drools-ide/lines.properties
Saving plot series data from: /qa/hudson_ws/workspace/jbosstools-nightly-3.1.0.M4/jbds-build/3.1.0.M4/200909061201/tests/test-results/emma-coverage/vpe/lines.properties
Saving plot series data from: /qa/hudson_ws/workspace/jbosstools-nightly-3.1.0.M4/jbds-build/3.1.0.M4/200909061201/tests/test-results/emma-coverage/esb/lines.properties
Saving plot series data from: /qa/hudson_ws/workspace/jbosstools-nightly-3.1.0.M4/jbds-build/3.1.0.M4/200909061201/tests/test-results/emma-coverage/freemarker/lines.properties
Saving plot series data from: /qa/hudson_ws/workspace/jbosstools-nightly-3.1.0.M4/jbds-build/3.1.0.M4/200909061201/tests/test-results/emma-coverage/birt/lines.properties
Saving plot series data from: /qa/hudson_ws/workspace/jbosstools-nightly-3.1.0.M4/jbds-build/3.1.0.M4/200909061201/tests/test-results/emma-coverage/smooks/lines.properties
Saving plot series data from: /qa/hudson_ws/workspace/jbosstools-nightly-3.1.0.M4/jbds-build/3.1.0.M4/200909061201/tests/test-results/emma-coverage/archives/classes.properties
Saving plot series data from: /qa/hudson_ws/workspace/jbosstools-nightly-3.1.0.M4/jbds-build/3.1.0.M4/200909061201/tests/test-results/emma-coverage/as/classes.properties
Saving plot series data from: /qa/hudson_ws/workspace/jbosstools-nightly-3.1.0.M4/jbds-build/3.1.0.M4/200909061201/tests/test-results/emma-coverage/hibernate-tools/classes.properties
Saving plot series data from: /qa/hudson_ws/workspace/jbosstools-nightly-3.1.0.M4/jbds-build/3.1.0.M4/200909061201/tests/test-results/emma-coverage/jbpm-convert/classes.properties
Saving plot series data from: /qa/hudson_ws/workspace/jbosstools-nightly-3.1.0.M4/jbds-build/3.1.0.M4/200909061201/tests/test-results/emma-coverage/jmx/classes.properties
Saving plot series data from: /qa/hudson_ws/workspace/jbosstools-nightly-3.1.0.M4/jbds-build/3.1.0.M4/200909061201/tests/test-results/emma-coverage/bpel/classes.properties
Saving plot series data from: /qa/hudson_ws/workspace/jbosstools-nightly-3.1.0.M4/jbds-build/3.1.0.M4/200909061201/tests/test-results/emma-coverage/common/classes.properties
Saving plot series data from: /qa/hudson_ws/workspace/jbosstools-nightly-3.1.0.M4/jbds-build/3.1.0.M4/200909061201/tests/test-results/emma-coverage/struts/classes.properties
Saving plot series data from: /qa/hudson_ws/workspace/jbosstools-nightly-3.1.0.M4/jbds-build/3.1.0.M4/200909061201/tests/test-results/emma-coverage/jsf/classes.properties
Saving plot series data from: /qa/hudson_ws/workspace/jbosstools-nightly-3.1.0.M4/jbds-build/3.1.0.M4/200909061201/tests/test-results/emma-coverage/jst/classes.properties
Saving plot series data from: /qa/hudson_ws/workspace/jbosstools-nightly-3.1.0.M4/jbds-build/3.1.0.M4/200909061201/tests/test-results/emma-coverage/seam/classes.properties
Saving plot series data from: /qa/hudson_ws/workspace/jbosstools-nightly-3.1.0.M4/jbds-build/3.1.0.M4/200909061201/tests/test-results/emma-coverage/drools-ide/classes.properties
Saving plot series data from: /qa/hudson_ws/workspace/jbosstools-nightly-3.1.0.M4/jbds-build/3.1.0.M4/200909061201/tests/test-results/emma-coverage/vpe/classes.properties
Saving plot series data from: /qa/hudson_ws/workspace/jbosstools-nightly-3.1.0.M4/jbds-build/3.1.0.M4/200909061201/tests/test-results/emma-coverage/esb/classes.properties
Saving plot series data from: /qa/hudson_ws/workspace/jbosstools-nightly-3.1.0.M4/jbds-build/3.1.0.M4/200909061201/tests/test-results/emma-coverage/freemarker/classes.properties
Saving plot series data from: /qa/hudson_ws/workspace/jbosstools-nightly-3.1.0.M4/jbds-build/3.1.0.M4/200909061201/tests/test-results/emma-coverage/birt/classes.properties
Saving plot series data from: /qa/hudson_ws/workspace/jbosstools-nightly-3.1.0.M4/jbds-build/3.1.0.M4/200909061201/tests/test-results/emma-coverage/smooks/classes.properties
Email was triggered for: Failure
There are 1 triggered emails.
Sending email for trigger: Failure


--------------------------------------------------



More information about the jbosstools-builds mailing list