[jbosstools-builds] [Unstable] jbosstools-nightly-3.1.0.M4 #63

jboss-qa-internal at redhat.com jboss-qa-internal at redhat.com
Fri Sep 11 17:09:48 EDT 2009


Public: 
https://hudson.jboss.org/hudson//job/jbosstools-nightly-3.1.0.M4/63
https://hudson.jboss.org/hudson//job/jbosstools-nightly-3.1.0.M4/63/testReport
https://hudson.jboss.org/hudson//job/jbosstools-nightly-3.1.0.M4/63/changes
https://hudson.jboss.org/hudson//job/jbosstools-nightly-3.1.0.M4/63/console

Internal:
http://hudson.qa.jboss.com/hudson/job/jbosstools-nightly-3.1.0.M4/63/
http://hudson.qa.jboss.com/hudson/job/jbosstools-nightly-3.1.0.M4/63//testReport
http://hudson.qa.jboss.com/hudson/job/jbosstools-nightly-3.1.0.M4/63//changes
http://hudson.qa.jboss.com/hudson/job/jbosstools-nightly-3.1.0.M4/63//console

--------------------------------------------------

Failed Tests:

20 tests failed.
FAILED:  ASArchivesIntegrationTestSuite

Error Message:
/qa/hudson_ws/workspace/jbosstools-nightly-3.1.0.M4/jbds-build/3.1.0.M4/200909111234/tests/workspace/.metadata/.plugins/org.jboss.ide.eclipse.as.archives.integration.test/server1/1/out.jar/a.txt (No such file or directory)

Stack Trace:
java.io.FileNotFoundException: /qa/hudson_ws/workspace/jbosstools-nightly-3.1.0.M4/jbds-build/3.1.0.M4/200909111234/tests/workspace/.metadata/.plugins/org.jboss.ide.eclipse.as.archives.integration.test/server1/1/out.jar/a.txt (No such file or directory)
	at java.io.FileInputStream.open(Native Method)
	at java.io.FileInputStream.<init>(FileInputStream.java:106)
	at org.jboss.ide.eclipse.as.archives.integration.test.BuildDeployTest.assertDeployContents(BuildDeployTest.java:313)
	at org.jboss.ide.eclipse.as.archives.integration.test.BuildDeployTest.testAll(BuildDeployTest.java:80)
	at org.eclipse.test.EclipseTestRunner.run(EclipseTestRunner.java:354)
	at org.eclipse.test.EclipseTestRunner.run(EclipseTestRunner.java:206)
	at org.eclipse.test.UITestApplication$3.run(UITestApplication.java:195)
	at org.eclipse.swt.widgets.RunnableLock.run(RunnableLock.java:35)
	at org.eclipse.swt.widgets.Synchronizer.runAsyncMessages(Synchronizer.java:134)
	at org.eclipse.swt.widgets.Display.runAsyncMessages(Display.java:3468)
	at org.eclipse.swt.widgets.Display.readAndDispatch(Display.java:3115)
	at org.eclipse.ui.internal.Workbench.runEventLoop(Workbench.java:2405)
	at org.eclipse.ui.internal.Workbench.runUI(Workbench.java:2369)
	at org.eclipse.ui.internal.Workbench.access$4(Workbench.java:2221)
	at org.eclipse.ui.internal.Workbench$5.run(Workbench.java:500)
	at org.eclipse.core.databinding.observable.Realm.runWithDefault(Realm.java:332)
	at org.eclipse.ui.internal.Workbench.createAndRunWorkbench(Workbench.java:493)
	at org.eclipse.ui.PlatformUI.createAndRunWorkbench(PlatformUI.java:149)
	at org.eclipse.ui.internal.ide.application.IDEApplication.start(IDEApplication.java:113)
	at org.eclipse.test.UITestApplication.runApplication(UITestApplication.java:138)
	at org.eclipse.test.UITestApplication.run(UITestApplication.java:60)
	at org.eclipse.test.UITestApplication.start(UITestApplication.java:210)
	at org.eclipse.equinox.internal.app.EclipseAppHandle.run(EclipseAppHandle.java:194)
	at org.eclipse.core.runtime.internal.adaptor.EclipseAppLauncher.runApplication(EclipseAppLauncher.java:110)
	at org.eclipse.core.runtime.internal.adaptor.EclipseAppLauncher.start(EclipseAppLauncher.java:79)
	at org.eclipse.core.runtime.adaptor.EclipseStarter.run(EclipseStarter.java:368)
	at org.eclipse.core.runtime.adaptor.EclipseStarter.run(EclipseStarter.java:179)
	at org.eclipse.equinox.launcher.Main.invokeFramework(Main.java:559)
	at org.eclipse.equinox.launcher.Main.basicRun(Main.java:514)
	at org.eclipse.equinox.launcher.Main.run(Main.java:1311)
	at org.eclipse.equinox.launcher.Main.main(Main.java:1287)
	at org.eclipse.core.launcher.Main.main(Main.java:34)


FAILED:  ASTestSuite

Error Message:
null

Stack Trace:
junit.framework.AssertionFailedError
	at org.jboss.ide.eclipse.as.test.publishing.JBIDE2512aTest.testJBIDE2512a(JBIDE2512aTest.java:52)
	at org.eclipse.test.EclipseTestRunner.run(EclipseTestRunner.java:354)
	at org.eclipse.test.EclipseTestRunner.run(EclipseTestRunner.java:206)
	at org.eclipse.test.UITestApplication$3.run(UITestApplication.java:195)
	at org.eclipse.swt.widgets.RunnableLock.run(RunnableLock.java:35)
	at org.eclipse.swt.widgets.Synchronizer.runAsyncMessages(Synchronizer.java:134)
	at org.eclipse.swt.widgets.Display.runAsyncMessages(Display.java:3468)
	at org.eclipse.swt.widgets.Display.readAndDispatch(Display.java:3115)
	at org.eclipse.ui.internal.Workbench.runEventLoop(Workbench.java:2405)
	at org.eclipse.ui.internal.Workbench.runUI(Workbench.java:2369)
	at org.eclipse.ui.internal.Workbench.access$4(Workbench.java:2221)
	at org.eclipse.ui.internal.Workbench$5.run(Workbench.java:500)
	at org.eclipse.core.databinding.observable.Realm.runWithDefault(Realm.java:332)
	at org.eclipse.ui.internal.Workbench.createAndRunWorkbench(Workbench.java:493)
	at org.eclipse.ui.PlatformUI.createAndRunWorkbench(PlatformUI.java:149)
	at org.eclipse.ui.internal.ide.application.IDEApplication.start(IDEApplication.java:113)
	at org.eclipse.test.UITestApplication.runApplication(UITestApplication.java:138)
	at org.eclipse.test.UITestApplication.run(UITestApplication.java:60)
	at org.eclipse.test.UITestApplication.start(UITestApplication.java:210)
	at org.eclipse.equinox.internal.app.EclipseAppHandle.run(EclipseAppHandle.java:194)
	at org.eclipse.core.runtime.internal.adaptor.EclipseAppLauncher.runApplication(EclipseAppLauncher.java:110)
	at org.eclipse.core.runtime.internal.adaptor.EclipseAppLauncher.start(EclipseAppLauncher.java:79)
	at org.eclipse.core.runtime.adaptor.EclipseStarter.run(EclipseStarter.java:368)
	at org.eclipse.core.runtime.adaptor.EclipseStarter.run(EclipseStarter.java:179)
	at org.eclipse.equinox.launcher.Main.invokeFramework(Main.java:559)
	at org.eclipse.equinox.launcher.Main.basicRun(Main.java:514)
	at org.eclipse.equinox.launcher.Main.run(Main.java:1311)
	at org.eclipse.equinox.launcher.Main.main(Main.java:1287)
	at org.eclipse.core.launcher.Main.main(Main.java:34)


FAILED:  BirtCoreTestSuite

Error Message:
org.jboss.tools.birt.core failed to load.

Stack Trace:
junit.framework.AssertionFailedError: org.jboss.tools.birt.core failed to load.
	at org.jboss.tools.tests.AbstractPluginsLoadTest.isPluginResolved(AbstractPluginsLoadTest.java:108)
	at org.jboss.tools.tests.AbstractPluginsLoadTest.testBundlesAreLoadedFor(AbstractPluginsLoadTest.java:71)
	at org.jboss.tools.birt.core.test.BirtCoreTestSuite$BirtPluginsLoadTest.testBirtPluginsAreResolvedAndActivated(BirtCoreTestSuite.java:24)
	at org.eclipse.test.EclipseTestRunner.run(EclipseTestRunner.java:354)
	at org.eclipse.test.EclipseTestRunner.run(EclipseTestRunner.java:206)
	at org.eclipse.test.CoreTestApplication.runTests(CoreTestApplication.java:35)
	at org.eclipse.test.CoreTestApplication.run(CoreTestApplication.java:31)
	at org.eclipse.equinox.internal.app.EclipseAppContainer.callMethodWithException(EclipseAppContainer.java:574)
	at org.eclipse.equinox.internal.app.EclipseAppHandle.run(EclipseAppHandle.java:196)
	at org.eclipse.core.runtime.internal.adaptor.EclipseAppLauncher.runApplication(EclipseAppLauncher.java:110)
	at org.eclipse.core.runtime.internal.adaptor.EclipseAppLauncher.start(EclipseAppLauncher.java:79)
	at org.eclipse.core.runtime.adaptor.EclipseStarter.run(EclipseStarter.java:368)
	at org.eclipse.core.runtime.adaptor.EclipseStarter.run(EclipseStarter.java:179)
	at org.eclipse.equinox.launcher.Main.invokeFramework(Main.java:559)
	at org.eclipse.equinox.launcher.Main.basicRun(Main.java:514)
	at org.eclipse.equinox.launcher.Main.run(Main.java:1311)
	at org.eclipse.equinox.launcher.Main.main(Main.java:1287)
	at org.eclipse.core.launcher.Main.main(Main.java:34)


FAILED:  <init>

Error Message:
java.lang.Exception: Could not find plugin "org.jboss.tools.common.kb.test"

Stack Trace:
org.eclipse.test.EclipseTestRunner$TestFailedException: java.lang.Exception: Could not find plugin "org.jboss.tools.common.kb.test"
	at org.eclipse.test.EclipseTestRunner.runFailed(EclipseTestRunner.java:288)
	at org.eclipse.test.EclipseTestRunner.getTest(EclipseTestRunner.java:240)
	at org.eclipse.test.EclipseTestRunner.<init>(EclipseTestRunner.java:220)
	at org.eclipse.test.EclipseTestRunner.run(EclipseTestRunner.java:204)
	at org.eclipse.test.CoreTestApplication.runTests(CoreTestApplication.java:35)
	at org.eclipse.test.CoreTestApplication.run(CoreTestApplication.java:31)
	at org.eclipse.equinox.internal.app.EclipseAppContainer.callMethodWithException(EclipseAppContainer.java:574)
	at org.eclipse.equinox.internal.app.EclipseAppHandle.run(EclipseAppHandle.java:196)
	at org.eclipse.core.runtime.internal.adaptor.EclipseAppLauncher.runApplication(EclipseAppLauncher.java:110)
	at org.eclipse.core.runtime.internal.adaptor.EclipseAppLauncher.start(EclipseAppLauncher.java:79)
	at org.eclipse.core.runtime.adaptor.EclipseStarter.run(EclipseStarter.java:368)
	at org.eclipse.core.runtime.adaptor.EclipseStarter.run(EclipseStarter.java:179)
	at org.eclipse.equinox.launcher.Main.invokeFramework(Main.java:559)
	at org.eclipse.equinox.launcher.Main.basicRun(Main.java:514)
	at org.eclipse.equinox.launcher.Main.run(Main.java:1311)
	at org.eclipse.equinox.launcher.Main.main(Main.java:1287)
	at org.eclipse.core.launcher.Main.main(Main.java:34)
Caused by: java.lang.Exception: Could not find plugin "org.jboss.tools.common.kb.test"
	at org.eclipse.test.EclipseTestRunner.loadSuiteClass(EclipseTestRunner.java:304)
	at org.eclipse.test.EclipseTestRunner.getTest(EclipseTestRunner.java:237)


FAILED:  CommonAllTests

Error Message:
expected:<... not implemented yet[ ]> but was:<... not implemented yet[]>

Stack Trace:
junit.framework.ComparisonFailure: expected:<... not implemented yet[ ]> but was:<... not implemented yet[]>
	at org.jboss.tools.common.test.MethodNotImplementedExceptionTest.testMethodNotImplementedException(MethodNotImplementedExceptionTest.java:12)
	at org.eclipse.test.EclipseTestRunner.run(EclipseTestRunner.java:354)
	at org.eclipse.test.EclipseTestRunner.run(EclipseTestRunner.java:206)
	at org.eclipse.test.CoreTestApplication.runTests(CoreTestApplication.java:35)
	at org.eclipse.test.CoreTestApplication.run(CoreTestApplication.java:31)
	at org.eclipse.equinox.internal.app.EclipseAppContainer.callMethodWithException(EclipseAppContainer.java:574)
	at org.eclipse.equinox.internal.app.EclipseAppHandle.run(EclipseAppHandle.java:196)
	at org.eclipse.core.runtime.internal.adaptor.EclipseAppLauncher.runApplication(EclipseAppLauncher.java:110)
	at org.eclipse.core.runtime.internal.adaptor.EclipseAppLauncher.start(EclipseAppLauncher.java:79)
	at org.eclipse.core.runtime.adaptor.EclipseStarter.run(EclipseStarter.java:368)
	at org.eclipse.core.runtime.adaptor.EclipseStarter.run(EclipseStarter.java:179)
	at org.eclipse.equinox.launcher.Main.invokeFramework(Main.java:559)
	at org.eclipse.equinox.launcher.Main.basicRun(Main.java:514)
	at org.eclipse.equinox.launcher.Main.run(Main.java:1311)
	at org.eclipse.equinox.launcher.Main.main(Main.java:1287)
	at org.eclipse.core.launcher.Main.main(Main.java:34)


FAILED:  CommonExtAllTests

Error Message:
null

Stack Trace:
junit.framework.AssertionFailedError
	at org.jboss.tools.common.text.ext.test.OpenOnsTest.testUseBeanClassOpenOn(OpenOnsTest.java:333)
	at junit.extensions.TestDecorator.basicRun(TestDecorator.java:24)
	at junit.extensions.TestSetup$1.protect(TestSetup.java:21)
	at junit.extensions.TestSetup.run(TestSetup.java:25)
	at org.eclipse.test.EclipseTestRunner.run(EclipseTestRunner.java:354)
	at org.eclipse.test.EclipseTestRunner.run(EclipseTestRunner.java:206)
	at org.eclipse.test.UITestApplication$3.run(UITestApplication.java:195)
	at org.eclipse.swt.widgets.RunnableLock.run(RunnableLock.java:35)
	at org.eclipse.swt.widgets.Synchronizer.runAsyncMessages(Synchronizer.java:134)
	at org.eclipse.swt.widgets.Display.runAsyncMessages(Display.java:3468)
	at org.eclipse.swt.widgets.Display.readAndDispatch(Display.java:3115)
	at org.eclipse.ui.internal.Workbench.runEventLoop(Workbench.java:2405)
	at org.eclipse.ui.internal.Workbench.runUI(Workbench.java:2369)
	at org.eclipse.ui.internal.Workbench.access$4(Workbench.java:2221)
	at org.eclipse.ui.internal.Workbench$5.run(Workbench.java:500)
	at org.eclipse.core.databinding.observable.Realm.runWithDefault(Realm.java:332)
	at org.eclipse.ui.internal.Workbench.createAndRunWorkbench(Workbench.java:493)
	at org.eclipse.ui.PlatformUI.createAndRunWorkbench(PlatformUI.java:149)
	at org.eclipse.ui.internal.ide.application.IDEApplication.start(IDEApplication.java:113)
	at org.eclipse.test.UITestApplication.runApplication(UITestApplication.java:138)
	at org.eclipse.test.UITestApplication.run(UITestApplication.java:60)
	at org.eclipse.test.UITestApplication.start(UITestApplication.java:210)
	at org.eclipse.equinox.internal.app.EclipseAppHandle.run(EclipseAppHandle.java:194)
	at org.eclipse.core.runtime.internal.adaptor.EclipseAppLauncher.runApplication(EclipseAppLauncher.java:110)
	at org.eclipse.core.runtime.internal.adaptor.EclipseAppLauncher.start(EclipseAppLauncher.java:79)
	at org.eclipse.core.runtime.adaptor.EclipseStarter.run(EclipseStarter.java:368)
	at org.eclipse.core.runtime.adaptor.EclipseStarter.run(EclipseStarter.java:179)
	at org.eclipse.equinox.launcher.Main.invokeFramework(Main.java:559)
	at org.eclipse.equinox.launcher.Main.basicRun(Main.java:514)
	at org.eclipse.equinox.launcher.Main.run(Main.java:1311)
	at org.eclipse.equinox.launcher.Main.main(Main.java:1287)
	at org.eclipse.core.launcher.Main.main(Main.java:34)


FAILED:  ESBAllTests

Error Message:
Attribute dest name is not found in object Providers/JBossMQ/quickstartGwChannel/Filter 

Stack Trace:
junit.framework.AssertionFailedError: Attribute dest name is not found in object Providers/JBossMQ/quickstartGwChannel/Filter

	at org.jboss.tools.esb.core.test.ESBModelTest.testJMSExample(ESBModelTest.java:80)
	at org.eclipse.test.EclipseTestRunner.run(EclipseTestRunner.java:354)
	at org.eclipse.test.EclipseTestRunner.run(EclipseTestRunner.java:206)
	at org.eclipse.test.UITestApplication$3.run(UITestApplication.java:195)
	at org.eclipse.swt.widgets.RunnableLock.run(RunnableLock.java:35)
	at org.eclipse.swt.widgets.Synchronizer.runAsyncMessages(Synchronizer.java:134)
	at org.eclipse.swt.widgets.Display.runAsyncMessages(Display.java:3468)
	at org.eclipse.swt.widgets.Display.readAndDispatch(Display.java:3115)
	at org.eclipse.ui.internal.Workbench.runEventLoop(Workbench.java:2405)
	at org.eclipse.ui.internal.Workbench.runUI(Workbench.java:2369)
	at org.eclipse.ui.internal.Workbench.access$4(Workbench.java:2221)
	at org.eclipse.ui.internal.Workbench$5.run(Workbench.java:500)
	at org.eclipse.core.databinding.observable.Realm.runWithDefault(Realm.java:332)
	at org.eclipse.ui.internal.Workbench.createAndRunWorkbench(Workbench.java:493)
	at org.eclipse.ui.PlatformUI.createAndRunWorkbench(PlatformUI.java:149)
	at org.eclipse.ui.internal.ide.application.IDEApplication.start(IDEApplication.java:113)
	at org.eclipse.test.UITestApplication.runApplication(UITestApplication.java:138)
	at org.eclipse.test.UITestApplication.run(UITestApplication.java:60)
	at org.eclipse.test.UITestApplication.start(UITestApplication.java:210)
	at org.eclipse.equinox.internal.app.EclipseAppHandle.run(EclipseAppHandle.java:194)
	at org.eclipse.core.runtime.internal.adaptor.EclipseAppLauncher.runApplication(EclipseAppLauncher.java:110)
	at org.eclipse.core.runtime.internal.adaptor.EclipseAppLauncher.start(EclipseAppLauncher.java:79)
	at org.eclipse.core.runtime.adaptor.EclipseStarter.run(EclipseStarter.java:368)
	at org.eclipse.core.runtime.adaptor.EclipseStarter.run(EclipseStarter.java:179)
	at org.eclipse.equinox.launcher.Main.invokeFramework(Main.java:559)
	at org.eclipse.equinox.launcher.Main.basicRun(Main.java:514)
	at org.eclipse.equinox.launcher.Main.run(Main.java:1311)
	at org.eclipse.equinox.launcher.Main.main(Main.java:1287)
	at org.eclipse.core.launcher.Main.main(Main.java:34)


FAILED:  ESBAllTests

Error Message:
Attribute bus id ref is not found in object Services/myFileListener/Listeners/FtpGateway 

Stack Trace:
junit.framework.AssertionFailedError: Attribute bus id ref is not found in object Services/myFileListener/Listeners/FtpGateway

	at org.jboss.tools.esb.core.test.ESBModelTest.testFTPExample(ESBModelTest.java:123)
	at org.eclipse.test.EclipseTestRunner.run(EclipseTestRunner.java:354)
	at org.eclipse.test.EclipseTestRunner.run(EclipseTestRunner.java:206)
	at org.eclipse.test.UITestApplication$3.run(UITestApplication.java:195)
	at org.eclipse.swt.widgets.RunnableLock.run(RunnableLock.java:35)
	at org.eclipse.swt.widgets.Synchronizer.runAsyncMessages(Synchronizer.java:134)
	at org.eclipse.swt.widgets.Display.runAsyncMessages(Display.java:3468)
	at org.eclipse.swt.widgets.Display.readAndDispatch(Display.java:3115)
	at org.eclipse.ui.internal.Workbench.runEventLoop(Workbench.java:2405)
	at org.eclipse.ui.internal.Workbench.runUI(Workbench.java:2369)
	at org.eclipse.ui.internal.Workbench.access$4(Workbench.java:2221)
	at org.eclipse.ui.internal.Workbench$5.run(Workbench.java:500)
	at org.eclipse.core.databinding.observable.Realm.runWithDefault(Realm.java:332)
	at org.eclipse.ui.internal.Workbench.createAndRunWorkbench(Workbench.java:493)
	at org.eclipse.ui.PlatformUI.createAndRunWorkbench(PlatformUI.java:149)
	at org.eclipse.ui.internal.ide.application.IDEApplication.start(IDEApplication.java:113)
	at org.eclipse.test.UITestApplication.runApplication(UITestApplication.java:138)
	at org.eclipse.test.UITestApplication.run(UITestApplication.java:60)
	at org.eclipse.test.UITestApplication.start(UITestApplication.java:210)
	at org.eclipse.equinox.internal.app.EclipseAppHandle.run(EclipseAppHandle.java:194)
	at org.eclipse.core.runtime.internal.adaptor.EclipseAppLauncher.runApplication(EclipseAppLauncher.java:110)
	at org.eclipse.core.runtime.internal.adaptor.EclipseAppLauncher.start(EclipseAppLauncher.java:79)
	at org.eclipse.core.runtime.adaptor.EclipseStarter.run(EclipseStarter.java:368)
	at org.eclipse.core.runtime.adaptor.EclipseStarter.run(EclipseStarter.java:179)
	at org.eclipse.equinox.launcher.Main.invokeFramework(Main.java:559)
	at org.eclipse.equinox.launcher.Main.basicRun(Main.java:514)
	at org.eclipse.equinox.launcher.Main.run(Main.java:1311)
	at org.eclipse.equinox.launcher.Main.main(Main.java:1287)
	at org.eclipse.core.launcher.Main.main(Main.java:34)


FAILED:  ESBAllTests

Error Message:
Attribute bus id ref is not found in object Services/myJmsListener/Listeners/HibernateGateway 

Stack Trace:
junit.framework.AssertionFailedError: Attribute bus id ref is not found in object Services/myJmsListener/Listeners/HibernateGateway

	at org.jboss.tools.esb.core.test.ESBModelTest.testHibernateExample(ESBModelTest.java:152)
	at org.eclipse.test.EclipseTestRunner.run(EclipseTestRunner.java:354)
	at org.eclipse.test.EclipseTestRunner.run(EclipseTestRunner.java:206)
	at org.eclipse.test.UITestApplication$3.run(UITestApplication.java:195)
	at org.eclipse.swt.widgets.RunnableLock.run(RunnableLock.java:35)
	at org.eclipse.swt.widgets.Synchronizer.runAsyncMessages(Synchronizer.java:134)
	at org.eclipse.swt.widgets.Display.runAsyncMessages(Display.java:3468)
	at org.eclipse.swt.widgets.Display.readAndDispatch(Display.java:3115)
	at org.eclipse.ui.internal.Workbench.runEventLoop(Workbench.java:2405)
	at org.eclipse.ui.internal.Workbench.runUI(Workbench.java:2369)
	at org.eclipse.ui.internal.Workbench.access$4(Workbench.java:2221)
	at org.eclipse.ui.internal.Workbench$5.run(Workbench.java:500)
	at org.eclipse.core.databinding.observable.Realm.runWithDefault(Realm.java:332)
	at org.eclipse.ui.internal.Workbench.createAndRunWorkbench(Workbench.java:493)
	at org.eclipse.ui.PlatformUI.createAndRunWorkbench(PlatformUI.java:149)
	at org.eclipse.ui.internal.ide.application.IDEApplication.start(IDEApplication.java:113)
	at org.eclipse.test.UITestApplication.runApplication(UITestApplication.java:138)
	at org.eclipse.test.UITestApplication.run(UITestApplication.java:60)
	at org.eclipse.test.UITestApplication.start(UITestApplication.java:210)
	at org.eclipse.equinox.internal.app.EclipseAppHandle.run(EclipseAppHandle.java:194)
	at org.eclipse.core.runtime.internal.adaptor.EclipseAppLauncher.runApplication(EclipseAppLauncher.java:110)
	at org.eclipse.core.runtime.internal.adaptor.EclipseAppLauncher.start(EclipseAppLauncher.java:79)
	at org.eclipse.core.runtime.adaptor.EclipseStarter.run(EclipseStarter.java:368)
	at org.eclipse.core.runtime.adaptor.EclipseStarter.run(EclipseStarter.java:179)
	at org.eclipse.equinox.launcher.Main.invokeFramework(Main.java:559)
	at org.eclipse.equinox.launcher.Main.basicRun(Main.java:514)
	at org.eclipse.equinox.launcher.Main.run(Main.java:1311)
	at org.eclipse.equinox.launcher.Main.main(Main.java:1287)
	at org.eclipse.core.launcher.Main.main(Main.java:34)


FAILED:  ESBAllTests

Error Message:
Attribute bus id ref is not found in object Services/MyWssService/Listeners/Http-Gateway 

Stack Trace:
junit.framework.AssertionFailedError: Attribute bus id ref is not found in object Services/MyWssService/Listeners/Http-Gateway

	at org.jboss.tools.esb.core.test.ESBModelTest.testJBRExample(ESBModelTest.java:181)
	at org.eclipse.test.EclipseTestRunner.run(EclipseTestRunner.java:354)
	at org.eclipse.test.EclipseTestRunner.run(EclipseTestRunner.java:206)
	at org.eclipse.test.UITestApplication$3.run(UITestApplication.java:195)
	at org.eclipse.swt.widgets.RunnableLock.run(RunnableLock.java:35)
	at org.eclipse.swt.widgets.Synchronizer.runAsyncMessages(Synchronizer.java:134)
	at org.eclipse.swt.widgets.Display.runAsyncMessages(Display.java:3468)
	at org.eclipse.swt.widgets.Display.readAndDispatch(Display.java:3115)
	at org.eclipse.ui.internal.Workbench.runEventLoop(Workbench.java:2405)
	at org.eclipse.ui.internal.Workbench.runUI(Workbench.java:2369)
	at org.eclipse.ui.internal.Workbench.access$4(Workbench.java:2221)
	at org.eclipse.ui.internal.Workbench$5.run(Workbench.java:500)
	at org.eclipse.core.databinding.observable.Realm.runWithDefault(Realm.java:332)
	at org.eclipse.ui.internal.Workbench.createAndRunWorkbench(Workbench.java:493)
	at org.eclipse.ui.PlatformUI.createAndRunWorkbench(PlatformUI.java:149)
	at org.eclipse.ui.internal.ide.application.IDEApplication.start(IDEApplication.java:113)
	at org.eclipse.test.UITestApplication.runApplication(UITestApplication.java:138)
	at org.eclipse.test.UITestApplication.run(UITestApplication.java:60)
	at org.eclipse.test.UITestApplication.start(UITestApplication.java:210)
	at org.eclipse.equinox.internal.app.EclipseAppHandle.run(EclipseAppHandle.java:194)
	at org.eclipse.core.runtime.internal.adaptor.EclipseAppLauncher.runApplication(EclipseAppLauncher.java:110)
	at org.eclipse.core.runtime.internal.adaptor.EclipseAppLauncher.start(EclipseAppLauncher.java:79)
	at org.eclipse.core.runtime.adaptor.EclipseStarter.run(EclipseStarter.java:368)
	at org.eclipse.core.runtime.adaptor.EclipseStarter.run(EclipseStarter.java:179)
	at org.eclipse.equinox.launcher.Main.invokeFramework(Main.java:559)
	at org.eclipse.equinox.launcher.Main.basicRun(Main.java:514)
	at org.eclipse.equinox.launcher.Main.run(Main.java:1311)
	at org.eclipse.equinox.launcher.Main.main(Main.java:1287)
	at org.eclipse.core.launcher.Main.main(Main.java:34)


FAILED:  ESBAllTests

Error Message:
Attribute bus id ref is not found in object Services/myFileListener/Listeners/FileGateway 

Stack Trace:
junit.framework.AssertionFailedError: Attribute bus id ref is not found in object Services/myFileListener/Listeners/FileGateway

	at org.jboss.tools.esb.core.test.ESBModelTest.testFSExample(ESBModelTest.java:215)
	at org.eclipse.test.EclipseTestRunner.run(EclipseTestRunner.java:354)
	at org.eclipse.test.EclipseTestRunner.run(EclipseTestRunner.java:206)
	at org.eclipse.test.UITestApplication$3.run(UITestApplication.java:195)
	at org.eclipse.swt.widgets.RunnableLock.run(RunnableLock.java:35)
	at org.eclipse.swt.widgets.Synchronizer.runAsyncMessages(Synchronizer.java:134)
	at org.eclipse.swt.widgets.Display.runAsyncMessages(Display.java:3468)
	at org.eclipse.swt.widgets.Display.readAndDispatch(Display.java:3115)
	at org.eclipse.ui.internal.Workbench.runEventLoop(Workbench.java:2405)
	at org.eclipse.ui.internal.Workbench.runUI(Workbench.java:2369)
	at org.eclipse.ui.internal.Workbench.access$4(Workbench.java:2221)
	at org.eclipse.ui.internal.Workbench$5.run(Workbench.java:500)
	at org.eclipse.core.databinding.observable.Realm.runWithDefault(Realm.java:332)
	at org.eclipse.ui.internal.Workbench.createAndRunWorkbench(Workbench.java:493)
	at org.eclipse.ui.PlatformUI.createAndRunWorkbench(PlatformUI.java:149)
	at org.eclipse.ui.internal.ide.application.IDEApplication.start(IDEApplication.java:113)
	at org.eclipse.test.UITestApplication.runApplication(UITestApplication.java:138)
	at org.eclipse.test.UITestApplication.run(UITestApplication.java:60)
	at org.eclipse.test.UITestApplication.start(UITestApplication.java:210)
	at org.eclipse.equinox.internal.app.EclipseAppHandle.run(EclipseAppHandle.java:194)
	at org.eclipse.core.runtime.internal.adaptor.EclipseAppLauncher.runApplication(EclipseAppLauncher.java:110)
	at org.eclipse.core.runtime.internal.adaptor.EclipseAppLauncher.start(EclipseAppLauncher.java:79)
	at org.eclipse.core.runtime.adaptor.EclipseStarter.run(EclipseStarter.java:368)
	at org.eclipse.core.runtime.adaptor.EclipseStarter.run(EclipseStarter.java:179)
	at org.eclipse.equinox.launcher.Main.invokeFramework(Main.java:559)
	at org.eclipse.equinox.launcher.Main.basicRun(Main.java:514)
	at org.eclipse.equinox.launcher.Main.run(Main.java:1311)
	at org.eclipse.equinox.launcher.Main.main(Main.java:1287)
	at org.eclipse.core.launcher.Main.main(Main.java:34)


FAILED:  ESBAllTests

Error Message:
Attribute bus id ref is not found in object Services/myJmsListener/Listeners/SqlGateway 

Stack Trace:
junit.framework.AssertionFailedError: Attribute bus id ref is not found in object Services/myJmsListener/Listeners/SqlGateway

	at org.jboss.tools.esb.core.test.ESBModelTest.testSQLExample(ESBModelTest.java:250)
	at org.eclipse.test.EclipseTestRunner.run(EclipseTestRunner.java:354)
	at org.eclipse.test.EclipseTestRunner.run(EclipseTestRunner.java:206)
	at org.eclipse.test.UITestApplication$3.run(UITestApplication.java:195)
	at org.eclipse.swt.widgets.RunnableLock.run(RunnableLock.java:35)
	at org.eclipse.swt.widgets.Synchronizer.runAsyncMessages(Synchronizer.java:134)
	at org.eclipse.swt.widgets.Display.runAsyncMessages(Display.java:3468)
	at org.eclipse.swt.widgets.Display.readAndDispatch(Display.java:3115)
	at org.eclipse.ui.internal.Workbench.runEventLoop(Workbench.java:2405)
	at org.eclipse.ui.internal.Workbench.runUI(Workbench.java:2369)
	at org.eclipse.ui.internal.Workbench.access$4(Workbench.java:2221)
	at org.eclipse.ui.internal.Workbench$5.run(Workbench.java:500)
	at org.eclipse.core.databinding.observable.Realm.runWithDefault(Realm.java:332)
	at org.eclipse.ui.internal.Workbench.createAndRunWorkbench(Workbench.java:493)
	at org.eclipse.ui.PlatformUI.createAndRunWorkbench(PlatformUI.java:149)
	at org.eclipse.ui.internal.ide.application.IDEApplication.start(IDEApplication.java:113)
	at org.eclipse.test.UITestApplication.runApplication(UITestApplication.java:138)
	at org.eclipse.test.UITestApplication.run(UITestApplication.java:60)
	at org.eclipse.test.UITestApplication.start(UITestApplication.java:210)
	at org.eclipse.equinox.internal.app.EclipseAppHandle.run(EclipseAppHandle.java:194)
	at org.eclipse.core.runtime.internal.adaptor.EclipseAppLauncher.runApplication(EclipseAppLauncher.java:110)
	at org.eclipse.core.runtime.internal.adaptor.EclipseAppLauncher.start(EclipseAppLauncher.java:79)
	at org.eclipse.core.runtime.adaptor.EclipseStarter.run(EclipseStarter.java:368)
	at org.eclipse.core.runtime.adaptor.EclipseStarter.run(EclipseStarter.java:179)
	at org.eclipse.equinox.launcher.Main.invokeFramework(Main.java:559)
	at org.eclipse.equinox.launcher.Main.basicRun(Main.java:514)
	at org.eclipse.equinox.launcher.Main.run(Main.java:1311)
	at org.eclipse.equinox.launcher.Main.main(Main.java:1287)
	at org.eclipse.core.launcher.Main.main(Main.java:34)


FAILED:  HibernateUiTestSuite

Error Message:
null

Stack Trace:
junit.framework.AssertionFailedError
	at org.jboss.tools.hibernate.ui.diagram.editors.actions.test.ExportImageActionTest.testAction(ExportImageActionTest.java:103)
	at org.eclipse.test.EclipseTestRunner.run(EclipseTestRunner.java:354)
	at org.eclipse.test.EclipseTestRunner.run(EclipseTestRunner.java:206)
	at org.eclipse.test.UITestApplication$3.run(UITestApplication.java:195)
	at org.eclipse.swt.widgets.RunnableLock.run(RunnableLock.java:35)
	at org.eclipse.swt.widgets.Synchronizer.runAsyncMessages(Synchronizer.java:134)
	at org.eclipse.swt.widgets.Display.runAsyncMessages(Display.java:3468)
	at org.eclipse.swt.widgets.Display.readAndDispatch(Display.java:3115)
	at org.eclipse.ui.internal.Workbench.runEventLoop(Workbench.java:2405)
	at org.eclipse.ui.internal.Workbench.runUI(Workbench.java:2369)
	at org.eclipse.ui.internal.Workbench.access$4(Workbench.java:2221)
	at org.eclipse.ui.internal.Workbench$5.run(Workbench.java:500)
	at org.eclipse.core.databinding.observable.Realm.runWithDefault(Realm.java:332)
	at org.eclipse.ui.internal.Workbench.createAndRunWorkbench(Workbench.java:493)
	at org.eclipse.ui.PlatformUI.createAndRunWorkbench(PlatformUI.java:149)
	at org.eclipse.ui.internal.ide.application.IDEApplication.start(IDEApplication.java:113)
	at org.eclipse.test.UITestApplication.runApplication(UITestApplication.java:138)
	at org.eclipse.test.UITestApplication.run(UITestApplication.java:60)
	at org.eclipse.test.UITestApplication.start(UITestApplication.java:210)
	at org.eclipse.equinox.internal.app.EclipseAppHandle.run(EclipseAppHandle.java:194)
	at org.eclipse.core.runtime.internal.adaptor.EclipseAppLauncher.runApplication(EclipseAppLauncher.java:110)
	at org.eclipse.core.runtime.internal.adaptor.EclipseAppLauncher.start(EclipseAppLauncher.java:79)
	at org.eclipse.core.runtime.adaptor.EclipseStarter.run(EclipseStarter.java:368)
	at org.eclipse.core.runtime.adaptor.EclipseStarter.run(EclipseStarter.java:179)
	at org.eclipse.equinox.launcher.Main.invokeFramework(Main.java:559)
	at org.eclipse.equinox.launcher.Main.basicRun(Main.java:514)
	at org.eclipse.equinox.launcher.Main.run(Main.java:1311)
	at org.eclipse.equinox.launcher.Main.main(Main.java:1287)
	at org.eclipse.core.launcher.Main.main(Main.java:34)


FAILED:  JMXCoreAllTests

Error Message:
Failed to retrieve RMIServer stub: javax.naming.ServiceUnavailableException [Root exception is java.rmi.ConnectException: Connection refused to host: 127.0.0.1; nested exception is:   java.net.ConnectException: Connection refused]

Stack Trace:
java.io.IOException: Failed to retrieve RMIServer stub: javax.naming.ServiceUnavailableException [Root exception is java.rmi.ConnectException: Connection refused to host: 127.0.0.1; nested exception is: 
	java.net.ConnectException: Connection refused]
	at javax.management.remote.rmi.RMIConnector.connect(RMIConnector.java:317)
	at javax.management.remote.JMXConnectorFactory.connect(JMXConnectorFactory.java:248)
	at org.jboss.tools.jmx.core.providers.DefaultConnectionWrapper.connect(DefaultConnectionWrapper.java:80)
	at org.jboss.tools.jmx.core.tests.DefaultProviderTest.testConnection(DefaultProviderTest.java:116)
	at org.eclipse.test.EclipseTestRunner.run(EclipseTestRunner.java:354)
	at org.eclipse.test.EclipseTestRunner.run(EclipseTestRunner.java:206)
	at org.eclipse.test.UITestApplication$3.run(UITestApplication.java:195)
	at org.eclipse.swt.widgets.RunnableLock.run(RunnableLock.java:35)
	at org.eclipse.swt.widgets.Synchronizer.runAsyncMessages(Synchronizer.java:134)
	at org.eclipse.swt.widgets.Display.runAsyncMessages(Display.java:3468)
	at org.eclipse.swt.widgets.Display.readAndDispatch(Display.java:3115)
	at org.eclipse.ui.internal.Workbench.runEventLoop(Workbench.java:2405)
	at org.eclipse.ui.internal.Workbench.runUI(Workbench.java:2369)
	at org.eclipse.ui.internal.Workbench.access$4(Workbench.java:2221)
	at org.eclipse.ui.internal.Workbench$5.run(Workbench.java:500)
	at org.eclipse.core.databinding.observable.Realm.runWithDefault(Realm.java:332)
	at org.eclipse.ui.internal.Workbench.createAndRunWorkbench(Workbench.java:493)
	at org.eclipse.ui.PlatformUI.createAndRunWorkbench(PlatformUI.java:149)
	at org.eclipse.ui.internal.ide.application.IDEApplication.start(IDEApplication.java:113)
	at org.eclipse.test.UITestApplication.runApplication(UITestApplication.java:138)
	at org.eclipse.test.UITestApplication.run(UITestApplication.java:60)
	at org.eclipse.test.UITestApplication.start(UITestApplication.java:210)
	at org.eclipse.equinox.internal.app.EclipseAppHandle.run(EclipseAppHandle.java:194)
	at org.eclipse.core.runtime.internal.adaptor.EclipseAppLauncher.runApplication(EclipseAppLauncher.java:110)
	at org.eclipse.core.runtime.internal.adaptor.EclipseAppLauncher.start(EclipseAppLauncher.java:79)
	at org.eclipse.core.runtime.adaptor.EclipseStarter.run(EclipseStarter.java:368)
	at org.eclipse.core.runtime.adaptor.EclipseStarter.run(EclipseStarter.java:179)
	at org.eclipse.equinox.launcher.Main.invokeFramework(Main.java:559)
	at org.eclipse.equinox.launcher.Main.basicRun(Main.java:514)
	at org.eclipse.equinox.launcher.Main.run(Main.java:1311)
	at org.eclipse.equinox.launcher.Main.main(Main.java:1287)
	at org.eclipse.core.launcher.Main.main(Main.java:34)
Caused by: javax.naming.ServiceUnavailableException [Root exception is java.rmi.ConnectException: Connection refused to host: 127.0.0.1; nested exception is: 
	java.net.ConnectException: Connection refused]
	at com.sun.jndi.rmi.registry.RegistryContext.lookup(RegistryContext.java:97)
	at com.sun.jndi.toolkit.url.GenericURLContext.lookup(GenericURLContext.java:185)
	at javax.naming.InitialContext.lookup(InitialContext.java:351)
	at javax.management.remote.rmi.RMIConnector.findRMIServerJNDI(RMIConnector.java:1817)
	at javax.management.remote.rmi.RMIConnector.findRMIServer(RMIConnector.java:1787)
	at javax.management.remote.rmi.RMIConnector.connect(RMIConnector.java:259)
Caused by: java.rmi.ConnectException: Connection refused to host: 127.0.0.1; nested exception is: 
	java.net.ConnectException: Connection refused
	at sun.rmi.transport.tcp.TCPEndpoint.newSocket(TCPEndpoint.java:574)
	at sun.rmi.transport.tcp.TCPChannel.createConnection(TCPChannel.java:185)
	at sun.rmi.transport.tcp.TCPChannel.newConnection(TCPChannel.java:171)
	at sun.rmi.server.UnicastRef.newCall(UnicastRef.java:306)
	at sun.rmi.registry.RegistryImpl_Stub.lookup(Unknown Source)
	at com.sun.jndi.rmi.registry.RegistryContext.lookup(RegistryContext.java:93)
Caused by: java.net.ConnectException: Connection refused
	at java.net.PlainSocketImpl.socketConnect(Native Method)
	at java.net.PlainSocketImpl.doConnect(PlainSocketImpl.java:333)
	at java.net.PlainSocketImpl.connectToAddress(PlainSocketImpl.java:195)
	at java.net.PlainSocketImpl.connect(PlainSocketImpl.java:182)
	at java.net.SocksSocketImpl.connect(SocksSocketImpl.java:366)
	at java.net.Socket.connect(Socket.java:520)
	at java.net.Socket.connect(Socket.java:470)
	at java.net.Socket.<init>(Socket.java:367)
	at java.net.Socket.<init>(Socket.java:180)
	at sun.rmi.transport.proxy.RMIDirectSocketFactory.createSocket(RMIDirectSocketFactory.java:22)
	at sun.rmi.transport.proxy.RMIMasterSocketFactory.createSocket(RMIMasterSocketFactory.java:128)
	at sun.rmi.transport.tcp.TCPEndpoint.newSocket(TCPEndpoint.java:569)


FAILED:  JsfAllTests

Error Message:
Plug-in org.jboss.tools.jsf.verification was unable to load class org.jboss.tools.jsf.verification.vrules.toview.JSFCheckToViewIdSlash.

Stack Trace:
org.eclipse.core.runtime.CoreException: Plug-in org.jboss.tools.jsf.verification was unable to load class org.jboss.tools.jsf.verification.vrules.toview.JSFCheckToViewIdSlash.
	at org.eclipse.core.internal.registry.osgi.RegistryStrategyOSGI.throwException(RegistryStrategyOSGI.java:180)
	at org.eclipse.core.internal.registry.osgi.RegistryStrategyOSGI.createExecutableExtension(RegistryStrategyOSGI.java:162)
	at org.eclipse.core.internal.registry.ExtensionRegistry.createExecutableExtension(ExtensionRegistry.java:874)
	at org.eclipse.core.internal.registry.ConfigurationElement.createExecutableExtension(ConfigurationElement.java:243)
	at org.eclipse.core.internal.registry.ConfigurationElementHandle.createExecutableExtension(ConfigurationElementHandle.java:51)
	at org.jboss.tools.common.model.util.ModelFeatureFactory.createFeatureInstance(ModelFeatureFactory.java:78)
	at org.jboss.tools.common.verification.vrules.model.VActionWrapper.getAction(VRuleModel.java:261)
	at org.jboss.tools.common.verification.vrules.model.VActionWrapper.check(VRuleModel.java:244)
	at org.jboss.tools.common.verification.vrules.impl.VTaskImpl.apply(VTaskImpl.java:129)
	at org.jboss.tools.common.verification.vrules.impl.VTaskImpl.apply(VTaskImpl.java:145)
	at org.jboss.tools.common.verification.vrules.impl.VTaskImpl.apply(VTaskImpl.java:145)
	at org.jboss.tools.common.verification.vrules.impl.VTaskImpl.apply(VTaskImpl.java:145)
	at org.jboss.tools.common.verification.vrules.impl.VTaskImpl.apply(VTaskImpl.java:145)
	at org.jboss.tools.common.verification.vrules.impl.VTaskImpl.run(VTaskImpl.java:92)
	at org.jboss.tools.common.verification.vrules.core.resources.GlobalBuilderImpl.execute(GlobalBuilderImpl.java:45)
	at org.jboss.tools.common.verification.vrules.core.resources.VerifyBuilder.build(VerifyBuilder.java:39)
	at org.eclipse.core.internal.events.BuildManager$2.run(BuildManager.java:627)
	at org.eclipse.core.runtime.SafeRunner.run(SafeRunner.java:42)
	at org.eclipse.core.internal.events.BuildManager.basicBuild(BuildManager.java:170)
	at org.eclipse.core.internal.events.BuildManager.basicBuild(BuildManager.java:201)
	at org.eclipse.core.internal.events.BuildManager$1.run(BuildManager.java:253)
	at org.eclipse.core.runtime.SafeRunner.run(SafeRunner.java:42)
	at org.eclipse.core.internal.events.BuildManager.basicBuild(BuildManager.java:256)
	at org.eclipse.core.internal.events.BuildManager.basicBuildLoop(BuildManager.java:309)
	at org.eclipse.core.internal.events.BuildManager.build(BuildManager.java:341)
	at org.eclipse.core.internal.events.AutoBuildJob.doBuild(AutoBuildJob.java:140)
	at org.eclipse.core.internal.events.AutoBuildJob.run(AutoBuildJob.java:238)
	at org.eclipse.core.internal.jobs.Worker.run(Worker.java:55)
Caused by: org.eclipse.core.runtime.internal.adaptor.EclipseLazyStarter$TerminatingClassNotFoundException: An error occurred while automatically activating bundle org.jboss.tools.jsf.verification (1420).
	at org.eclipse.core.runtime.internal.adaptor.EclipseLazyStarter.postFindLocalClass(EclipseLazyStarter.java:125)
	at org.eclipse.osgi.baseadaptor.loader.ClasspathManager.findLocalClass(ClasspathManager.java:449)
	at org.eclipse.osgi.internal.baseadaptor.DefaultClassLoader.findLocalClass(DefaultClassLoader.java:211)
	at org.eclipse.osgi.internal.loader.BundleLoader.findLocalClass(BundleLoader.java:376)
	at org.eclipse.osgi.internal.loader.BundleLoader.findClassInternal(BundleLoader.java:452)
	at org.eclipse.osgi.internal.loader.BundleLoader.findClass(BundleLoader.java:405)
	at org.eclipse.osgi.internal.loader.BundleLoader.findClass(BundleLoader.java:393)
	at org.eclipse.osgi.internal.baseadaptor.DefaultClassLoader.loadClass(DefaultClassLoader.java:105)
	at java.lang.ClassLoader.loadClass(ClassLoader.java:251)
	at org.eclipse.osgi.internal.loader.BundleLoader.loadClass(BundleLoader.java:321)
	at org.eclipse.osgi.framework.internal.core.BundleHost.loadClass(BundleHost.java:231)
	at org.eclipse.osgi.framework.internal.core.AbstractBundle.loadClass(AbstractBundle.java:1193)
	at org.jboss.tools.common.model.util.ModelFeatureFactory.getFeatureClass(ModelFeatureFactory.java:102)
	at org.jboss.tools.common.verification.vrules.model.VRuleSetModel.getBundle(VRuleSetModel.java:99)
	at org.jboss.tools.common.verification.vrules.model.VRuleSetModel.getRuleSet(VRuleSetModel.java:61)
	at org.jboss.tools.common.verification.vrules.model.VRuleSetModel.getRuleSet(VRuleSetModel.java:44)
	at org.jboss.tools.common.verification.vrules.model.VManagerModel.addChild(VManagerModel.java:101)
	at org.jboss.tools.common.verification.vrules.model.VRuleSetsLoader.load(VRuleSetsLoader.java:69)
	at org.jboss.tools.common.model.loaders.impl.RootLoaderImpl.load(RootLoaderImpl.java:33)
	at org.jboss.tools.common.model.impl.XModelImpl.load(XModelImpl.java:407)
	at org.jboss.tools.common.model.XModelFactory.createInstance(XModelFactory.java:35)
	at org.jboss.tools.common.model.XModelFactory.getModel(XModelFactory.java:28)
	at org.jboss.tools.common.model.options.PreferenceModelUtilities.createPreferenceModel(PreferenceModelUtilities.java:49)
	at org.jboss.tools.common.model.options.PreferenceModelUtilities$PreferenceModelHolder.<clinit>(PreferenceModelUtilities.java:28)
	at org.jboss.tools.common.model.options.PreferenceModelUtilities.getPreferenceModel(PreferenceModelUtilities.java:43)
	at org.jboss.tools.common.model.ui.editor.XMLContentDescriber.describe(XMLContentDescriber.java:43)
	at org.jboss.tools.common.model.ui.editor.XMLContentDescriber.describe(XMLContentDescriber.java:32)
	at org.eclipse.core.internal.content.ContentType.describe(ContentType.java:161)
	at org.eclipse.core.internal.content.ContentTypeCatalog.collectMatchingByContents(ContentTypeCatalog.java:189)
	at org.eclipse.core.internal.content.ContentTypeCatalog.internalFindContentTypesFor(ContentTypeCatalog.java:359)
	at org.eclipse.core.internal.content.ContentTypeCatalog.internalFindContentTypesFor(ContentTypeCatalog.java:406)
	at org.eclipse.core.internal.content.ContentTypeCatalog.getDescriptionFor(ContentTypeCatalog.java:303)
	at org.eclipse.core.internal.content.ContentTypeCatalog.getDescriptionFor(ContentTypeCatalog.java:317)
	at org.eclipse.core.internal.content.ContentTypeMatcher.getDescriptionFor(ContentTypeMatcher.java:86)
	at org.eclipse.emf.ecore.resource.impl.PlatformContentHandlerImpl.contentDescription(PlatformContentHandlerImpl.java:92)
	at org.eclipse.emf.ecore.resource.impl.URIHandlerImpl.contentDescription(URIHandlerImpl.java:267)
	at org.eclipse.emf.ecore.resource.impl.ExtensibleURIConverterImpl.contentDescription(ExtensibleURIConverterImpl.java:313)
	at org.eclipse.emf.ecore.resource.impl.ResourceFactoryRegistryImpl.getContentTypeIdentifier(ResourceFactoryRegistryImpl.java:164)
	at org.eclipse.emf.ecore.resource.impl.ResourceFactoryRegistryImpl.getFactory(ResourceFactoryRegistryImpl.java:130)
	at org.eclipse.emf.ecore.resource.impl.ResourceFactoryRegistryImpl.getFactory(ResourceFactoryRegistryImpl.java:75)
	at org.eclipse.wst.common.internal.emf.utilities.DefaultOverridableResourceFactoryRegistry.delegatedGetFactory(DefaultOverridableResourceFactoryRegistry.java:73)
	at org.eclipse.jst.j2ee.common.internal.impl.J2EEResourceFactoryRegistry.delegatedGetFactory(J2EEResourceFactoryRegistry.java:27)
	at org.eclipse.wst.common.internal.emf.utilities.DefaultOverridableResourceFactoryRegistry.getFactory(DefaultOverridableResourceFactoryRegistry.java:53)
	at org.eclipse.wst.common.internal.emf.resource.FileNameResourceFactoryRegistry.getFactory(FileNameResourceFactoryRegistry.java:64)
	at org.eclipse.wst.common.internal.emf.resource.FileNameResourceFactoryRegistry.getFactory(FileNameResourceFactoryRegistry.java:50)
	at org.eclipse.jst.j2ee.internal.J2EEInit.initResourceFactories(J2EEInit.java:247)
	at org.eclipse.jst.j2ee.internal.J2EEInit.init(J2EEInit.java:101)
	at org.eclipse.jst.j2ee.commonarchivecore.internal.helpers.ArchiveInit.invokePrereqInits(ArchiveInit.java:65)
	at org.eclipse.jst.j2ee.commonarchivecore.internal.helpers.ArchiveInit.init(ArchiveInit.java:38)
	at org.eclipse.jst.j2ee.internal.plugin.J2EEPlugin.start(J2EEPlugin.java:508)
	at org.eclipse.osgi.framework.internal.core.BundleContextImpl$1.run(BundleContextImpl.java:782)
	at java.security.AccessController.doPrivileged(Native Method)
	at org.eclipse.osgi.framework.internal.core.BundleContextImpl.startActivator(BundleContextImpl.java:773)
	at org.eclipse.osgi.framework.internal.core.BundleContextImpl.start(BundleContextImpl.java:754)
	at org.eclipse.osgi.framework.internal.core.BundleHost.startWorker(BundleHost.java:352)
	at org.eclipse.osgi.framework.internal.core.AbstractBundle.start(AbstractBundle.java:280)
	at org.eclipse.osgi.framework.util.SecureAction.start(SecureAction.java:408)
	at org.eclipse.core.runtime.internal.adaptor.EclipseLazyStarter.postFindLocalClass(EclipseLazyStarter.java:111)
	at org.eclipse.osgi.baseadaptor.loader.ClasspathManager.findLocalClass(ClasspathManager.java:449)
	at org.eclipse.osgi.internal.baseadaptor.DefaultClassLoader.findLocalClass(DefaultClassLoader.java:211)
	at org.eclipse.osgi.internal.loader.BundleLoader.findLocalClass(BundleLoader.java:376)
	at org.eclipse.osgi.internal.loader.BundleLoader.findClassInternal(BundleLoader.java:452)
	at org.eclipse.osgi.internal.loader.BundleLoader.findClass(BundleLoader.java:405)
	at org.eclipse.osgi.internal.loader.BundleLoader.findClass(BundleLoader.java:393)
	at org.eclipse.osgi.internal.baseadaptor.DefaultClassLoader.loadClass(DefaultClassLoader.java:105)
	at java.lang.ClassLoader.loadClass(ClassLoader.java:251)
	at org.eclipse.osgi.internal.loader.BundleLoader.loadClass(BundleLoader.java:321)
	at org.eclipse.osgi.framework.internal.core.BundleHost.loadClass(BundleHost.java:231)
	at org.eclipse.osgi.framework.internal.core.AbstractBundle.loadClass(AbstractBundle.java:1193)
	at org.eclipse.core.internal.registry.osgi.RegistryStrategyOSGI.createExecutableExtension(RegistryStrategyOSGI.java:160)
	at org.eclipse.core.internal.registry.ExtensionRegistry.createExecutableExtension(ExtensionRegistry.java:874)
	at org.eclipse.core.internal.registry.ConfigurationElement.createExecutableExtension(ConfigurationElement.java:243)
	at org.eclipse.core.internal.registry.ConfigurationElementHandle.createExecutableExtension(ConfigurationElementHandle.java:51)
	at org.eclipse.wst.server.core.internal.ModuleFactory.getDelegate(ModuleFactory.java:94)
	at org.eclipse.wst.server.core.internal.ModuleFactory.getModules(ModuleFactory.java:131)
	at org.eclipse.wst.server.core.ServerUtil.getModules(ServerUtil.java:96)
	at org.eclipse.wst.server.core.internal.ResourceManager.publishHandleProjectChange(ResourceManager.java:965)
	at org.eclipse.wst.server.core.internal.ResourceManager$ServerResourceChangeListener$1.visit(ResourceManager.java:122)
	at org.eclipse.core.internal.events.ResourceDelta.accept(ResourceDelta.java:68)
	at org.eclipse.core.internal.events.ResourceDelta.accept(ResourceDelta.java:79)
	at org.eclipse.core.internal.events.ResourceDelta.accept(ResourceDelta.java:48)
	at org.eclipse.wst.server.core.internal.ResourceManager$ServerResourceChangeListener.resourceChanged(ResourceManager.java:116)
	at org.eclipse.core.internal.events.NotificationManager$2.run(NotificationManager.java:291)
	at org.eclipse.core.runtime.SafeRunner.run(SafeRunner.java:42)
	at org.eclipse.core.internal.events.NotificationManager.notify(NotificationManager.java:285)
	at org.eclipse.core.internal.events.NotificationManager.broadcastChanges(NotificationManager.java:149)
	at org.eclipse.core.internal.resources.Workspace.broadcastBuildEvent(Workspace.java:297)
	at org.eclipse.core.internal.events.AutoBuildJob.doBuild(AutoBuildJob.java:143)
Caused by: org.osgi.framework.BundleException: The activator org.eclipse.core.internal.compatibility.PluginActivator for bundle org.jboss.tools.jsf.verification is invalid
	at org.eclipse.osgi.framework.internal.core.AbstractBundle.loadBundleActivator(AbstractBundle.java:157)
	at org.eclipse.osgi.framework.internal.core.BundleContextImpl.start(BundleContextImpl.java:750)
	at org.eclipse.osgi.framework.internal.core.BundleHost.startWorker(BundleHost.java:352)
	at org.eclipse.osgi.framework.internal.core.AbstractBundle.start(AbstractBundle.java:280)
	at org.eclipse.osgi.framework.util.SecureAction.start(SecureAction.java:408)
	at org.eclipse.core.runtime.internal.adaptor.EclipseLazyStarter.postFindLocalClass(EclipseLazyStarter.java:111)
Caused by: java.lang.ClassNotFoundException: org.eclipse.core.internal.compatibility.PluginActivator
	at org.eclipse.osgi.internal.loader.BundleLoader.findClassInternal(BundleLoader.java:489)
	at org.eclipse.osgi.internal.loader.BundleLoader.findClass(BundleLoader.java:405)
	at org.eclipse.osgi.internal.loader.BundleLoader.findClass(BundleLoader.java:393)
	at org.eclipse.osgi.internal.baseadaptor.DefaultClassLoader.loadClass(DefaultClassLoader.java:105)
	at java.lang.ClassLoader.loadClass(ClassLoader.java:251)
	at org.eclipse.osgi.internal.loader.BundleLoader.loadClass(BundleLoader.java:321)
	at org.eclipse.osgi.framework.internal.core.BundleHost.loadClass(BundleHost.java:231)
	at org.eclipse.osgi.framework.internal.core.AbstractBundle.loadBundleActivator(AbstractBundle.java:150)


FAILED:  JstlAllTests

Error Message:
Plug-in org.jboss.tools.jsf.verification was unable to load class org.jboss.tools.jsf.verification.vrules.CheckContextParam.

Stack Trace:
org.eclipse.core.runtime.CoreException: Plug-in org.jboss.tools.jsf.verification was unable to load class org.jboss.tools.jsf.verification.vrules.CheckContextParam.
	at org.eclipse.core.internal.registry.osgi.RegistryStrategyOSGI.throwException(RegistryStrategyOSGI.java:180)
	at org.eclipse.core.internal.registry.osgi.RegistryStrategyOSGI.createExecutableExtension(RegistryStrategyOSGI.java:162)
	at org.eclipse.core.internal.registry.ExtensionRegistry.createExecutableExtension(ExtensionRegistry.java:874)
	at org.eclipse.core.internal.registry.ConfigurationElement.createExecutableExtension(ConfigurationElement.java:243)
	at org.eclipse.core.internal.registry.ConfigurationElementHandle.createExecutableExtension(ConfigurationElementHandle.java:51)
	at org.jboss.tools.common.model.util.ModelFeatureFactory.createFeatureInstance(ModelFeatureFactory.java:78)
	at org.jboss.tools.common.verification.vrules.model.VActionWrapper.getAction(VRuleModel.java:261)
	at org.jboss.tools.common.verification.vrules.model.VActionWrapper.check(VRuleModel.java:244)
	at org.jboss.tools.common.verification.vrules.impl.VTaskImpl.apply(VTaskImpl.java:129)
	at org.jboss.tools.common.verification.vrules.impl.VTaskImpl.apply(VTaskImpl.java:145)
	at org.jboss.tools.common.verification.vrules.impl.VTaskImpl.apply(VTaskImpl.java:145)
	at org.jboss.tools.common.verification.vrules.impl.VTaskImpl.apply(VTaskImpl.java:145)
	at org.jboss.tools.common.verification.vrules.impl.VTaskImpl.run(VTaskImpl.java:92)
	at org.jboss.tools.common.verification.vrules.core.resources.GlobalBuilderImpl.execute(GlobalBuilderImpl.java:45)
	at org.jboss.tools.common.verification.vrules.core.resources.VerifyBuilder.build(VerifyBuilder.java:39)
	at org.eclipse.core.internal.events.BuildManager$2.run(BuildManager.java:627)
	at org.eclipse.core.runtime.SafeRunner.run(SafeRunner.java:42)
	at org.eclipse.core.internal.events.BuildManager.basicBuild(BuildManager.java:170)
	at org.eclipse.core.internal.events.BuildManager.basicBuild(BuildManager.java:201)
	at org.eclipse.core.internal.events.BuildManager$1.run(BuildManager.java:253)
	at org.eclipse.core.runtime.SafeRunner.run(SafeRunner.java:42)
	at org.eclipse.core.internal.events.BuildManager.basicBuild(BuildManager.java:256)
	at org.eclipse.core.internal.events.BuildManager.basicBuildLoop(BuildManager.java:309)
	at org.eclipse.core.internal.events.BuildManager.build(BuildManager.java:341)
	at org.eclipse.core.internal.events.AutoBuildJob.doBuild(AutoBuildJob.java:140)
	at org.eclipse.core.internal.events.AutoBuildJob.run(AutoBuildJob.java:238)
	at org.eclipse.core.internal.jobs.Worker.run(Worker.java:55)
Caused by: org.eclipse.core.runtime.internal.adaptor.EclipseLazyStarter$TerminatingClassNotFoundException: An error occurred while automatically activating bundle org.jboss.tools.jsf.verification (1420).
	at org.eclipse.core.runtime.internal.adaptor.EclipseLazyStarter.postFindLocalClass(EclipseLazyStarter.java:125)
	at org.eclipse.osgi.baseadaptor.loader.ClasspathManager.findLocalClass(ClasspathManager.java:449)
	at org.eclipse.osgi.internal.baseadaptor.DefaultClassLoader.findLocalClass(DefaultClassLoader.java:211)
	at org.eclipse.osgi.internal.loader.BundleLoader.findLocalClass(BundleLoader.java:376)
	at org.eclipse.osgi.internal.loader.BundleLoader.findClassInternal(BundleLoader.java:452)
	at org.eclipse.osgi.internal.loader.BundleLoader.findClass(BundleLoader.java:405)
	at org.eclipse.osgi.internal.loader.BundleLoader.findClass(BundleLoader.java:393)
	at org.eclipse.osgi.internal.baseadaptor.DefaultClassLoader.loadClass(DefaultClassLoader.java:105)
	at java.lang.ClassLoader.loadClass(ClassLoader.java:251)
	at org.eclipse.osgi.internal.loader.BundleLoader.loadClass(BundleLoader.java:321)
	at org.eclipse.osgi.framework.internal.core.BundleHost.loadClass(BundleHost.java:231)
	at org.eclipse.osgi.framework.internal.core.AbstractBundle.loadClass(AbstractBundle.java:1193)
	at org.jboss.tools.common.model.util.ModelFeatureFactory.getFeatureClass(ModelFeatureFactory.java:102)
	at org.jboss.tools.common.verification.vrules.model.VRuleSetModel.getBundle(VRuleSetModel.java:99)
	at org.jboss.tools.common.verification.vrules.model.VRuleSetModel.getRuleSet(VRuleSetModel.java:61)
	at org.jboss.tools.common.verification.vrules.model.VRuleSetModel.getRuleSet(VRuleSetModel.java:44)
	at org.jboss.tools.common.verification.vrules.model.VManagerModel.addChild(VManagerModel.java:101)
	at org.jboss.tools.common.verification.vrules.model.VRuleSetsLoader.load(VRuleSetsLoader.java:69)
	at org.jboss.tools.common.model.loaders.impl.RootLoaderImpl.load(RootLoaderImpl.java:33)
	at org.jboss.tools.common.model.impl.XModelImpl.load(XModelImpl.java:407)
	at org.jboss.tools.common.model.XModelFactory.createInstance(XModelFactory.java:35)
	at org.jboss.tools.common.model.XModelFactory.getModel(XModelFactory.java:28)
	at org.jboss.tools.common.model.options.PreferenceModelUtilities.createPreferenceModel(PreferenceModelUtilities.java:49)
	at org.jboss.tools.common.model.options.PreferenceModelUtilities$PreferenceModelHolder.<clinit>(PreferenceModelUtilities.java:28)
	at org.jboss.tools.common.model.options.PreferenceModelUtilities.getPreferenceModel(PreferenceModelUtilities.java:43)
	at org.jboss.tools.common.model.ui.editor.XMLContentDescriber.describe(XMLContentDescriber.java:43)
	at org.jboss.tools.common.model.ui.editor.XMLContentDescriber.describe(XMLContentDescriber.java:32)
	at org.eclipse.core.internal.content.ContentType.describe(ContentType.java:161)
	at org.eclipse.core.internal.content.ContentTypeCatalog.collectMatchingByContents(ContentTypeCatalog.java:189)
	at org.eclipse.core.internal.content.ContentTypeCatalog.internalFindContentTypesFor(ContentTypeCatalog.java:359)
	at org.eclipse.core.internal.content.ContentTypeCatalog.internalFindContentTypesFor(ContentTypeCatalog.java:406)
	at org.eclipse.core.internal.content.ContentTypeCatalog.getDescriptionFor(ContentTypeCatalog.java:303)
	at org.eclipse.core.internal.content.ContentTypeCatalog.getDescriptionFor(ContentTypeCatalog.java:317)
	at org.eclipse.core.internal.content.ContentTypeMatcher.getDescriptionFor(ContentTypeMatcher.java:86)
	at org.eclipse.emf.ecore.resource.impl.PlatformContentHandlerImpl.contentDescription(PlatformContentHandlerImpl.java:92)
	at org.eclipse.emf.ecore.resource.impl.URIHandlerImpl.contentDescription(URIHandlerImpl.java:267)
	at org.eclipse.emf.ecore.resource.impl.ExtensibleURIConverterImpl.contentDescription(ExtensibleURIConverterImpl.java:313)
	at org.eclipse.emf.ecore.resource.impl.ResourceFactoryRegistryImpl.getContentTypeIdentifier(ResourceFactoryRegistryImpl.java:164)
	at org.eclipse.emf.ecore.resource.impl.ResourceFactoryRegistryImpl.getFactory(ResourceFactoryRegistryImpl.java:130)
	at org.eclipse.emf.ecore.resource.impl.ResourceFactoryRegistryImpl.getFactory(ResourceFactoryRegistryImpl.java:75)
	at org.eclipse.wst.common.internal.emf.utilities.DefaultOverridableResourceFactoryRegistry.delegatedGetFactory(DefaultOverridableResourceFactoryRegistry.java:73)
	at org.eclipse.jst.j2ee.common.internal.impl.J2EEResourceFactoryRegistry.delegatedGetFactory(J2EEResourceFactoryRegistry.java:27)
	at org.eclipse.wst.common.internal.emf.utilities.DefaultOverridableResourceFactoryRegistry.getFactory(DefaultOverridableResourceFactoryRegistry.java:53)
	at org.eclipse.wst.common.internal.emf.resource.FileNameResourceFactoryRegistry.getFactory(FileNameResourceFactoryRegistry.java:64)
	at org.eclipse.wst.common.internal.emf.resource.FileNameResourceFactoryRegistry.getFactory(FileNameResourceFactoryRegistry.java:50)
	at org.eclipse.jst.j2ee.internal.J2EEInit.initResourceFactories(J2EEInit.java:247)
	at org.eclipse.jst.j2ee.internal.J2EEInit.init(J2EEInit.java:101)
	at org.eclipse.jst.j2ee.commonarchivecore.internal.helpers.ArchiveInit.invokePrereqInits(ArchiveInit.java:65)
	at org.eclipse.jst.j2ee.commonarchivecore.internal.helpers.ArchiveInit.init(ArchiveInit.java:38)
	at org.eclipse.jst.j2ee.internal.plugin.J2EEPlugin.start(J2EEPlugin.java:508)
	at org.eclipse.osgi.framework.internal.core.BundleContextImpl$1.run(BundleContextImpl.java:782)
	at java.security.AccessController.doPrivileged(Native Method)
	at org.eclipse.osgi.framework.internal.core.BundleContextImpl.startActivator(BundleContextImpl.java:773)
	at org.eclipse.osgi.framework.internal.core.BundleContextImpl.start(BundleContextImpl.java:754)
	at org.eclipse.osgi.framework.internal.core.BundleHost.startWorker(BundleHost.java:352)
	at org.eclipse.osgi.framework.internal.core.AbstractBundle.start(AbstractBundle.java:280)
	at org.eclipse.osgi.framework.util.SecureAction.start(SecureAction.java:408)
	at org.eclipse.core.runtime.internal.adaptor.EclipseLazyStarter.postFindLocalClass(EclipseLazyStarter.java:111)
	at org.eclipse.osgi.baseadaptor.loader.ClasspathManager.findLocalClass(ClasspathManager.java:449)
	at org.eclipse.osgi.internal.baseadaptor.DefaultClassLoader.findLocalClass(DefaultClassLoader.java:211)
	at org.eclipse.osgi.internal.loader.BundleLoader.findLocalClass(BundleLoader.java:376)
	at org.eclipse.osgi.internal.loader.BundleLoader.findClassInternal(BundleLoader.java:452)
	at org.eclipse.osgi.internal.loader.BundleLoader.findClass(BundleLoader.java:405)
	at org.eclipse.osgi.internal.loader.BundleLoader.findClass(BundleLoader.java:393)
	at org.eclipse.osgi.internal.baseadaptor.DefaultClassLoader.loadClass(DefaultClassLoader.java:105)
	at java.lang.ClassLoader.loadClass(ClassLoader.java:251)
	at org.eclipse.osgi.internal.loader.BundleLoader.loadClass(BundleLoader.java:321)
	at org.eclipse.osgi.framework.internal.core.BundleHost.loadClass(BundleHost.java:231)
	at org.eclipse.osgi.framework.internal.core.AbstractBundle.loadClass(AbstractBundle.java:1193)
	at org.eclipse.core.internal.registry.osgi.RegistryStrategyOSGI.createExecutableExtension(RegistryStrategyOSGI.java:160)
	at org.eclipse.core.internal.registry.ExtensionRegistry.createExecutableExtension(ExtensionRegistry.java:874)
	at org.eclipse.core.internal.registry.ConfigurationElement.createExecutableExtension(ConfigurationElement.java:243)
	at org.eclipse.core.internal.registry.ConfigurationElementHandle.createExecutableExtension(ConfigurationElementHandle.java:51)
	at org.eclipse.wst.server.core.internal.ModuleFactory.getDelegate(ModuleFactory.java:94)
	at org.eclipse.wst.server.core.internal.ModuleFactory.getModules(ModuleFactory.java:131)
	at org.eclipse.wst.server.core.ServerUtil.getModules(ServerUtil.java:96)
	at org.eclipse.wst.server.core.internal.ResourceManager.publishHandleProjectChange(ResourceManager.java:965)
	at org.eclipse.wst.server.core.internal.ResourceManager$ServerResourceChangeListener$1.visit(ResourceManager.java:122)
	at org.eclipse.core.internal.events.ResourceDelta.accept(ResourceDelta.java:68)
	at org.eclipse.core.internal.events.ResourceDelta.accept(ResourceDelta.java:79)
	at org.eclipse.core.internal.events.ResourceDelta.accept(ResourceDelta.java:48)
	at org.eclipse.wst.server.core.internal.ResourceManager$ServerResourceChangeListener.resourceChanged(ResourceManager.java:116)
	at org.eclipse.core.internal.events.NotificationManager$2.run(NotificationManager.java:291)
	at org.eclipse.core.runtime.SafeRunner.run(SafeRunner.java:42)
	at org.eclipse.core.internal.events.NotificationManager.notify(NotificationManager.java:285)
	at org.eclipse.core.internal.events.NotificationManager.broadcastChanges(NotificationManager.java:149)
	at org.eclipse.core.internal.resources.Workspace.broadcastBuildEvent(Workspace.java:297)
	at org.eclipse.core.internal.events.AutoBuildJob.doBuild(AutoBuildJob.java:143)
Caused by: org.osgi.framework.BundleException: The activator org.eclipse.core.internal.compatibility.PluginActivator for bundle org.jboss.tools.jsf.verification is invalid
	at org.eclipse.osgi.framework.internal.core.AbstractBundle.loadBundleActivator(AbstractBundle.java:157)
	at org.eclipse.osgi.framework.internal.core.BundleContextImpl.start(BundleContextImpl.java:750)
	at org.eclipse.osgi.framework.internal.core.BundleHost.startWorker(BundleHost.java:352)
	at org.eclipse.osgi.framework.internal.core.AbstractBundle.start(AbstractBundle.java:280)
	at org.eclipse.osgi.framework.util.SecureAction.start(SecureAction.java:408)
	at org.eclipse.core.runtime.internal.adaptor.EclipseLazyStarter.postFindLocalClass(EclipseLazyStarter.java:111)
Caused by: java.lang.ClassNotFoundException: org.eclipse.core.internal.compatibility.PluginActivator
	at org.eclipse.osgi.internal.loader.BundleLoader.findClassInternal(BundleLoader.java:489)
	at org.eclipse.osgi.internal.loader.BundleLoader.findClass(BundleLoader.java:405)
	at org.eclipse.osgi.internal.loader.BundleLoader.findClass(BundleLoader.java:393)
	at org.eclipse.osgi.internal.baseadaptor.DefaultClassLoader.loadClass(DefaultClassLoader.java:105)
	at java.lang.ClassLoader.loadClass(ClassLoader.java:251)
	at org.eclipse.osgi.internal.loader.BundleLoader.loadClass(BundleLoader.java:321)
	at org.eclipse.osgi.framework.internal.core.BundleHost.loadClass(BundleHost.java:231)
	at org.eclipse.osgi.framework.internal.core.AbstractBundle.loadBundleActivator(AbstractBundle.java:150)


FAILED:  SeamCoreAllTests

Error Message:
Loading time per component is too large: Infinity ms.

Stack Trace:
junit.framework.AssertionFailedError: Loading time per component is too large: Infinity ms.
	at org.jboss.tools.seam.core.test.SerializationTest.testLoadSerializedModelTime(SerializationTest.java:126)
	at org.eclipse.test.EclipseTestRunner.run(EclipseTestRunner.java:354)
	at org.eclipse.test.EclipseTestRunner.run(EclipseTestRunner.java:206)
	at org.eclipse.test.UITestApplication$3.run(UITestApplication.java:195)
	at org.eclipse.swt.widgets.RunnableLock.run(RunnableLock.java:35)
	at org.eclipse.swt.widgets.Synchronizer.runAsyncMessages(Synchronizer.java:134)
	at org.eclipse.swt.widgets.Display.runAsyncMessages(Display.java:3468)
	at org.eclipse.swt.widgets.Display.readAndDispatch(Display.java:3115)
	at org.eclipse.ui.internal.Workbench.runEventLoop(Workbench.java:2405)
	at org.eclipse.ui.internal.Workbench.runUI(Workbench.java:2369)
	at org.eclipse.ui.internal.Workbench.access$4(Workbench.java:2221)
	at org.eclipse.ui.internal.Workbench$5.run(Workbench.java:500)
	at org.eclipse.core.databinding.observable.Realm.runWithDefault(Realm.java:332)
	at org.eclipse.ui.internal.Workbench.createAndRunWorkbench(Workbench.java:493)
	at org.eclipse.ui.PlatformUI.createAndRunWorkbench(PlatformUI.java:149)
	at org.eclipse.ui.internal.ide.application.IDEApplication.start(IDEApplication.java:113)
	at org.eclipse.test.UITestApplication.runApplication(UITestApplication.java:138)
	at org.eclipse.test.UITestApplication.run(UITestApplication.java:60)
	at org.eclipse.test.UITestApplication.start(UITestApplication.java:210)
	at org.eclipse.equinox.internal.app.EclipseAppHandle.run(EclipseAppHandle.java:194)
	at org.eclipse.core.runtime.internal.adaptor.EclipseAppLauncher.runApplication(EclipseAppLauncher.java:110)
	at org.eclipse.core.runtime.internal.adaptor.EclipseAppLauncher.start(EclipseAppLauncher.java:79)
	at org.eclipse.core.runtime.adaptor.EclipseStarter.run(EclipseStarter.java:368)
	at org.eclipse.core.runtime.adaptor.EclipseStarter.run(EclipseStarter.java:179)
	at org.eclipse.equinox.launcher.Main.invokeFramework(Main.java:559)
	at org.eclipse.equinox.launcher.Main.basicRun(Main.java:514)
	at org.eclipse.equinox.launcher.Main.run(Main.java:1311)
	at org.eclipse.equinox.launcher.Main.main(Main.java:1287)
	at org.eclipse.core.launcher.Main.main(Main.java:34)


FAILED:  SeamRefactoringAllTests

Error Message:
Component org.jboss.seam.mail.mailSession does not have java declaration.

Stack Trace:
junit.framework.AssertionFailedError: Component org.jboss.seam.mail.mailSession does not have java declaration.
	at org.jboss.tools.seam.core.test.refactoring.SeamComponentRefactoringTest.renameComponent(SeamComponentRefactoringTest.java:112)
	at org.jboss.tools.seam.core.test.refactoring.SeamComponentRefactoringTest.testJBIDE4447(SeamComponentRefactoringTest.java:93)
	at junit.extensions.TestDecorator.basicRun(TestDecorator.java:24)
	at junit.extensions.TestSetup$1.protect(TestSetup.java:21)
	at junit.extensions.TestSetup.run(TestSetup.java:25)
	at org.eclipse.test.EclipseTestRunner.run(EclipseTestRunner.java:354)
	at org.eclipse.test.EclipseTestRunner.run(EclipseTestRunner.java:206)
	at org.eclipse.test.UITestApplication$3.run(UITestApplication.java:195)
	at org.eclipse.swt.widgets.RunnableLock.run(RunnableLock.java:35)
	at org.eclipse.swt.widgets.Synchronizer.runAsyncMessages(Synchronizer.java:134)
	at org.eclipse.swt.widgets.Display.runAsyncMessages(Display.java:3468)
	at org.eclipse.swt.widgets.Display.readAndDispatch(Display.java:3115)
	at org.eclipse.ui.internal.Workbench.runEventLoop(Workbench.java:2405)
	at org.eclipse.ui.internal.Workbench.runUI(Workbench.java:2369)
	at org.eclipse.ui.internal.Workbench.access$4(Workbench.java:2221)
	at org.eclipse.ui.internal.Workbench$5.run(Workbench.java:500)
	at org.eclipse.core.databinding.observable.Realm.runWithDefault(Realm.java:332)
	at org.eclipse.ui.internal.Workbench.createAndRunWorkbench(Workbench.java:493)
	at org.eclipse.ui.PlatformUI.createAndRunWorkbench(PlatformUI.java:149)
	at org.eclipse.ui.internal.ide.application.IDEApplication.start(IDEApplication.java:113)
	at org.eclipse.test.UITestApplication.runApplication(UITestApplication.java:138)
	at org.eclipse.test.UITestApplication.run(UITestApplication.java:60)
	at org.eclipse.test.UITestApplication.start(UITestApplication.java:210)
	at org.eclipse.equinox.internal.app.EclipseAppHandle.run(EclipseAppHandle.java:194)
	at org.eclipse.core.runtime.internal.adaptor.EclipseAppLauncher.runApplication(EclipseAppLauncher.java:110)
	at org.eclipse.core.runtime.internal.adaptor.EclipseAppLauncher.start(EclipseAppLauncher.java:79)
	at org.eclipse.core.runtime.adaptor.EclipseStarter.run(EclipseStarter.java:368)
	at org.eclipse.core.runtime.adaptor.EclipseStarter.run(EclipseStarter.java:179)
	at org.eclipse.equinox.launcher.Main.invokeFramework(Main.java:559)
	at org.eclipse.equinox.launcher.Main.basicRun(Main.java:514)
	at org.eclipse.equinox.launcher.Main.run(Main.java:1311)
	at org.eclipse.equinox.launcher.Main.main(Main.java:1287)
	at org.eclipse.core.launcher.Main.main(Main.java:34)


FAILED:  SmooksCoreAllTests

Error Message:
Unable to filter InputStream for target profile [org.milyn.profile.Profile#default_profile].

Stack Trace:
org.milyn.SmooksException: Unable to filter InputStream for target profile [org.milyn.profile.Profile#default_profile].
	at org.milyn.delivery.dom.SmooksDOMFilter.filter(SmooksDOMFilter.java:306)
	at org.milyn.delivery.dom.SmooksDOMFilter.doFilter(SmooksDOMFilter.java:250)
	at org.milyn.delivery.dom.SmooksDOMFilter.doFilter(SmooksDOMFilter.java:223)
	at org.milyn.Smooks._filter(Smooks.java:470)
	at org.milyn.Smooks.filterSource(Smooks.java:448)
	at org.milyn.Smooks.filterSource(Smooks.java:422)
	at org.jboss.tools.smooks.configuration.editors.edi.EDIDataParser.parseEDIFile(EDIDataParser.java:249)
	at org.jboss.tools.smooks.configuration.editors.edi.EDIDataParser.parseEDIFile(EDIDataParser.java:207)
	at org.jboss.tools.smooks.configuration.editors.edi.EDIDataParser.parseEDIFile(EDIDataParser.java:197)
	at org.jboss.tools.smooks.configuration.editors.edi.EDIDataParser.parseEDIFile(EDIDataParser.java:146)
	at org.jboss.tools.smooks.test.ediparser.EDIParserTest.testEDIParser(EDIParserTest.java:69)
	at org.eclipse.test.EclipseTestRunner.run(EclipseTestRunner.java:354)
	at org.eclipse.test.EclipseTestRunner.run(EclipseTestRunner.java:206)
	at org.eclipse.test.CoreTestApplication.runTests(CoreTestApplication.java:35)
	at org.eclipse.test.CoreTestApplication.run(CoreTestApplication.java:31)
	at org.eclipse.equinox.internal.app.EclipseAppContainer.callMethodWithException(EclipseAppContainer.java:574)
	at org.eclipse.equinox.internal.app.EclipseAppHandle.run(EclipseAppHandle.java:196)
	at org.eclipse.equinox.internal.app.MainApplicationLauncher.run(MainApplicationLauncher.java:32)
	at org.eclipse.core.runtime.internal.adaptor.EclipseAppLauncher.runApplication(EclipseAppLauncher.java:110)
	at org.eclipse.core.runtime.internal.adaptor.EclipseAppLauncher.start(EclipseAppLauncher.java:79)
	at org.eclipse.core.runtime.adaptor.EclipseStarter.run(EclipseStarter.java:368)
	at org.eclipse.core.runtime.adaptor.EclipseStarter.run(EclipseStarter.java:179)
	at org.eclipse.equinox.launcher.Main.invokeFramework(Main.java:559)
	at org.eclipse.equinox.launcher.Main.basicRun(Main.java:514)
	at org.eclipse.equinox.launcher.Main.run(Main.java:1311)
	at org.eclipse.equinox.launcher.Main.main(Main.java:1287)
	at org.eclipse.core.launcher.Main.main(Main.java:34)
Caused by: java.lang.IllegalStateException: Invalid EDI mapping model config specified for org.milyn.smooks.edi.EDIReader.  Unable to access URI based mapping model [/org/jboss/tools/smooks/test/ediparser/edi-to-xml-order-mapping.xml].  Target Profile(s) [org.milyn.profile.profile#default_profile].
	at org.milyn.smooks.edi.EDIReader.getMappingConfigData(EDIReader.java:204)
	at org.milyn.smooks.edi.EDIReader.getMappingModel(EDIReader.java:142)
	at org.milyn.smooks.edi.EDIReader.parse(EDIReader.java:110)
	at org.milyn.delivery.dom.DOMParser.parse(DOMParser.java:120)
	at org.milyn.delivery.dom.DOMParser.parse(DOMParser.java:88)
	at org.milyn.delivery.dom.SmooksDOMFilter.filter(SmooksDOMFilter.java:302)
Caused by: java.io.IOException: Failed to access data stream for resource [/org/jboss/tools/smooks/test/ediparser/edi-to-xml-order-mapping.xml]. Tried filesystem, classpath and URL.
	at org.milyn.resource.URIResourceLocator.getResource(URIResourceLocator.java:123)
	at org.milyn.resource.URIResourceLocator.getResource(URIResourceLocator.java:82)
	at org.milyn.smooks.edi.EDIReader.getMappingConfigData(EDIReader.java:195)


FAILED:  <init>

Error Message:
Class not found "org.jboss.tools.tests.ToolsAllTests"

Stack Trace:
org.eclipse.test.EclipseTestRunner$TestFailedException: Class not found "org.jboss.tools.tests.ToolsAllTests"
	at org.eclipse.test.EclipseTestRunner.runFailed(EclipseTestRunner.java:283)
	at org.eclipse.test.EclipseTestRunner.getTest(EclipseTestRunner.java:245)
	at org.eclipse.test.EclipseTestRunner.<init>(EclipseTestRunner.java:220)
	at org.eclipse.test.EclipseTestRunner.run(EclipseTestRunner.java:204)
	at org.eclipse.test.UITestApplication$3.run(UITestApplication.java:195)
	at org.eclipse.swt.widgets.RunnableLock.run(RunnableLock.java:35)
	at org.eclipse.swt.widgets.Synchronizer.runAsyncMessages(Synchronizer.java:134)
	at org.eclipse.swt.widgets.Display.runAsyncMessages(Display.java:3468)
	at org.eclipse.swt.widgets.Display.readAndDispatch(Display.java:3115)
	at org.eclipse.ui.internal.Workbench.runEventLoop(Workbench.java:2405)
	at org.eclipse.ui.internal.Workbench.runUI(Workbench.java:2369)
	at org.eclipse.ui.internal.Workbench.access$4(Workbench.java:2221)
	at org.eclipse.ui.internal.Workbench$5.run(Workbench.java:500)
	at org.eclipse.core.databinding.observable.Realm.runWithDefault(Realm.java:332)
	at org.eclipse.ui.internal.Workbench.createAndRunWorkbench(Workbench.java:493)
	at org.eclipse.ui.PlatformUI.createAndRunWorkbench(PlatformUI.java:149)
	at org.eclipse.ui.internal.ide.application.IDEApplication.start(IDEApplication.java:113)
	at org.eclipse.test.UITestApplication.runApplication(UITestApplication.java:138)
	at org.eclipse.test.UITestApplication.run(UITestApplication.java:60)
	at org.eclipse.test.UITestApplication.start(UITestApplication.java:210)
	at org.eclipse.equinox.internal.app.EclipseAppHandle.run(EclipseAppHandle.java:194)
	at org.eclipse.core.runtime.internal.adaptor.EclipseAppLauncher.runApplication(EclipseAppLauncher.java:110)
	at org.eclipse.core.runtime.internal.adaptor.EclipseAppLauncher.start(EclipseAppLauncher.java:79)
	at org.eclipse.core.runtime.adaptor.EclipseStarter.run(EclipseStarter.java:368)
	at org.eclipse.core.runtime.adaptor.EclipseStarter.run(EclipseStarter.java:179)
	at org.eclipse.equinox.launcher.Main.invokeFramework(Main.java:559)
	at org.eclipse.equinox.launcher.Main.basicRun(Main.java:514)
	at org.eclipse.equinox.launcher.Main.run(Main.java:1311)
	at org.eclipse.equinox.launcher.Main.main(Main.java:1287)
	at org.eclipse.core.launcher.Main.main(Main.java:34)




--------------------------------------------------

Changes:

[vyemialyanchyk] https://jira.jboss.org/jira/browse/JBIDE-4715 - possible to sort items alphabetically

[sdzmitrovich] https://jira.jboss.org/jira/browse/JBIDE-4850



--------------------------------------------------

Console log:

[...truncated 201486 lines...]
    [style] Warning: the task name <style> is deprecated. Use <xslt> instead.
    [style] Processing /qa/hudson_ws/workspace/jbosstools-nightly-3.1.0.M4/jbds-build/3.1.0.M4/200909111234/logInfo.xml to /qa/hudson_ws/workspace/jbosstools-nightly-3.1.0.M4/jbds-build/3.1.0.M4/200909111234/logInfo/bpel-errors.html
    [style] Loading stylesheet /qa/hudson_ws/workspace/jbosstools-nightly-3.1.0.M4/org.jboss.ide.eclipse.releng/builders/product/buildResults/logInfo-builder.xsl
    [style] Warning: the task name <style> is deprecated. Use <xslt> instead.
    [style] Processing /qa/hudson_ws/workspace/jbosstools-nightly-3.1.0.M4/jbds-build/3.1.0.M4/200909111234/logInfo.xml to /qa/hudson_ws/workspace/jbosstools-nightly-3.1.0.M4/jbds-build/3.1.0.M4/200909111234/logInfo/bpel-warnings.html
    [style] Loading stylesheet /qa/hudson_ws/workspace/jbosstools-nightly-3.1.0.M4/org.jboss.ide.eclipse.releng/builders/product/buildResults/logInfo-builder.xsl
    [style] Warning: the task name <style> is deprecated. Use <xslt> instead.
    [style] Processing /qa/hudson_ws/workspace/jbosstools-nightly-3.1.0.M4/jbds-build/3.1.0.M4/200909111234/logInfo.xml to /qa/hudson_ws/workspace/jbosstools-nightly-3.1.0.M4/jbds-build/3.1.0.M4/200909111234/logInfo/seam-errors.html
    [style] Loading stylesheet /qa/hudson_ws/workspace/jbosstools-nightly-3.1.0.M4/org.jboss.ide.eclipse.releng/builders/product/buildResults/logInfo-builder.xsl
    [style] Warning: the task name <style> is deprecated. Use <xslt> instead.
    [style] Processing /qa/hudson_ws/workspace/jbosstools-nightly-3.1.0.M4/jbds-build/3.1.0.M4/200909111234/logInfo.xml to /qa/hudson_ws/workspace/jbosstools-nightly-3.1.0.M4/jbds-build/3.1.0.M4/200909111234/logInfo/seam-warnings.html
    [style] Loading stylesheet /qa/hudson_ws/workspace/jbosstools-nightly-3.1.0.M4/org.jboss.ide.eclipse.releng/builders/product/buildResults/logInfo-builder.xsl
    [style] Warning: the task name <style> is deprecated. Use <xslt> instead.
    [style] Processing /qa/hudson_ws/workspace/jbosstools-nightly-3.1.0.M4/jbds-build/3.1.0.M4/200909111234/logInfo.xml to /qa/hudson_ws/workspace/jbosstools-nightly-3.1.0.M4/jbds-build/3.1.0.M4/200909111234/logInfo/maven-errors.html
    [style] Loading stylesheet /qa/hudson_ws/workspace/jbosstools-nightly-3.1.0.M4/org.jboss.ide.eclipse.releng/builders/product/buildResults/logInfo-builder.xsl
    [style] Warning: the task name <style> is deprecated. Use <xslt> instead.
    [style] Processing /qa/hudson_ws/workspace/jbosstools-nightly-3.1.0.M4/jbds-build/3.1.0.M4/200909111234/logInfo.xml to /qa/hudson_ws/workspace/jbosstools-nightly-3.1.0.M4/jbds-build/3.1.0.M4/200909111234/logInfo/maven-warnings.html
    [style] Loading stylesheet /qa/hudson_ws/workspace/jbosstools-nightly-3.1.0.M4/org.jboss.ide.eclipse.releng/builders/product/buildResults/logInfo-builder.xsl
    [style] Warning: the task name <style> is deprecated. Use <xslt> instead.
    [style] Processing /qa/hudson_ws/workspace/jbosstools-nightly-3.1.0.M4/jbds-build/3.1.0.M4/200909111234/logInfo.xml to /qa/hudson_ws/workspace/jbosstools-nightly-3.1.0.M4/jbds-build/3.1.0.M4/200909111234/logInfo/examples-errors.html
    [style] Loading stylesheet /qa/hudson_ws/workspace/jbosstools-nightly-3.1.0.M4/org.jboss.ide.eclipse.releng/builders/product/buildResults/logInfo-builder.xsl
    [style] Warning: the task name <style> is deprecated. Use <xslt> instead.
    [style] Processing /qa/hudson_ws/workspace/jbosstools-nightly-3.1.0.M4/jbds-build/3.1.0.M4/200909111234/logInfo.xml to /qa/hudson_ws/workspace/jbosstools-nightly-3.1.0.M4/jbds-build/3.1.0.M4/200909111234/logInfo/examples-warnings.html
    [style] Loading stylesheet /qa/hudson_ws/workspace/jbosstools-nightly-3.1.0.M4/org.jboss.ide.eclipse.releng/builders/product/buildResults/logInfo-builder.xsl
    [style] Warning: the task name <style> is deprecated. Use <xslt> instead.
    [style] Processing /qa/hudson_ws/workspace/jbosstools-nightly-3.1.0.M4/jbds-build/3.1.0.M4/200909111234/logInfo.xml to /qa/hudson_ws/workspace/jbosstools-nightly-3.1.0.M4/jbds-build/3.1.0.M4/200909111234/logInfo/esb-errors.html
    [style] Loading stylesheet /qa/hudson_ws/workspace/jbosstools-nightly-3.1.0.M4/org.jboss.ide.eclipse.releng/builders/product/buildResults/logInfo-builder.xsl
    [style] Warning: the task name <style> is deprecated. Use <xslt> instead.
    [style] Processing /qa/hudson_ws/workspace/jbosstools-nightly-3.1.0.M4/jbds-build/3.1.0.M4/200909111234/logInfo.xml to /qa/hudson_ws/workspace/jbosstools-nightly-3.1.0.M4/jbds-build/3.1.0.M4/200909111234/logInfo/esb-warnings.html
    [style] Loading stylesheet /qa/hudson_ws/workspace/jbosstools-nightly-3.1.0.M4/org.jboss.ide.eclipse.releng/builders/product/buildResults/logInfo-builder.xsl
    [style] Warning: the task name <style> is deprecated. Use <xslt> instead.
    [style] Processing /qa/hudson_ws/workspace/jbosstools-nightly-3.1.0.M4/jbds-build/3.1.0.M4/200909111234/logInfo.xml to /qa/hudson_ws/workspace/jbosstools-nightly-3.1.0.M4/jbds-build/3.1.0.M4/200909111234/logInfo/ws-errors.html
    [style] Loading stylesheet /qa/hudson_ws/workspace/jbosstools-nightly-3.1.0.M4/org.jboss.ide.eclipse.releng/builders/product/buildResults/logInfo-builder.xsl
    [style] Warning: the task name <style> is deprecated. Use <xslt> instead.
    [style] Processing /qa/hudson_ws/workspace/jbosstools-nightly-3.1.0.M4/jbds-build/3.1.0.M4/200909111234/logInfo.xml to /qa/hudson_ws/workspace/jbosstools-nightly-3.1.0.M4/jbds-build/3.1.0.M4/200909111234/logInfo/ws-warnings.html
    [style] Loading stylesheet /qa/hudson_ws/workspace/jbosstools-nightly-3.1.0.M4/org.jboss.ide.eclipse.releng/builders/product/buildResults/logInfo-builder.xsl
    [style] Warning: the task name <style> is deprecated. Use <xslt> instead.
    [style] Processing /qa/hudson_ws/workspace/jbosstools-nightly-3.1.0.M4/jbds-build/3.1.0.M4/200909111234/logInfo.xml to /qa/hudson_ws/workspace/jbosstools-nightly-3.1.0.M4/jbds-build/3.1.0.M4/200909111234/logInfo/birt-errors.html
    [style] Loading stylesheet /qa/hudson_ws/workspace/jbosstools-nightly-3.1.0.M4/org.jboss.ide.eclipse.releng/builders/product/buildResults/logInfo-builder.xsl
    [style] Warning: the task name <style> is deprecated. Use <xslt> instead.
    [style] Processing /qa/hudson_ws/workspace/jbosstools-nightly-3.1.0.M4/jbds-build/3.1.0.M4/200909111234/logInfo.xml to /qa/hudson_ws/workspace/jbosstools-nightly-3.1.0.M4/jbds-build/3.1.0.M4/200909111234/logInfo/birt-warnings.html
    [style] Loading stylesheet /qa/hudson_ws/workspace/jbosstools-nightly-3.1.0.M4/org.jboss.ide.eclipse.releng/builders/product/buildResults/logInfo-builder.xsl
    [style] Warning: the task name <style> is deprecated. Use <xslt> instead.
    [style] Processing /qa/hudson_ws/workspace/jbosstools-nightly-3.1.0.M4/jbds-build/3.1.0.M4/200909111234/logInfo.xml to /qa/hudson_ws/workspace/jbosstools-nightly-3.1.0.M4/jbds-build/3.1.0.M4/200909111234/logInfo/portlet-errors.html
    [style] Loading stylesheet /qa/hudson_ws/workspace/jbosstools-nightly-3.1.0.M4/org.jboss.ide.eclipse.releng/builders/product/buildResults/logInfo-builder.xsl
    [style] Warning: the task name <style> is deprecated. Use <xslt> instead.
    [style] Processing /qa/hudson_ws/workspace/jbosstools-nightly-3.1.0.M4/jbds-build/3.1.0.M4/200909111234/logInfo.xml to /qa/hudson_ws/workspace/jbosstools-nightly-3.1.0.M4/jbds-build/3.1.0.M4/200909111234/logInfo/portlet-warnings.html
    [style] Loading stylesheet /qa/hudson_ws/workspace/jbosstools-nightly-3.1.0.M4/org.jboss.ide.eclipse.releng/builders/product/buildResults/logInfo-builder.xsl
    [style] Warning: the task name <style> is deprecated. Use <xslt> instead.
    [style] Processing /qa/hudson_ws/workspace/jbosstools-nightly-3.1.0.M4/jbds-build/3.1.0.M4/200909111234/logInfo.xml to /qa/hudson_ws/workspace/jbosstools-nightly-3.1.0.M4/jbds-build/3.1.0.M4/200909111234/logInfo/smooks-errors.html
    [style] Loading stylesheet /qa/hudson_ws/workspace/jbosstools-nightly-3.1.0.M4/org.jboss.ide.eclipse.releng/builders/product/buildResults/logInfo-builder.xsl
    [style] Warning: the task name <style> is deprecated. Use <xslt> instead.
    [style] Processing /qa/hudson_ws/workspace/jbosstools-nightly-3.1.0.M4/jbds-build/3.1.0.M4/200909111234/logInfo.xml to /qa/hudson_ws/workspace/jbosstools-nightly-3.1.0.M4/jbds-build/3.1.0.M4/200909111234/logInfo/smooks-warnings.html
    [style] Loading stylesheet /qa/hudson_ws/workspace/jbosstools-nightly-3.1.0.M4/org.jboss.ide.eclipse.releng/builders/product/buildResults/logInfo-builder.xsl
    [style] Warning: the task name <style> is deprecated. Use <xslt> instead.
    [style] Processing /qa/hudson_ws/workspace/jbosstools-nightly-3.1.0.M4/jbds-build/3.1.0.M4/200909111234/logInfo.xml to /qa/hudson_ws/workspace/jbosstools-nightly-3.1.0.M4/jbds-build/3.1.0.M4/200909111234/logInfo/tptp-errors.html
    [style] Loading stylesheet /qa/hudson_ws/workspace/jbosstools-nightly-3.1.0.M4/org.jboss.ide.eclipse.releng/builders/product/buildResults/logInfo-builder.xsl
    [style] Warning: the task name <style> is deprecated. Use <xslt> instead.
    [style] Processing /qa/hudson_ws/workspace/jbosstools-nightly-3.1.0.M4/jbds-build/3.1.0.M4/200909111234/logInfo.xml to /qa/hudson_ws/workspace/jbosstools-nightly-3.1.0.M4/jbds-build/3.1.0.M4/200909111234/logInfo/tptp-warnings.html
    [style] Loading stylesheet /qa/hudson_ws/workspace/jbosstools-nightly-3.1.0.M4/org.jboss.ide.eclipse.releng/builders/product/buildResults/logInfo-builder.xsl
    [style] Warning: the task name <style> is deprecated. Use <xslt> instead.
    [style] Processing /qa/hudson_ws/workspace/jbosstools-nightly-3.1.0.M4/jbds-build/3.1.0.M4/200909111234/logInfo.xml to /qa/hudson_ws/workspace/jbosstools-nightly-3.1.0.M4/jbds-build/3.1.0.M4/200909111234/logInfo/tests-errors.html
    [style] Loading stylesheet /qa/hudson_ws/workspace/jbosstools-nightly-3.1.0.M4/org.jboss.ide.eclipse.releng/builders/product/buildResults/logInfo-builder.xsl
    [style] Warning: the task name <style> is deprecated. Use <xslt> instead.
    [style] Processing /qa/hudson_ws/workspace/jbosstools-nightly-3.1.0.M4/jbds-build/3.1.0.M4/200909111234/logInfo.xml to /qa/hudson_ws/workspace/jbosstools-nightly-3.1.0.M4/jbds-build/3.1.0.M4/200909111234/logInfo/tests-warnings.html
    [style] Loading stylesheet /qa/hudson_ws/workspace/jbosstools-nightly-3.1.0.M4/org.jboss.ide.eclipse.releng/builders/product/buildResults/logInfo-builder.xsl

update.builds.xml:

build.results:
     [copy] Copying 1 file to /qa/hudson_ws/workspace/jbosstools-nightly-3.1.0.M4/jbds-build/3.1.0.M4/200909111234
     [copy] Copying 1 file to /qa/hudson_ws/workspace/jbosstools-nightly-3.1.0.M4/jbds-build
     [copy] Copying 1 file to /qa/hudson_ws/workspace/jbosstools-nightly-3.1.0.M4/org.jboss.ide.eclipse.releng/builders/product
     [copy] Copying 1 file to /qa/hudson_ws/workspace/jbosstools-nightly-3.1.0.M4/jbds-build/3.1.0.M4/200909111234
     [copy] Copying 42 files to /qa/hudson_ws/workspace/jbosstools-nightly-3.1.0.M4/jbds-build/3.1.0.M4/200909111234/images
     [copy] Copying 4 files to /qa/hudson_ws/workspace/jbosstools-nightly-3.1.0.M4/jbds-build/3.1.0.M4/200909111234/script
     [copy] Copying 1 file to /qa/hudson_ws/workspace/jbosstools-nightly-3.1.0.M4/jbds-build/3.1.0.M4/200909111234
     [xslt] Processing /qa/hudson_ws/workspace/jbosstools-nightly-3.1.0.M4/jbds-build/3.1.0.M4/200909111234/download.xml to /qa/hudson_ws/workspace/jbosstools-nightly-3.1.0.M4/jbds-build/3.1.0.M4/200909111234/download-snippet.txt
     [xslt] Loading stylesheet /qa/hudson_ws/workspace/jbosstools-nightly-3.1.0.M4/org.jboss.ide.eclipse.releng/builders/product/buildResults/download.xsl

post-build:

publish.results:

send.notification.email:
     [mail] Failed to initialise MIME mail: javax/mail/MessagingException

publish.log:

init:

clean.all.subfolders:

BUILD SUCCESSFUL
Total time: 249 minutes 17 seconds
++ buildResult=0
++ tee ../configs/jbds/build.log
++ buildTypeString=nightly
++ cd ../configs/jbds
++ zip build.log.zip build.log
updating: build.log (stored 0%)
++ cd ../..
+++ date +%s
++ endtime=1252702026
+++ echo 'scale=2; (1252702026 - 1252687033)/60'
+++ bc -l
++ elapsed=249.88
++ echo 'Elapsed time: 249.88mins.'
Elapsed time: 249.88mins.
++ [[ '' != '' ]]
++ [[ '' == \l\o\c\a\l ]]
+++ cat /qa/hudson_ws/workspace/jbosstools-nightly-3.1.0.M4/jbds-build/buildData.properties
+++ grep product.releaseNumber
+++ perl -ne 's/[\s\t]+product.releaseNumber=//g;print;'
++ version=3.1.0.M4
+++ cat /qa/hudson_ws/workspace/jbosstools-nightly-3.1.0.M4/jbds-build/buildData.properties
+++ grep upload.to
+++ perl -ne 's/[\s\t]+upload.to=//g;print;'
++ builddir=nightly/3.1.0.M4/200909111234
+++ cat /qa/hudson_ws/workspace/jbosstools-nightly-3.1.0.M4/jbds-build/buildData.properties
+++ grep product.buildDesc
+++ perl -ne 's/[\s\t]+product.buildDesc=//g; print;'
++ buildtype=nightly
+++ cat /qa/hudson_ws/workspace/jbosstools-nightly-3.1.0.M4/jbds-build/buildData.properties
+++ grep product.releaseNumber
+++ perl -ne 's/[\s\t]+product.releaseNumber=//g; print;'
++ releaseNumber=3.1.0.M4
+++ grep product.buildTimestamp
+++ cat /qa/hudson_ws/workspace/jbosstools-nightly-3.1.0.M4/jbds-build/buildData.properties
+++ perl -ne 's/[\s\t]+product.buildTimestamp=//g; print;'
++ timestamp=200909111234
++ [[ '' == '' ]]
++ DESTINATION=jbossqa at filemgmt.jboss.org:/htdocs/jbosstools
++ pathSuffix=trunk
++ [[ -n trunk ]]
++ [[ trunk == \t\r\u\n\k ]]
++ scp -r /qa/hudson_ws/workspace/jbosstools-nightly-3.1.0.M4/jbds-build/3.1.0.M4/200909111234 jbossqa at filemgmt.jboss.org:/htdocs/jbosstools/builds/nightly/trunk/
++ scp configs/jbds/build.log.zip jbossqa at filemgmt.jboss.org:/htdocs/jbosstools/builds/nightly/trunk/200909111234/
++ scp /qa/hudson_ws/workspace/jbosstools-nightly-3.1.0.M4/jbds-build/latestBuild.html jbossqa at filemgmt.jboss.org:/htdocs/jbosstools/builds/nightly/trunk/latestBuild.html
++ scp /qa/hudson_ws/workspace/jbosstools-nightly-3.1.0.M4/jbds-build/latestBuildFailures.html jbossqa at filemgmt.jboss.org:/htdocs/jbosstools/builds/nightly/trunk/latestBuildFailures.html
+++ date +%s
++ endtime=1252702927
+++ bc -l
+++ echo 'scale=2; (1252702927 - 1252687033)/60'
++ elapsed=264.90
++ echo 'Elapsed time: 264.90mins.'
Elapsed time: 264.90mins.
++ [[ -d /qa/hudson_ws/workspace/jbosstools-nightly-3.1.0.M4/jbds-build/site/eclipse ]]
++ mkdir -p /qa/hudson_ws/workspace/jbosstools-nightly-3.1.0.M4/jbds-build/site/nightly/trunk
++ mv /qa/hudson_ws/workspace/jbosstools-nightly-3.1.0.M4/jbds-build/site/eclipse/artifacts.jar /qa/hudson_ws/workspace/jbosstools-nightly-3.1.0.M4/jbds-build/site/eclipse/associateSites.xml /qa/hudson_ws/workspace/jbosstools-nightly-3.1.0.M4/jbds-build/site/eclipse/content.jar /qa/hudson_ws/workspace/jbosstools-nightly-3.1.0.M4/jbds-build/site/eclipse/features /qa/hudson_ws/workspace/jbosstools-nightly-3.1.0.M4/jbds-build/site/eclipse/index.html /qa/hudson_ws/workspace/jbosstools-nightly-3.1.0.M4/jbds-build/site/eclipse/plugins /qa/hudson_ws/workspace/jbosstools-nightly-3.1.0.M4/jbds-build/site/eclipse/site.xml /qa/hudson_ws/workspace/jbosstools-nightly-3.1.0.M4/jbds-build/site/eclipse/web /qa/hudson_ws/workspace/jbosstools-nightly-3.1.0.M4/jbds-build/site/nightly/trunk
+++ find /qa/hudson_ws/workspace/jbosstools-nightly-3.1.0.M4/jbds-build/site/nightly/trunk/features -name '*.jar'
++ [[ -n /qa/hudson_ws/workspace/jbosstools-nightly-3.1.0.M4/jbds-build/site/nightly/trunk/features/org.jboss.tools.seam.feature_3.1.0.v200909111234N-H63-M4.jar
/qa/hudson_ws/workspace/jbosstools-nightly-3.1.0.M4/jbds-build/site/nightly/trunk/features/org.guvnor.tools.feature_5.1.0.v200909111234N-H63-trunk.jar
/qa/hudson_ws/workspace/jbosstools-nightly-3.1.0.M4/jbds-build/site/nightly/trunk/features/org.hibernate.eclipse.feature_3.3.0.v200909111234N-H63-M4.jar
/qa/hudson_ws/workspace/jbosstools-nightly-3.1.0.M4/jbds-build/site/nightly/trunk/features/org.jboss.tools.ws.feature_1.1.0.v200909111234N-H63-M4.jar
/qa/hudson_ws/workspace/jbosstools-nightly-3.1.0.M4/jbds-build/site/nightly/trunk/features/org.jboss.tools.jbpm.common.feature_4.0.0.v200909111234N-H63-M4.jar
/qa/hudson_ws/workspace/jbosstools-nightly-3.1.0.M4/jbds-build/site/nightly/trunk/features/org.jboss.tools.maven.seam.feature_1.0.0.v200909111234N-H63-M4.jar
/qa/hudson_ws/workspace/jbosstools-nightly-3.1.0.M4/jbds-build/site/nightly/trunk/features/org.jboss.tools.jmx.feature_1.1.0.v200909111234N-H63-M4.jar
/qa/hudson_ws/workspace/jbosstools-nightly-3.1.0.M4/jbds-build/site/nightly/trunk/features/org.jboss.tools.richfaces.feature_3.1.0.v200909111234N-H63-M4.jar
/qa/hudson_ws/workspace/jbosstools-nightly-3.1.0.M4/jbds-build/site/nightly/trunk/features/org.jboss.tools.flow.common.source.feature_4.0.0.v200909111234N-H63-M4.jar
/qa/hudson_ws/workspace/jbosstools-nightly-3.1.0.M4/jbds-build/site/nightly/trunk/features/org.jboss.tools.profiler.feature_1.0.0.v200909111234N-H63-M4.jar
/qa/hudson_ws/workspace/jbosstools-nightly-3.1.0.M4/jbds-build/site/nightly/trunk/features/org.jboss.tools.maven.source.feature_1.0.0.v200909111234N-H63-M4.jar
/qa/hudson_ws/workspace/jbosstools-nightly-3.1.0.M4/jbds-build/site/nightly/trunk/features/org.jboss.tools.jmx.sdk.feature_1.1.0.v200909111234N-H63-M4.jar
/qa/hudson_ws/workspace/jbosstools-nightly-3.1.0.M4/jbds-build/site/nightly/trunk/features/org.jboss.ide.eclipse.freemarker.source.feature_1.1.0.v200909111234N-H63-M4.jar
/qa/hudson_ws/workspace/jbosstools-nightly-3.1.0.M4/jbds-build/site/nightly/trunk/features/org.jboss.tools.jmx.source.feature_1.1.0.v200909111234N-H63-M4.jar
/qa/hudson_ws/workspace/jbosstools-nightly-3.1.0.M4/jbds-build/site/nightly/trunk/features/org.jboss.tools.jbpm.convert.feature_1.1.0.v200909111234N-H63-M4.jar
/qa/hudson_ws/workspace/jbosstools-nightly-3.1.0.M4/jbds-build/site/nightly/trunk/features/org.jboss.tools.struts_feature_3.1.0.v200909111234N-H63-M4.jar
/qa/hudson_ws/workspace/jbosstools-nightly-3.1.0.M4/jbds-build/site/nightly/trunk/features/org.jboss.tools.xulrunner.feature_1.8.1.3-20070904.jar
/qa/hudson_ws/workspace/jbosstools-nightly-3.1.0.M4/jbds-build/site/nightly/trunk/features/org.jboss.tools.birt.feature_1.1.0.v200909111234N-H63-M4.jar
/qa/hudson_ws/workspace/jbosstools-nightly-3.1.0.M4/jbds-build/site/nightly/trunk/features/org.jboss.tools.portlet.feature_1.1.0.v200909111234N-H63-M4.jar
/qa/hudson_ws/workspace/jbosstools-nightly-3.1.0.M4/jbds-build/site/nightly/trunk/features/org.jboss.tools.tptp.feature_1.1.0.v200909111234N-H63-M4.jar
/qa/hudson_ws/workspace/jbosstools-nightly-3.1.0.M4/jbds-build/site/nightly/trunk/features/org.jbpm.gd.jpdl.feature_3.1.7.v200909111234N-H63-GA.jar
/qa/hudson_ws/workspace/jbosstools-nightly-3.1.0.M4/jbds-build/site/nightly/trunk/features/org.jboss.ide.eclipse.as.feature_2.1.0.v200909111234N-H63-M4.jar
/qa/hudson_ws/workspace/jbosstools-nightly-3.1.0.M4/jbds-build/site/nightly/trunk/features/org.jboss.tools.maven.feature_1.0.0.v200909111234N-H63-M4.jar
/qa/hudson_ws/workspace/jbosstools-nightly-3.1.0.M4/jbds-build/site/nightly/trunk/features/org.jboss.tools.maven.sdk.feature_1.0.0.v200909111234N-H63-M4.jar
/qa/hudson_ws/workspace/jbosstools-nightly-3.1.0.M4/jbds-build/site/nightly/trunk/features/org.jboss.tools.bpel.feature_1.0.0.v200909111234N-H63-M4.jar
/qa/hudson_ws/workspace/jbosstools-nightly-3.1.0.M4/jbds-build/site/nightly/trunk/features/org.jboss.tools.esb.feature_1.3.0.v200909111234N-H63-M4.jar
/qa/hudson_ws/workspace/jbosstools-nightly-3.1.0.M4/jbds-build/site/nightly/trunk/features/org.jboss.tools.smooks.feature_1.1.0.v200909111234N-H63-M4.jar
/qa/hudson_ws/workspace/jbosstools-nightly-3.1.0.M4/jbds-build/site/nightly/trunk/features/org.jboss.tools.maven.seam.source.feature_1.0.0.v200909111234N-H63-M4.jar
/qa/hudson_ws/workspace/jbosstools-nightly-3.1.0.M4/jbds-build/site/nightly/trunk/features/org.jboss.tools.bpel.sdk.feature_1.0.0.v200909111234N-H63-M4.jar
/qa/hudson_ws/workspace/jbosstools-nightly-3.1.0.M4/jbds-build/site/nightly/trunk/features/org.jboss.tools.flow.jpdl4.feature_4.0.0.v200909111234N-H63-M4.jar
/qa/hudson_ws/workspace/jbosstools-nightly-3.1.0.M4/jbds-build/site/nightly/trunk/features/org.jboss.tools.project.examples.feature_1.1.0.v200909111234N-H63-M4.jar
/qa/hudson_ws/workspace/jbosstools-nightly-3.1.0.M4/jbds-build/site/nightly/trunk/features/org.drools.eclipse.feature_5.1.0.v200909111234N-H63-trunk.jar
/qa/hudson_ws/workspace/jbosstools-nightly-3.1.0.M4/jbds-build/site/nightly/trunk/features/org.drools.eclipse.task.feature_5.1.0.v200909111234N-H63-trunk.jar
/qa/hudson_ws/workspace/jbosstools-nightly-3.1.0.M4/jbds-build/site/nightly/trunk/features/org.jboss.ide.eclipse.archives.feature_3.1.0.v200909111234N-H63-M4.jar
/qa/hudson_ws/workspace/jbosstools-nightly-3.1.0.M4/jbds-build/site/nightly/trunk/features/org.jboss.ide.eclipse.freemarker.feature_1.1.0.v200909111234N-H63-M4.jar
/qa/hudson_ws/workspace/jbosstools-nightly-3.1.0.M4/jbds-build/site/nightly/trunk/features/org.jboss.ide.eclipse.freemarker.sdk.feature_1.1.0.v200909111234N-H63-M4.jar
/qa/hudson_ws/workspace/jbosstools-nightly-3.1.0.M4/jbds-build/site/nightly/trunk/features/org.jboss.tools.bpel.source.feature_1.0.0.v200909111234N-H63-M4.jar
/qa/hudson_ws/workspace/jbosstools-nightly-3.1.0.M4/jbds-build/site/nightly/trunk/features/org.jboss.tools.flow.common.feature_4.0.0.v200909111234N-H63-M4.jar
/qa/hudson_ws/workspace/jbosstools-nightly-3.1.0.M4/jbds-build/site/nightly/trunk/features/org.jboss.tools.flow.jpdl4.source.feature_4.0.0.v200909111234N-H63-M4.jar
/qa/hudson_ws/workspace/jbosstools-nightly-3.1.0.M4/jbds-build/site/nightly/trunk/features/org.jboss.tools.jbpm.common.source.feature_4.0.0.v200909111234N-H63-M4.jar
/qa/hudson_ws/workspace/jbosstools-nightly-3.1.0.M4/jbds-build/site/nightly/trunk/features/org.jboss.tools.jbpm4.sdk.feature_4.0.0.v200909111234N-H63-M4.jar ]]
+++ echo jbossqa at filemgmt.jboss.org:/htdocs/jbosstools
+++ perl -ne 's/[^@]//g; print;'
++ [[ @ != \@ ]]
++ rsync -arz --delete /qa/hudson_ws/workspace/jbosstools-nightly-3.1.0.M4/jbds-build/site/nightly/trunk jbossqa at filemgmt.jboss.org:/htdocs/jbosstools/updates/nightly/
+++ date +%s
++ endtime=1252703189
+++ echo 'scale=2; (1252703189 - 1252687033)/60'
+++ bc -l
++ elapsed=269.26
++ echo 'Elapsed time: 269.26mins.'
Elapsed time: 269.26mins.
Terminating xvnc.
Killing Xvnc process ID 1745
Recording test results
Description not found.
Recording Emma reports jbds-build/coverage.xml
Recording plot data
Saving plot series data from: /qa/hudson_ws/workspace/jbosstools-nightly-3.1.0.M4/jbds-build/3.1.0.M4/200909111234/tests/test-results/emma-coverage/archives/lines.properties
Saving plot series data from: /qa/hudson_ws/workspace/jbosstools-nightly-3.1.0.M4/jbds-build/3.1.0.M4/200909111234/tests/test-results/emma-coverage/as/lines.properties
Saving plot series data from: /qa/hudson_ws/workspace/jbosstools-nightly-3.1.0.M4/jbds-build/3.1.0.M4/200909111234/tests/test-results/emma-coverage/hibernate-tools/lines.properties
Saving plot series data from: /qa/hudson_ws/workspace/jbosstools-nightly-3.1.0.M4/jbds-build/3.1.0.M4/200909111234/tests/test-results/emma-coverage/jbpm-convert/lines.properties
Saving plot series data from: /qa/hudson_ws/workspace/jbosstools-nightly-3.1.0.M4/jbds-build/3.1.0.M4/200909111234/tests/test-results/emma-coverage/jmx/lines.properties
Saving plot series data from: /qa/hudson_ws/workspace/jbosstools-nightly-3.1.0.M4/jbds-build/3.1.0.M4/200909111234/tests/test-results/emma-coverage/bpel/lines.properties
Saving plot series data from: /qa/hudson_ws/workspace/jbosstools-nightly-3.1.0.M4/jbds-build/3.1.0.M4/200909111234/tests/test-results/emma-coverage/common/lines.properties
Saving plot series data from: /qa/hudson_ws/workspace/jbosstools-nightly-3.1.0.M4/jbds-build/3.1.0.M4/200909111234/tests/test-results/emma-coverage/struts/lines.properties
Saving plot series data from: /qa/hudson_ws/workspace/jbosstools-nightly-3.1.0.M4/jbds-build/3.1.0.M4/200909111234/tests/test-results/emma-coverage/jsf/lines.properties
Saving plot series data from: /qa/hudson_ws/workspace/jbosstools-nightly-3.1.0.M4/jbds-build/3.1.0.M4/200909111234/tests/test-results/emma-coverage/jst/lines.properties
Saving plot series data from: /qa/hudson_ws/workspace/jbosstools-nightly-3.1.0.M4/jbds-build/3.1.0.M4/200909111234/tests/test-results/emma-coverage/seam/lines.properties
Saving plot series data from: /qa/hudson_ws/workspace/jbosstools-nightly-3.1.0.M4/jbds-build/3.1.0.M4/200909111234/tests/test-results/emma-coverage/drools-ide/lines.properties
Saving plot series data from: /qa/hudson_ws/workspace/jbosstools-nightly-3.1.0.M4/jbds-build/3.1.0.M4/200909111234/tests/test-results/emma-coverage/vpe/lines.properties
Saving plot series data from: /qa/hudson_ws/workspace/jbosstools-nightly-3.1.0.M4/jbds-build/3.1.0.M4/200909111234/tests/test-results/emma-coverage/esb/lines.properties
Saving plot series data from: /qa/hudson_ws/workspace/jbosstools-nightly-3.1.0.M4/jbds-build/3.1.0.M4/200909111234/tests/test-results/emma-coverage/freemarker/lines.properties
Saving plot series data from: /qa/hudson_ws/workspace/jbosstools-nightly-3.1.0.M4/jbds-build/3.1.0.M4/200909111234/tests/test-results/emma-coverage/birt/lines.properties
Saving plot series data from: /qa/hudson_ws/workspace/jbosstools-nightly-3.1.0.M4/jbds-build/3.1.0.M4/200909111234/tests/test-results/emma-coverage/smooks/lines.properties
Saving plot series data from: /qa/hudson_ws/workspace/jbosstools-nightly-3.1.0.M4/jbds-build/3.1.0.M4/200909111234/tests/test-results/emma-coverage/archives/classes.properties
Saving plot series data from: /qa/hudson_ws/workspace/jbosstools-nightly-3.1.0.M4/jbds-build/3.1.0.M4/200909111234/tests/test-results/emma-coverage/as/classes.properties
Saving plot series data from: /qa/hudson_ws/workspace/jbosstools-nightly-3.1.0.M4/jbds-build/3.1.0.M4/200909111234/tests/test-results/emma-coverage/hibernate-tools/classes.properties
Saving plot series data from: /qa/hudson_ws/workspace/jbosstools-nightly-3.1.0.M4/jbds-build/3.1.0.M4/200909111234/tests/test-results/emma-coverage/jbpm-convert/classes.properties
Saving plot series data from: /qa/hudson_ws/workspace/jbosstools-nightly-3.1.0.M4/jbds-build/3.1.0.M4/200909111234/tests/test-results/emma-coverage/jmx/classes.properties
Saving plot series data from: /qa/hudson_ws/workspace/jbosstools-nightly-3.1.0.M4/jbds-build/3.1.0.M4/200909111234/tests/test-results/emma-coverage/bpel/classes.properties
Saving plot series data from: /qa/hudson_ws/workspace/jbosstools-nightly-3.1.0.M4/jbds-build/3.1.0.M4/200909111234/tests/test-results/emma-coverage/common/classes.properties
Saving plot series data from: /qa/hudson_ws/workspace/jbosstools-nightly-3.1.0.M4/jbds-build/3.1.0.M4/200909111234/tests/test-results/emma-coverage/struts/classes.properties
Saving plot series data from: /qa/hudson_ws/workspace/jbosstools-nightly-3.1.0.M4/jbds-build/3.1.0.M4/200909111234/tests/test-results/emma-coverage/jsf/classes.properties
Saving plot series data from: /qa/hudson_ws/workspace/jbosstools-nightly-3.1.0.M4/jbds-build/3.1.0.M4/200909111234/tests/test-results/emma-coverage/jst/classes.properties
Saving plot series data from: /qa/hudson_ws/workspace/jbosstools-nightly-3.1.0.M4/jbds-build/3.1.0.M4/200909111234/tests/test-results/emma-coverage/seam/classes.properties
Saving plot series data from: /qa/hudson_ws/workspace/jbosstools-nightly-3.1.0.M4/jbds-build/3.1.0.M4/200909111234/tests/test-results/emma-coverage/drools-ide/classes.properties
Saving plot series data from: /qa/hudson_ws/workspace/jbosstools-nightly-3.1.0.M4/jbds-build/3.1.0.M4/200909111234/tests/test-results/emma-coverage/vpe/classes.properties
Saving plot series data from: /qa/hudson_ws/workspace/jbosstools-nightly-3.1.0.M4/jbds-build/3.1.0.M4/200909111234/tests/test-results/emma-coverage/esb/classes.properties
Saving plot series data from: /qa/hudson_ws/workspace/jbosstools-nightly-3.1.0.M4/jbds-build/3.1.0.M4/200909111234/tests/test-results/emma-coverage/freemarker/classes.properties
Saving plot series data from: /qa/hudson_ws/workspace/jbosstools-nightly-3.1.0.M4/jbds-build/3.1.0.M4/200909111234/tests/test-results/emma-coverage/birt/classes.properties
Saving plot series data from: /qa/hudson_ws/workspace/jbosstools-nightly-3.1.0.M4/jbds-build/3.1.0.M4/200909111234/tests/test-results/emma-coverage/smooks/classes.properties
[WARNINGS] Parsing warnings in console log...
[WARNINGS] Found 21388 annotations (1 new, 0 high, 21388 normal, 0 low)
[WARNINGS] Not changing build status, since no threshold has been exceeded
Email was triggered for: Unstable
There are 1 triggered emails.
Sending email for trigger: Unstable


--------------------------------------------------



More information about the jbosstools-builds mailing list