[jbosstools-builds] Build failed in Jenkins: jbosstools-openshift_master #284

ci-builds at redhat.com ci-builds at redhat.com
Fri Feb 8 14:36:30 EST 2013


See <http://jenkins.mw.lab.eng.bos.redhat.com/hudson/job/jbosstools-openshift_master/284/changes>

Changes:

[adietish] [JBIDE-12381] added tracing facility to the openshift-client bundle

[adietish] [JBIDE-13494] bump plugin- and feature-versions 2.4.0->2.5.0

------------------------------------------
[...truncated 272 lines...]
	at org.codehaus.plexus.classworlds.launcher.Launcher.launch(Launcher.java:230)
	at org.codehaus.plexus.classworlds.launcher.Launcher.mainWithExitCode(Launcher.java:409)
	at org.codehaus.plexus.classworlds.launcher.Launcher.main(Launcher.java:352)
Caused by: org.sonatype.aether.resolution.ArtifactResolutionException: Could not find artifact org.jboss.tools.openshift:tests:pom:2.5.0-SNAPSHOT in jboss-developer-repository-group (https://repository.jboss.org/nexus/content/groups/developer/)
	at org.sonatype.aether.impl.internal.DefaultArtifactResolver.resolve(DefaultArtifactResolver.java:538)
	at org.sonatype.aether.impl.internal.DefaultArtifactResolver.resolveArtifacts(DefaultArtifactResolver.java:216)
	at org.sonatype.aether.impl.internal.DefaultArtifactResolver.resolveArtifact(DefaultArtifactResolver.java:193)
	at org.sonatype.aether.impl.internal.DefaultRepositorySystem.resolveArtifact(DefaultRepositorySystem.java:286)
	at org.apache.maven.project.ProjectModelResolver.resolveModel(ProjectModelResolver.java:155)
	... 26 more
Caused by: org.sonatype.aether.transfer.ArtifactNotFoundException: Could not find artifact org.jboss.tools.openshift:tests:pom:2.5.0-SNAPSHOT in jboss-developer-repository-group (https://repository.jboss.org/nexus/content/groups/developer/)
	at org.sonatype.aether.connector.wagon.WagonRepositoryConnector$4.wrap(WagonRepositoryConnector.java:947)
	at org.sonatype.aether.connector.wagon.WagonRepositoryConnector$4.wrap(WagonRepositoryConnector.java:941)
	at org.sonatype.aether.connector.wagon.WagonRepositoryConnector$GetTask.run(WagonRepositoryConnector.java:669)
	at org.sonatype.aether.util.concurrency.RunnableErrorForwarder$1.run(RunnableErrorForwarder.java:60)
	at java.util.concurrent.ThreadPoolExecutor$Worker.runTask(ThreadPoolExecutor.java:886)
	at java.util.concurrent.ThreadPoolExecutor$Worker.run(ThreadPoolExecutor.java:908)
	at java.lang.Thread.run(Thread.java:662)
[ERROR]   
[ERROR]   The project org.jboss.tools.openshift.tests:org.jboss.tools.openshift.express.test:2.5.0-SNAPSHOT (<http://jenkins.mw.lab.eng.bos.redhat.com/hudson/job/jbosstools-openshift_master/ws/sources/tests/org.jboss.tools.openshift.express.test/pom.xml)> has 1 error
[ERROR]     Non-resolvable parent POM: Failure to find org.jboss.tools.openshift:tests:pom:2.5.0-SNAPSHOT in https://repository.jboss.org/nexus/content/groups/developer/ was cached in the local repository, resolution will not be reattempted until the update interval of jboss-developer-repository-group has elapsed or updates are forced and 'parent.relativePath' points at wrong local POM @ line 4, column 10 -> [Help 2]
org.apache.maven.model.resolution.UnresolvableModelException: Failure to find org.jboss.tools.openshift:tests:pom:2.5.0-SNAPSHOT in https://repository.jboss.org/nexus/content/groups/developer/ was cached in the local repository, resolution will not be reattempted until the update interval of jboss-developer-repository-group has elapsed or updates are forced
	at org.apache.maven.project.ProjectModelResolver.resolveModel(ProjectModelResolver.java:159)
	at org.apache.maven.model.building.DefaultModelBuilder.readParentExternally(DefaultModelBuilder.java:813)
	at org.apache.maven.model.building.DefaultModelBuilder.readParent(DefaultModelBuilder.java:664)
	at org.apache.maven.model.building.DefaultModelBuilder.build(DefaultModelBuilder.java:310)
	at org.apache.maven.model.building.DefaultModelBuilder.build(DefaultModelBuilder.java:232)
	at org.apache.maven.project.DefaultProjectBuilder.build(DefaultProjectBuilder.java:410)
	at org.apache.maven.project.DefaultProjectBuilder.build(DefaultProjectBuilder.java:379)
	at org.apache.maven.project.DefaultProjectBuilder.build(DefaultProjectBuilder.java:495)
	at org.apache.maven.project.DefaultProjectBuilder.build(DefaultProjectBuilder.java:379)
	at org.apache.maven.project.DefaultProjectBuilder.build(DefaultProjectBuilder.java:495)
	at org.apache.maven.project.DefaultProjectBuilder.build(DefaultProjectBuilder.java:379)
	at org.apache.maven.project.DefaultProjectBuilder.build(DefaultProjectBuilder.java:343)
	at org.apache.maven.DefaultMaven.collectProjects(DefaultMaven.java:636)
	at org.apache.maven.DefaultMaven.getProjectsForMavenReactor(DefaultMaven.java:585)
	at org.apache.maven.DefaultMaven.doExecute(DefaultMaven.java:234)
	at org.apache.maven.DefaultMaven.execute(DefaultMaven.java:156)
	at org.apache.maven.cli.MavenCli.execute(MavenCli.java:537)
	at org.apache.maven.cli.MavenCli.doMain(MavenCli.java:196)
	at org.apache.maven.cli.MavenCli.main(MavenCli.java:141)
	at sun.reflect.NativeMethodAccessorImpl.invoke0(Native Method)
	at sun.reflect.NativeMethodAccessorImpl.invoke(NativeMethodAccessorImpl.java:39)
	at sun.reflect.DelegatingMethodAccessorImpl.invoke(DelegatingMethodAccessorImpl.java:25)
	at java.lang.reflect.Method.invoke(Method.java:597)
	at org.codehaus.plexus.classworlds.launcher.Launcher.launchEnhanced(Launcher.java:290)
	at org.codehaus.plexus.classworlds.launcher.Launcher.launch(Launcher.java:230)
	at org.codehaus.plexus.classworlds.launcher.Launcher.mainWithExitCode(Launcher.java:409)
	at org.codehaus.plexus.classworlds.launcher.Launcher.main(Launcher.java:352)
Caused by: org.sonatype.aether.resolution.ArtifactResolutionException: Failure to find org.jboss.tools.openshift:tests:pom:2.5.0-SNAPSHOT in https://repository.jboss.org/nexus/content/groups/developer/ was cached in the local repository, resolution will not be reattempted until the update interval of jboss-developer-repository-group has elapsed or updates are forced
	at org.sonatype.aether.impl.internal.DefaultArtifactResolver.resolve(DefaultArtifactResolver.java:538)
	at org.sonatype.aether.impl.internal.DefaultArtifactResolver.resolveArtifacts(DefaultArtifactResolver.java:216)
	at org.sonatype.aether.impl.internal.DefaultArtifactResolver.resolveArtifact(DefaultArtifactResolver.java:193)
	at org.sonatype.aether.impl.internal.DefaultRepositorySystem.resolveArtifact(DefaultRepositorySystem.java:286)
	at org.apache.maven.project.ProjectModelResolver.resolveModel(ProjectModelResolver.java:155)
	... 26 more
Caused by: org.sonatype.aether.transfer.ArtifactNotFoundException: Failure to find org.jboss.tools.openshift:tests:pom:2.5.0-SNAPSHOT in https://repository.jboss.org/nexus/content/groups/developer/ was cached in the local repository, resolution will not be reattempted until the update interval of jboss-developer-repository-group has elapsed or updates are forced
	at org.sonatype.aether.impl.internal.DefaultUpdateCheckManager.newException(DefaultUpdateCheckManager.java:230)
	at org.sonatype.aether.impl.internal.DefaultUpdateCheckManager.checkArtifact(DefaultUpdateCheckManager.java:176)
	at org.sonatype.aether.impl.internal.DefaultArtifactResolver.resolve(DefaultArtifactResolver.java:427)
	... 30 more
[ERROR]   
[ERROR]   The project org.jboss.tools.openshift.features:org.jboss.tools.openshift.egit.integration.feature:2.5.0-SNAPSHOT (<http://jenkins.mw.lab.eng.bos.redhat.com/hudson/job/jbosstools-openshift_master/ws/sources/features/org.jboss.tools.openshift.egit.integration.feature/pom.xml)> has 1 error
[ERROR]     Non-resolvable parent POM: Could not find artifact org.jboss.tools.openshift:features:pom:2.5.0-SNAPSHOT in jboss-developer-repository-group (https://repository.jboss.org/nexus/content/groups/developer/) and 'parent.relativePath' points at wrong local POM @ line 4, column 10 -> [Help 2]
org.apache.maven.model.resolution.UnresolvableModelException: Could not find artifact org.jboss.tools.openshift:features:pom:2.5.0-SNAPSHOT in jboss-developer-repository-group (https://repository.jboss.org/nexus/content/groups/developer/)
	at org.apache.maven.project.ProjectModelResolver.resolveModel(ProjectModelResolver.java:159)
	at org.apache.maven.model.building.DefaultModelBuilder.readParentExternally(DefaultModelBuilder.java:813)
	at org.apache.maven.model.building.DefaultModelBuilder.readParent(DefaultModelBuilder.java:664)
	at org.apache.maven.model.building.DefaultModelBuilder.build(DefaultModelBuilder.java:310)
	at org.apache.maven.model.building.DefaultModelBuilder.build(DefaultModelBuilder.java:232)
	at org.apache.maven.project.DefaultProjectBuilder.build(DefaultProjectBuilder.java:410)
	at org.apache.maven.project.DefaultProjectBuilder.build(DefaultProjectBuilder.java:379)
	at org.apache.maven.project.DefaultProjectBuilder.build(DefaultProjectBuilder.java:495)
	at org.apache.maven.project.DefaultProjectBuilder.build(DefaultProjectBuilder.java:379)
	at org.apache.maven.project.DefaultProjectBuilder.build(DefaultProjectBuilder.java:495)
	at org.apache.maven.project.DefaultProjectBuilder.build(DefaultProjectBuilder.java:379)
	at org.apache.maven.project.DefaultProjectBuilder.build(DefaultProjectBuilder.java:343)
	at org.apache.maven.DefaultMaven.collectProjects(DefaultMaven.java:636)
	at org.apache.maven.DefaultMaven.getProjectsForMavenReactor(DefaultMaven.java:585)
	at org.apache.maven.DefaultMaven.doExecute(DefaultMaven.java:234)
	at org.apache.maven.DefaultMaven.execute(DefaultMaven.java:156)
	at org.apache.maven.cli.MavenCli.execute(MavenCli.java:537)
	at org.apache.maven.cli.MavenCli.doMain(MavenCli.java:196)
	at org.apache.maven.cli.MavenCli.main(MavenCli.java:141)
	at sun.reflect.NativeMethodAccessorImpl.invoke0(Native Method)
	at sun.reflect.NativeMethodAccessorImpl.invoke(NativeMethodAccessorImpl.java:39)
	at sun.reflect.DelegatingMethodAccessorImpl.invoke(DelegatingMethodAccessorImpl.java:25)
	at java.lang.reflect.Method.invoke(Method.java:597)
	at org.codehaus.plexus.classworlds.launcher.Launcher.launchEnhanced(Launcher.java:290)
	at org.codehaus.plexus.classworlds.launcher.Launcher.launch(Launcher.java:230)
	at org.codehaus.plexus.classworlds.launcher.Launcher.mainWithExitCode(Launcher.java:409)
	at org.codehaus.plexus.classworlds.launcher.Launcher.main(Launcher.java:352)
Caused by: org.sonatype.aether.resolution.ArtifactResolutionException: Could not find artifact org.jboss.tools.openshift:features:pom:2.5.0-SNAPSHOT in jboss-developer-repository-group (https://repository.jboss.org/nexus/content/groups/developer/)
	at org.sonatype.aether.impl.internal.DefaultArtifactResolver.resolve(DefaultArtifactResolver.java:538)
	at org.sonatype.aether.impl.internal.DefaultArtifactResolver.resolveArtifacts(DefaultArtifactResolver.java:216)
	at org.sonatype.aether.impl.internal.DefaultArtifactResolver.resolveArtifact(DefaultArtifactResolver.java:193)
	at org.sonatype.aether.impl.internal.DefaultRepositorySystem.resolveArtifact(DefaultRepositorySystem.java:286)
	at org.apache.maven.project.ProjectModelResolver.resolveModel(ProjectModelResolver.java:155)
	... 26 more
Caused by: org.sonatype.aether.transfer.ArtifactNotFoundException: Could not find artifact org.jboss.tools.openshift:features:pom:2.5.0-SNAPSHOT in jboss-developer-repository-group (https://repository.jboss.org/nexus/content/groups/developer/)
	at org.sonatype.aether.connector.wagon.WagonRepositoryConnector$4.wrap(WagonRepositoryConnector.java:947)
	at org.sonatype.aether.connector.wagon.WagonRepositoryConnector$4.wrap(WagonRepositoryConnector.java:941)
	at org.sonatype.aether.connector.wagon.WagonRepositoryConnector$GetTask.run(WagonRepositoryConnector.java:669)
	at org.sonatype.aether.util.concurrency.RunnableErrorForwarder$1.run(RunnableErrorForwarder.java:60)
	at java.util.concurrent.ThreadPoolExecutor$Worker.runTask(ThreadPoolExecutor.java:886)
	at java.util.concurrent.ThreadPoolExecutor$Worker.run(ThreadPoolExecutor.java:908)
	at java.lang.Thread.run(Thread.java:662)
[ERROR]   
[ERROR]   The project org.jboss.tools.openshift.features:org.jboss.tools.openshift.express.feature:2.5.0-SNAPSHOT (<http://jenkins.mw.lab.eng.bos.redhat.com/hudson/job/jbosstools-openshift_master/ws/sources/features/org.jboss.tools.openshift.express.feature/pom.xml)> has 1 error
[ERROR]     Non-resolvable parent POM: Failure to find org.jboss.tools.openshift:features:pom:2.5.0-SNAPSHOT in https://repository.jboss.org/nexus/content/groups/developer/ was cached in the local repository, resolution will not be reattempted until the update interval of jboss-developer-repository-group has elapsed or updates are forced and 'parent.relativePath' points at wrong local POM @ line 4, column 10 -> [Help 2]
org.apache.maven.model.resolution.UnresolvableModelException: Failure to find org.jboss.tools.openshift:features:pom:2.5.0-SNAPSHOT in https://repository.jboss.org/nexus/content/groups/developer/ was cached in the local repository, resolution will not be reattempted until the update interval of jboss-developer-repository-group has elapsed or updates are forced
	at org.apache.maven.project.ProjectModelResolver.resolveModel(ProjectModelResolver.java:159)
	at org.apache.maven.model.building.DefaultModelBuilder.readParentExternally(DefaultModelBuilder.java:813)
	at org.apache.maven.model.building.DefaultModelBuilder.readParent(DefaultModelBuilder.java:664)
	at org.apache.maven.model.building.DefaultModelBuilder.build(DefaultModelBuilder.java:310)
	at org.apache.maven.model.building.DefaultModelBuilder.build(DefaultModelBuilder.java:232)
	at org.apache.maven.project.DefaultProjectBuilder.build(DefaultProjectBuilder.java:410)
	at org.apache.maven.project.DefaultProjectBuilder.build(DefaultProjectBuilder.java:379)
	at org.apache.maven.project.DefaultProjectBuilder.build(DefaultProjectBuilder.java:495)
	at org.apache.maven.project.DefaultProjectBuilder.build(DefaultProjectBuilder.java:379)
	at org.apache.maven.project.DefaultProjectBuilder.build(DefaultProjectBuilder.java:495)
	at org.apache.maven.project.DefaultProjectBuilder.build(DefaultProjectBuilder.java:379)
	at org.apache.maven.project.DefaultProjectBuilder.build(DefaultProjectBuilder.java:343)
	at org.apache.maven.DefaultMaven.collectProjects(DefaultMaven.java:636)
	at org.apache.maven.DefaultMaven.getProjectsForMavenReactor(DefaultMaven.java:585)
	at org.apache.maven.DefaultMaven.doExecute(DefaultMaven.java:234)
	at org.apache.maven.DefaultMaven.execute(DefaultMaven.java:156)
	at org.apache.maven.cli.MavenCli.execute(MavenCli.java:537)
	at org.apache.maven.cli.MavenCli.doMain(MavenCli.java:196)
	at org.apache.maven.cli.MavenCli.main(MavenCli.java:141)
	at sun.reflect.NativeMethodAccessorImpl.invoke0(Native Method)
	at sun.reflect.NativeMethodAccessorImpl.invoke(NativeMethodAccessorImpl.java:39)
	at sun.reflect.DelegatingMethodAccessorImpl.invoke(DelegatingMethodAccessorImpl.java:25)
	at java.lang.reflect.Method.invoke(Method.java:597)
	at org.codehaus.plexus.classworlds.launcher.Launcher.launchEnhanced(Launcher.java:290)
	at org.codehaus.plexus.classworlds.launcher.Launcher.launch(Launcher.java:230)
	at org.codehaus.plexus.classworlds.launcher.Launcher.mainWithExitCode(Launcher.java:409)
	at org.codehaus.plexus.classworlds.launcher.Launcher.main(Launcher.java:352)
Caused by: org.sonatype.aether.resolution.ArtifactResolutionException: Failure to find org.jboss.tools.openshift:features:pom:2.5.0-SNAPSHOT in https://repository.jboss.org/nexus/content/groups/developer/ was cached in the local repository, resolution will not be reattempted until the update interval of jboss-developer-repository-group has elapsed or updates are forced
	at org.sonatype.aether.impl.internal.DefaultArtifactResolver.resolve(DefaultArtifactResolver.java:538)
	at org.sonatype.aether.impl.internal.DefaultArtifactResolver.resolveArtifacts(DefaultArtifactResolver.java:216)
	at org.sonatype.aether.impl.internal.DefaultArtifactResolver.resolveArtifact(DefaultArtifactResolver.java:193)
	at org.sonatype.aether.impl.internal.DefaultRepositorySystem.resolveArtifact(DefaultRepositorySystem.java:286)
	at org.apache.maven.project.ProjectModelResolver.resolveModel(ProjectModelResolver.java:155)
	... 26 more
Caused by: org.sonatype.aether.transfer.ArtifactNotFoundException: Failure to find org.jboss.tools.openshift:features:pom:2.5.0-SNAPSHOT in https://repository.jboss.org/nexus/content/groups/developer/ was cached in the local repository, resolution will not be reattempted until the update interval of jboss-developer-repository-group has elapsed or updates are forced
	at org.sonatype.aether.impl.internal.DefaultUpdateCheckManager.newException(DefaultUpdateCheckManager.java:230)
	at org.sonatype.aether.impl.internal.DefaultUpdateCheckManager.checkArtifact(DefaultUpdateCheckManager.java:176)
	at org.sonatype.aether.impl.internal.DefaultArtifactResolver.resolve(DefaultArtifactResolver.java:427)
	... 30 more
[ERROR]   
[ERROR]   The project org.jboss.tools.openshift.features:org.jboss.tools.openshift.egit.integration.test.feature:2.5.0-SNAPSHOT (<http://jenkins.mw.lab.eng.bos.redhat.com/hudson/job/jbosstools-openshift_master/ws/sources/features/org.jboss.tools.openshift.egit.integration.test.feature/pom.xml)> has 1 error
[ERROR]     Non-resolvable parent POM: Failure to find org.jboss.tools.openshift:features:pom:2.5.0-SNAPSHOT in https://repository.jboss.org/nexus/content/groups/developer/ was cached in the local repository, resolution will not be reattempted until the update interval of jboss-developer-repository-group has elapsed or updates are forced and 'parent.relativePath' points at wrong local POM @ line 4, column 10 -> [Help 2]
org.apache.maven.model.resolution.UnresolvableModelException: Failure to find org.jboss.tools.openshift:features:pom:2.5.0-SNAPSHOT in https://repository.jboss.org/nexus/content/groups/developer/ was cached in the local repository, resolution will not be reattempted until the update interval of jboss-developer-repository-group has elapsed or updates are forced
	at org.apache.maven.project.ProjectModelResolver.resolveModel(ProjectModelResolver.java:159)
	at org.apache.maven.model.building.DefaultModelBuilder.readParentExternally(DefaultModelBuilder.java:813)
	at org.apache.maven.model.building.DefaultModelBuilder.readParent(DefaultModelBuilder.java:664)
	at org.apache.maven.model.building.DefaultModelBuilder.build(DefaultModelBuilder.java:310)
	at org.apache.maven.model.building.DefaultModelBuilder.build(DefaultModelBuilder.java:232)
	at org.apache.maven.project.DefaultProjectBuilder.build(DefaultProjectBuilder.java:410)
	at org.apache.maven.project.DefaultProjectBuilder.build(DefaultProjectBuilder.java:379)
	at org.apache.maven.project.DefaultProjectBuilder.build(DefaultProjectBuilder.java:495)
	at org.apache.maven.project.DefaultProjectBuilder.build(DefaultProjectBuilder.java:379)
	at org.apache.maven.project.DefaultProjectBuilder.build(DefaultProjectBuilder.java:495)
	at org.apache.maven.project.DefaultProjectBuilder.build(DefaultProjectBuilder.java:379)
	at org.apache.maven.project.DefaultProjectBuilder.build(DefaultProjectBuilder.java:343)
	at org.apache.maven.DefaultMaven.collectProjects(DefaultMaven.java:636)
	at org.apache.maven.DefaultMaven.getProjectsForMavenReactor(DefaultMaven.java:585)
	at org.apache.maven.DefaultMaven.doExecute(DefaultMaven.java:234)
	at org.apache.maven.DefaultMaven.execute(DefaultMaven.java:156)
	at org.apache.maven.cli.MavenCli.execute(MavenCli.java:537)
	at org.apache.maven.cli.MavenCli.doMain(MavenCli.java:196)
	at org.apache.maven.cli.MavenCli.main(MavenCli.java:141)
	at sun.reflect.NativeMethodAccessorImpl.invoke0(Native Method)
	at sun.reflect.NativeMethodAccessorImpl.invoke(NativeMethodAccessorImpl.java:39)
	at sun.reflect.DelegatingMethodAccessorImpl.invoke(DelegatingMethodAccessorImpl.java:25)
	at java.lang.reflect.Method.invoke(Method.java:597)
	at org.codehaus.plexus.classworlds.launcher.Launcher.launchEnhanced(Launcher.java:290)
	at org.codehaus.plexus.classworlds.launcher.Launcher.launch(Launcher.java:230)
	at org.codehaus.plexus.classworlds.launcher.Launcher.mainWithExitCode(Launcher.java:409)
	at org.codehaus.plexus.classworlds.launcher.Launcher.main(Launcher.java:352)
Caused by: org.sonatype.aether.resolution.ArtifactResolutionException: Failure to find org.jboss.tools.openshift:features:pom:2.5.0-SNAPSHOT in https://repository.jboss.org/nexus/content/groups/developer/ was cached in the local repository, resolution will not be reattempted until the update interval of jboss-developer-repository-group has elapsed or updates are forced
	at org.sonatype.aether.impl.internal.DefaultArtifactResolver.resolve(DefaultArtifactResolver.java:538)
	at org.sonatype.aether.impl.internal.DefaultArtifactResolver.resolveArtifacts(DefaultArtifactResolver.java:216)
	at org.sonatype.aether.impl.internal.DefaultArtifactResolver.resolveArtifact(DefaultArtifactResolver.java:193)
	at org.sonatype.aether.impl.internal.DefaultRepositorySystem.resolveArtifact(DefaultRepositorySystem.java:286)
	at org.apache.maven.project.ProjectModelResolver.resolveModel(ProjectModelResolver.java:155)
	... 26 more
Caused by: org.sonatype.aether.transfer.ArtifactNotFoundException: Failure to find org.jboss.tools.openshift:features:pom:2.5.0-SNAPSHOT in https://repository.jboss.org/nexus/content/groups/developer/ was cached in the local repository, resolution will not be reattempted until the update interval of jboss-developer-repository-group has elapsed or updates are forced
	at org.sonatype.aether.impl.internal.DefaultUpdateCheckManager.newException(DefaultUpdateCheckManager.java:230)
	at org.sonatype.aether.impl.internal.DefaultUpdateCheckManager.checkArtifact(DefaultUpdateCheckManager.java:176)
	at org.sonatype.aether.impl.internal.DefaultArtifactResolver.resolve(DefaultArtifactResolver.java:427)
	... 30 more
[ERROR]   
[ERROR]   The project org.jboss.tools.openshift.features:org.jboss.tools.openshift.express.test.feature:2.5.0-SNAPSHOT (<http://jenkins.mw.lab.eng.bos.redhat.com/hudson/job/jbosstools-openshift_master/ws/sources/features/org.jboss.tools.openshift.express.test.feature/pom.xml)> has 1 error
[ERROR]     Non-resolvable parent POM: Failure to find org.jboss.tools.openshift:features:pom:2.5.0-SNAPSHOT in https://repository.jboss.org/nexus/content/groups/developer/ was cached in the local repository, resolution will not be reattempted until the update interval of jboss-developer-repository-group has elapsed or updates are forced and 'parent.relativePath' points at wrong local POM @ line 4, column 10 -> [Help 2]
org.apache.maven.model.resolution.UnresolvableModelException: Failure to find org.jboss.tools.openshift:features:pom:2.5.0-SNAPSHOT in https://repository.jboss.org/nexus/content/groups/developer/ was cached in the local repository, resolution will not be reattempted until the update interval of jboss-developer-repository-group has elapsed or updates are forced
	at org.apache.maven.project.ProjectModelResolver.resolveModel(ProjectModelResolver.java:159)
	at org.apache.maven.model.building.DefaultModelBuilder.readParentExternally(DefaultModelBuilder.java:813)
	at org.apache.maven.model.building.DefaultModelBuilder.readParent(DefaultModelBuilder.java:664)
	at org.apache.maven.model.building.DefaultModelBuilder.build(DefaultModelBuilder.java:310)
	at org.apache.maven.model.building.DefaultModelBuilder.build(DefaultModelBuilder.java:232)
	at org.apache.maven.project.DefaultProjectBuilder.build(DefaultProjectBuilder.java:410)
	at org.apache.maven.project.DefaultProjectBuilder.build(DefaultProjectBuilder.java:379)
	at org.apache.maven.project.DefaultProjectBuilder.build(DefaultProjectBuilder.java:495)
	at org.apache.maven.project.DefaultProjectBuilder.build(DefaultProjectBuilder.java:379)
	at org.apache.maven.project.DefaultProjectBuilder.build(DefaultProjectBuilder.java:495)
	at org.apache.maven.project.DefaultProjectBuilder.build(DefaultProjectBuilder.java:379)
	at org.apache.maven.project.DefaultProjectBuilder.build(DefaultProjectBuilder.java:343)
	at org.apache.maven.DefaultMaven.collectProjects(DefaultMaven.java:636)
	at org.apache.maven.DefaultMaven.getProjectsForMavenReactor(DefaultMaven.java:585)
	at org.apache.maven.DefaultMaven.doExecute(DefaultMaven.java:234)
	at org.apache.maven.DefaultMaven.execute(DefaultMaven.java:156)
	at org.apache.maven.cli.MavenCli.execute(MavenCli.java:537)
	at org.apache.maven.cli.MavenCli.doMain(MavenCli.java:196)
	at org.apache.maven.cli.MavenCli.main(MavenCli.java:141)
	at sun.reflect.NativeMethodAccessorImpl.invoke0(Native Method)
	at sun.reflect.NativeMethodAccessorImpl.invoke(NativeMethodAccessorImpl.java:39)
	at sun.reflect.DelegatingMethodAccessorImpl.invoke(DelegatingMethodAccessorImpl.java:25)
	at java.lang.reflect.Method.invoke(Method.java:597)
	at org.codehaus.plexus.classworlds.launcher.Launcher.launchEnhanced(Launcher.java:290)
	at org.codehaus.plexus.classworlds.launcher.Launcher.launch(Launcher.java:230)
	at org.codehaus.plexus.classworlds.launcher.Launcher.mainWithExitCode(Launcher.java:409)
	at org.codehaus.plexus.classworlds.launcher.Launcher.main(Launcher.java:352)
Caused by: org.sonatype.aether.resolution.ArtifactResolutionException: Failure to find org.jboss.tools.openshift:features:pom:2.5.0-SNAPSHOT in https://repository.jboss.org/nexus/content/groups/developer/ was cached in the local repository, resolution will not be reattempted until the update interval of jboss-developer-repository-group has elapsed or updates are forced
	at org.sonatype.aether.impl.internal.DefaultArtifactResolver.resolve(DefaultArtifactResolver.java:538)
	at org.sonatype.aether.impl.internal.DefaultArtifactResolver.resolveArtifacts(DefaultArtifactResolver.java:216)
	at org.sonatype.aether.impl.internal.DefaultArtifactResolver.resolveArtifact(DefaultArtifactResolver.java:193)
	at org.sonatype.aether.impl.internal.DefaultRepositorySystem.resolveArtifact(DefaultRepositorySystem.java:286)
	at org.apache.maven.project.ProjectModelResolver.resolveModel(ProjectModelResolver.java:155)
	... 26 more
Caused by: org.sonatype.aether.transfer.ArtifactNotFoundException: Failure to find org.jboss.tools.openshift:features:pom:2.5.0-SNAPSHOT in https://repository.jboss.org/nexus/content/groups/developer/ was cached in the local repository, resolution will not be reattempted until the update interval of jboss-developer-repository-group has elapsed or updates are forced
	at org.sonatype.aether.impl.internal.DefaultUpdateCheckManager.newException(DefaultUpdateCheckManager.java:230)
	at org.sonatype.aether.impl.internal.DefaultUpdateCheckManager.checkArtifact(DefaultUpdateCheckManager.java:176)
	at org.sonatype.aether.impl.internal.DefaultArtifactResolver.resolve(DefaultArtifactResolver.java:427)
	... 30 more
[ERROR] 
[ERROR] Re-run Maven using the -X switch to enable full debug logging.
[ERROR] 
[ERROR] For more information about the errors and possible solutions, please read the following articles:
[ERROR] [Help 1] http://cwiki.apache.org/confluence/display/MAVEN/ProjectBuildingException
[ERROR] [Help 2] http://cwiki.apache.org/confluence/display/MAVEN/UnresolvableModelException
Build step 'Invoke top-level Maven targets' marked build as failure
Terminating xvnc.
$ vncserver -kill :15
Killing Xvnc process ID 10085
Archiving artifacts
Recording test results
Description set: 


More information about the jbosstools-builds mailing list