[jbosstools-builds] Build failed in Jenkins: jbosstools-4.1_trunk.component--javaee #244

ci-builds at redhat.com ci-builds at redhat.com
Fri Jan 18 22:03:44 EST 2013


See <http://jenkins.mw.lab.eng.bos.redhat.com/hudson/job/jbosstools-4.1_trunk.component--javaee/244/>

------------------------------------------
[...truncated 18857 lines...]
[INFO] Building jar: <http://jenkins.mw.lab.eng.bos.redhat.com/hudson/job/jbosstools-4.1_trunk.component--javaee/ws/sources/struts/tests/org.jboss.tools.struts.vpe.struts.test/target/org.jboss.tools.struts.vpe.struts.test-3.4.0-SNAPSHOT.jar>
[INFO] 
[INFO] --- tycho-p2-plugin:0.16.0:p2-metadata-default (default-p2-metadata-default) @ org.jboss.tools.struts.vpe.struts.test ---
[INFO] 
[INFO] --- tycho-surefire-plugin:0.16.0:test (default-test) @ org.jboss.tools.struts.vpe.struts.test ---
[WARNING] p2 repository with URL http://download.jboss.org/jbosstools/builds/staging/_composite_/core/trunk is associated with multiple IDs; was 'jbosstools-tests-site', now is 'jbosstools-site'
[WARNING] p2 repository with URL http://download.jboss.org/jbosstools/builds/staging/_composite_/core/trunk is associated with multiple IDs; was 'jbosstools-site', now is 'jbosstools-tests-site'
[INFO] Downloading org.jboss.tools.vpe.base.test
[INFO] Fetching org.jboss.tools.vpe.base.test_3.4.0.Alpha1-v20130119-0021-B256.jar from http://download.jboss.org/jbosstools/builds/staging/jbosstools-4.1_trunk.component--vpe/all/repo/plugins/ (0B of 31.63kB at 0B/s)
[INFO] 1 operation remaining.
[INFO] Fetching org.jboss.tools.vpe.base.test_3.4.0.Alpha1-v20130119-0021-B256.jar from http://download.jboss.org/jbosstools/builds/staging/jbosstools-4.1_trunk.component--vpe/all/repo/plugins/ (3.7kB of 31.63kB at 0B/s)
[INFO] Downloading org.jboss.tools.vpe.jsp
[INFO] Fetching org.jboss.tools.vpe.jsp_3.4.0.Alpha1-v20130119-0021-B256.jar from http://download.jboss.org/jbosstools/builds/staging/jbosstools-4.1_trunk.component--vpe/all/repo/plugins/ (0B of 5.14kB at 0B/s)
[INFO] 1 operation remaining.
[INFO] Fetching org.jboss.tools.vpe.jsp_3.4.0.Alpha1-v20130119-0021-B256.jar from http://download.jboss.org/jbosstools/builds/staging/jbosstools-4.1_trunk.component--vpe/all/repo/plugins/ (4kB of 5.14kB at 0B/s)
[WARNING] The following locally built units have been used to resolve project dependencies:
[WARNING]   org.jboss.tools.struts.text.ext/3.4.0.Alpha1-v20130118-2040-B244
[WARNING]   org.jboss.tools.struts.vpe.struts/3.4.0.Alpha1-v20130118-2040-B244
[WARNING]   org.jboss.tools.struts/3.4.0.Alpha1-v20130118-2040-B244
[INFO] Expected eclipse log file: /qa/hudson_workspace/workspace/jbosstools-4.1_trunk.component--javaee/sources/struts/tests/org.jboss.tools.struts.vpe.struts.test/target/work/data/.metadata/.log
[INFO] Command line:
	/bin/sh -c cd <http://jenkins.mw.lab.eng.bos.redhat.com/hudson/job/jbosstools-4.1_trunk.component--javaee/ws/sources/struts/tests/org.jboss.tools.struts.vpe.struts.test> && /qa/tools/opt/x86_64/jdk1.6.0_38/jre/bin/java -Dosgi.noShutdown=false -Dosgi.os=linux -Dosgi.ws=gtk -Dosgi.arch=x86_64 '-javaagent:<http://jenkins.mw.lab.eng.bos.redhat.com/hudson/job/jbosstools-4.1_trunk.component--javaee/ws/.repository/org/jacoco/org.jacoco.agent/0.5.7.201204190339/org.jacoco.agent-0.5.7.201204190339-runtime.jar=destfile=/qa/services/hudson/hudson_workspace/workspace/jbosstools-4.1_trunk.component--javaee/sources/struts/target/jacoco.exec,append=true,includes=org.jboss.tools*'> -Xms512m -Xmx1024m -XX:PermSize=256m -XX:MaxPermSize=256m -Dusage_reporting_enabled=false -Dorg.jboss.tools.tests.skipPrivateRequirements=false -jar /qa/hudson_workspace/workspace/jbosstools-4.1_trunk.component--javaee/.repository/p2/osgi/bundle/org.eclipse.equinox.launcher/1.3.0.v20121114-150939/org.eclipse.equinox.launcher-1.3.0.v20121114-150939.jar -data <http://jenkins.mw.lab.eng.bos.redhat.com/hudson/job/jbosstools-4.1_trunk.component--javaee/ws/sources/struts/tests/org.jboss.tools.struts.vpe.struts.test/target/work/data> -install <http://jenkins.mw.lab.eng.bos.redhat.com/hudson/job/jbosstools-4.1_trunk.component--javaee/ws/sources/struts/tests/org.jboss.tools.struts.vpe.struts.test/target/work> -configuration <http://jenkins.mw.lab.eng.bos.redhat.com/hudson/job/jbosstools-4.1_trunk.component--javaee/ws/sources/struts/tests/org.jboss.tools.struts.vpe.struts.test/target/work/configuration> -application org.eclipse.tycho.surefire.osgibooter.uitest -testproperties <http://jenkins.mw.lab.eng.bos.redhat.com/hudson/job/jbosstools-4.1_trunk.component--javaee/ws/sources/struts/tests/org.jboss.tools.struts.vpe.struts.test/target/surefire.properties> -testApplication org.eclipse.ui.ide.workbench -product org.jboss.tools.tests

-------------------------------------------------------
 T E S T S
-------------------------------------------------------
Running org.jboss.tools.struts.vpe.struts.test.StrutsAllTests
Tests run: 89, Failures: 0, Errors: 0, Skipped: 0, Time elapsed: 42.449 sec

Results :

Tests run: 89, Failures: 0, Errors: 0, Skipped: 0

[INFO] All tests passed!
[INFO]                                                                         
[INFO] ------------------------------------------------------------------------
[INFO] Building javaee.all.tests 4.0.0-SNAPSHOT
[INFO] ------------------------------------------------------------------------
[INFO] 
[INFO] --- jacoco-maven-plugin:0.5.7.201204190339:prepare-agent (default) @ javaee.all.tests ---
[INFO] Skipping JaCoCo for project with packaging type 'pom'
[INFO] 
[INFO] --- tycho-source-plugin:0.16.0:plugin-source (plugin-source) @ javaee.all.tests ---
[INFO] ------------------------------------------------------------------------
[INFO] Reactor Summary:
[INFO] 
[INFO] cdi.tests ......................................... SUCCESS [2.692s]
[INFO] org.jboss.tools.cdi.core.test ..................... SUCCESS [4:17.138s]
[INFO] org.jboss.tools.cdi.seam.solder.core.test ......... SUCCESS [1:54.456s]
[INFO] org.jboss.tools.cdi.seam.config.core.test ......... SUCCESS [1:26.526s]
[INFO] org.jboss.tools.cdi.seam.config.ui.test ........... SUCCESS [1:12.641s]
[INFO] org.jboss.tools.cdi.seam.core.test ................ SUCCESS [1:22.178s]
[INFO] org.jboss.tools.cdi.seam.faces.core.test .......... SUCCESS [1:23.252s]
[INFO] org.jboss.tools.cdi.text.ext.test ................. SUCCESS [2:45.194s]
[INFO] org.jboss.tools.cdi.seam.text.ext.test ............ SUCCESS [2:17.176s]
[INFO] org.jboss.tools.cdi.ui.test ....................... SUCCESS [5:17.352s]
[INFO] org.jboss.tools.cdi.deltaspike.core.test .......... SUCCESS [1:00.795s]
[INFO] jsf.tests ......................................... SUCCESS [0.020s]
[INFO] org.jboss.tools.jsf.base.test ..................... SUCCESS [1.548s]
[INFO] org.jboss.tools.jsf.test .......................... SUCCESS [2:29.650s]
[INFO] org.jboss.tools.jsf.text.ext.test ................. SUCCESS [1:49.053s]
[INFO] org.jboss.tools.jsf.ui.test ....................... SUCCESS [9:58.389s]
[INFO] org.jboss.tools.jsf.verification.test ............. SUCCESS [41.836s]
[INFO] org.jboss.tools.jsf.vpe.ajax4jsf.test ............. SUCCESS [1:06.177s]
[INFO] org.jboss.tools.jsf.vpe.facelets.test ............. SUCCESS [1:08.438s]
[INFO] org.jboss.tools.jsf.vpe.jbpm.test ................. FAILURE [1:00:34.178s]
[INFO] org.jboss.tools.jsf.vpe.jsf.test .................. SUCCESS [5:34.738s]
[INFO] org.jboss.tools.jsf.vpe.jstl.test ................. SUCCESS [1:15.868s]
[INFO] org.jboss.tools.jsf.vpe.myfaces.test .............. SUCCESS [1:14.930s]
[INFO] org.jboss.tools.jsf.vpe.richfaces.test ............ FAILURE [1:00:34.657s]
[INFO] org.jboss.tools.jsf.vpe.seam.test ................. FAILURE [1:00:54.364s]
[INFO] seam.tests ........................................ SUCCESS [0.038s]
[INFO] org.jboss.tools.seam.base.test .................... SUCCESS [6.256s]
[INFO] org.jboss.tools.seam.core.test .................... SUCCESS [6:39.555s]
[INFO] org.jboss.tools.seam.pages.xml.test ............... SUCCESS [39.678s]
[INFO] org.jboss.tools.seam.ui.test ...................... SUCCESS [10:42.612s]
[INFO] org.jboss.tools.seam.xml.test ..................... SUCCESS [22.940s]
[INFO] org.jboss.tools.seam121EAP.core.test .............. SUCCESS [1:58.284s]
[INFO] org.jboss.tools.seam121EAP.ui.test ................ SUCCESS [2:03.632s]
[INFO] org.jboss.tools.seam201GA.core.test ............... SUCCESS [2:35.213s]
[INFO] org.jboss.tools.seam201GA.ui.test ................. SUCCESS [2:12.190s]
[INFO] org.jboss.tools.seam202SP1.core.test .............. SUCCESS [2:45.850s]
[INFO] org.jboss.tools.seam202SP1.ui.test ................ SUCCESS [2:08.330s]
[INFO] org.jboss.tools.seam203CR1.core.test .............. SUCCESS [3:00.560s]
[INFO] org.jboss.tools.seam203CR1.ui.test ................ SUCCESS [2:12.761s]
[INFO] org.jboss.tools.seam211GA.core.test ............... SUCCESS [3:17.996s]
[INFO] org.jboss.tools.seam211GA.ui.test ................. SUCCESS [2:49.143s]
[INFO] org.jboss.tools.seam212GA.core.test ............... SUCCESS [3:31.856s]
[INFO] org.jboss.tools.seam212GA.ui.test ................. SUCCESS [2:39.457s]
[INFO] org.jboss.tools.seam220CR1.core.test .............. SUCCESS [3:21.470s]
[INFO] org.jboss.tools.seam220CR1.ui.test ................ SUCCESS [2:32.609s]
[INFO] org.jboss.tools.seam220GA.core.test ............... SUCCESS [3:05.163s]
[INFO] org.jboss.tools.seam220GA.ui.test ................. SUCCESS [2:23.026s]
[INFO] org.jboss.tools.seam221GA.core.test ............... SUCCESS [3:03.206s]
[INFO] org.jboss.tools.seam221GA.ui.test ................. SUCCESS [2:28.363s]
[INFO] org.jboss.tools.seam230.core.test ................. SUCCESS [3:05.799s]
[INFO] org.jboss.tools.seam230.ui.test ................... SUCCESS [2:02.380s]
[INFO] org.jboss.tools.seamfp.core.test .................. SUCCESS [2:49.380s]
[INFO] org.jboss.tools.seamfp.ui.test .................... SUCCESS [2:31.139s]
[INFO] org.jboss.tools.runtime.seam.detector.test ........ SUCCESS [3:12.094s]
[INFO] struts.tests ...................................... SUCCESS [0.022s]
[INFO] org.jboss.tools.struts.text.ext.test .............. SUCCESS [49.903s]
[INFO] org.jboss.tools.struts.vpe.struts.test ............ SUCCESS [1:24.833s]
[INFO] javaee.all.tests .................................. SUCCESS [0.012s]
[INFO] ------------------------------------------------------------------------
[INFO] BUILD FAILURE
[INFO] ------------------------------------------------------------------------
[INFO] Total time: 5:22:45.649s
[INFO] Finished at: Fri Jan 18 22:03:07 EST 2013
[INFO] Final Memory: 205M/558M
[INFO] ------------------------------------------------------------------------
[ERROR] Failed to execute goal org.eclipse.tycho:tycho-surefire-plugin:0.16.0:test (default-test) on project org.jboss.tools.jsf.vpe.jbpm.test: Error while executing platform: org.codehaus.plexus.util.cli.CommandLineTimeOutException: Error while executing external command, process killed. Process timeout out after 3600 seconds -> [Help 1]
org.apache.maven.lifecycle.LifecycleExecutionException: Failed to execute goal org.eclipse.tycho:tycho-surefire-plugin:0.16.0:test (default-test) on project org.jboss.tools.jsf.vpe.jbpm.test: Error while executing platform
	at org.apache.maven.lifecycle.internal.MojoExecutor.execute(MojoExecutor.java:217)
	at org.apache.maven.lifecycle.internal.MojoExecutor.execute(MojoExecutor.java:153)
	at org.apache.maven.lifecycle.internal.MojoExecutor.execute(MojoExecutor.java:145)
	at org.apache.maven.lifecycle.internal.LifecycleModuleBuilder.buildProject(LifecycleModuleBuilder.java:84)
	at org.apache.maven.lifecycle.internal.LifecycleModuleBuilder.buildProject(LifecycleModuleBuilder.java:59)
	at org.apache.maven.lifecycle.internal.LifecycleStarter.singleThreadedBuild(LifecycleStarter.java:183)
	at org.apache.maven.lifecycle.internal.LifecycleStarter.execute(LifecycleStarter.java:161)
	at org.apache.maven.DefaultMaven.doExecute(DefaultMaven.java:320)
	at org.apache.maven.DefaultMaven.execute(DefaultMaven.java:156)
	at org.apache.maven.cli.MavenCli.execute(MavenCli.java:537)
	at org.apache.maven.cli.MavenCli.doMain(MavenCli.java:196)
	at org.apache.maven.cli.MavenCli.main(MavenCli.java:141)
	at sun.reflect.NativeMethodAccessorImpl.invoke0(Native Method)
	at sun.reflect.NativeMethodAccessorImpl.invoke(NativeMethodAccessorImpl.java:39)
	at sun.reflect.DelegatingMethodAccessorImpl.invoke(DelegatingMethodAccessorImpl.java:25)
	at java.lang.reflect.Method.invoke(Method.java:597)
	at org.codehaus.plexus.classworlds.launcher.Launcher.launchEnhanced(Launcher.java:290)
	at org.codehaus.plexus.classworlds.launcher.Launcher.launch(Launcher.java:230)
	at org.codehaus.plexus.classworlds.launcher.Launcher.mainWithExitCode(Launcher.java:409)
	at org.codehaus.plexus.classworlds.launcher.Launcher.main(Launcher.java:352)
Caused by: org.apache.maven.plugin.MojoExecutionException: Error while executing platform
	at org.eclipse.tycho.surefire.TestMojo.runTest(TestMojo.java:670)
	at org.eclipse.tycho.surefire.TestMojo.execute(TestMojo.java:452)
	at org.apache.maven.plugin.DefaultBuildPluginManager.executeMojo(DefaultBuildPluginManager.java:101)
	at org.apache.maven.lifecycle.internal.MojoExecutor.execute(MojoExecutor.java:209)
	... 19 more
Caused by: org.eclipse.sisu.equinox.launching.EquinoxLaunchingException: org.codehaus.plexus.util.cli.CommandLineTimeOutException: Error while executing external command, process killed.
	at org.eclipse.sisu.equinox.launching.internal.DefaultEquinoxLauncher.execute(DefaultEquinoxLauncher.java:74)
	at org.eclipse.tycho.surefire.TestMojo.runTest(TestMojo.java:668)
	... 22 more
Caused by: org.codehaus.plexus.util.cli.CommandLineTimeOutException: Error while executing external command, process killed.
	at org.codehaus.plexus.util.cli.CommandLineUtils$1.call(CommandLineUtils.java:213)
	at org.codehaus.plexus.util.cli.CommandLineUtils.executeCommandLine(CommandLineUtils.java:114)
	at org.codehaus.plexus.util.cli.CommandLineUtils.executeCommandLine(CommandLineUtils.java:88)
	at org.eclipse.sisu.equinox.launching.internal.DefaultEquinoxLauncher.execute(DefaultEquinoxLauncher.java:72)
	... 23 more
Caused by: java.lang.InterruptedException: Process timeout out after 3600 seconds
	at org.codehaus.plexus.util.cli.CommandLineUtils$1.call(CommandLineUtils.java:186)
	... 26 more
[ERROR] Failed to execute goal org.eclipse.tycho:tycho-surefire-plugin:0.16.0:test (default-test) on project org.jboss.tools.jsf.vpe.richfaces.test: Error while executing platform: org.codehaus.plexus.util.cli.CommandLineTimeOutException: Error while executing external command, process killed. Process timeout out after 3600 seconds -> [Help 1]
org.apache.maven.lifecycle.LifecycleExecutionException: Failed to execute goal org.eclipse.tycho:tycho-surefire-plugin:0.16.0:test (default-test) on project org.jboss.tools.jsf.vpe.richfaces.test: Error while executing platform
	at org.apache.maven.lifecycle.internal.MojoExecutor.execute(MojoExecutor.java:217)
	at org.apache.maven.lifecycle.internal.MojoExecutor.execute(MojoExecutor.java:153)
	at org.apache.maven.lifecycle.internal.MojoExecutor.execute(MojoExecutor.java:145)
	at org.apache.maven.lifecycle.internal.LifecycleModuleBuilder.buildProject(LifecycleModuleBuilder.java:84)
	at org.apache.maven.lifecycle.internal.LifecycleModuleBuilder.buildProject(LifecycleModuleBuilder.java:59)
	at org.apache.maven.lifecycle.internal.LifecycleStarter.singleThreadedBuild(LifecycleStarter.java:183)
	at org.apache.maven.lifecycle.internal.LifecycleStarter.execute(LifecycleStarter.java:161)
	at org.apache.maven.DefaultMaven.doExecute(DefaultMaven.java:320)
	at org.apache.maven.DefaultMaven.execute(DefaultMaven.java:156)
	at org.apache.maven.cli.MavenCli.execute(MavenCli.java:537)
	at org.apache.maven.cli.MavenCli.doMain(MavenCli.java:196)
	at org.apache.maven.cli.MavenCli.main(MavenCli.java:141)
	at sun.reflect.NativeMethodAccessorImpl.invoke0(Native Method)
	at sun.reflect.NativeMethodAccessorImpl.invoke(NativeMethodAccessorImpl.java:39)
	at sun.reflect.DelegatingMethodAccessorImpl.invoke(DelegatingMethodAccessorImpl.java:25)
	at java.lang.reflect.Method.invoke(Method.java:597)
	at org.codehaus.plexus.classworlds.launcher.Launcher.launchEnhanced(Launcher.java:290)
	at org.codehaus.plexus.classworlds.launcher.Launcher.launch(Launcher.java:230)
	at org.codehaus.plexus.classworlds.launcher.Launcher.mainWithExitCode(Launcher.java:409)
	at org.codehaus.plexus.classworlds.launcher.Launcher.main(Launcher.java:352)
Caused by: org.apache.maven.plugin.MojoExecutionException: Error while executing platform
	at org.eclipse.tycho.surefire.TestMojo.runTest(TestMojo.java:670)
	at org.eclipse.tycho.surefire.TestMojo.execute(TestMojo.java:452)
	at org.apache.maven.plugin.DefaultBuildPluginManager.executeMojo(DefaultBuildPluginManager.java:101)
	at org.apache.maven.lifecycle.internal.MojoExecutor.execute(MojoExecutor.java:209)
	... 19 more
Caused by: org.eclipse.sisu.equinox.launching.EquinoxLaunchingException: org.codehaus.plexus.util.cli.CommandLineTimeOutException: Error while executing external command, process killed.
	at org.eclipse.sisu.equinox.launching.internal.DefaultEquinoxLauncher.execute(DefaultEquinoxLauncher.java:74)
	at org.eclipse.tycho.surefire.TestMojo.runTest(TestMojo.java:668)
	... 22 more
Caused by: org.codehaus.plexus.util.cli.CommandLineTimeOutException: Error while executing external command, process killed.
	at org.codehaus.plexus.util.cli.CommandLineUtils$1.call(CommandLineUtils.java:213)
	at org.codehaus.plexus.util.cli.CommandLineUtils.executeCommandLine(CommandLineUtils.java:114)
	at org.codehaus.plexus.util.cli.CommandLineUtils.executeCommandLine(CommandLineUtils.java:88)
	at org.eclipse.sisu.equinox.launching.internal.DefaultEquinoxLauncher.execute(DefaultEquinoxLauncher.java:72)
	... 23 more
Caused by: java.lang.InterruptedException: Process timeout out after 3600 seconds
	at org.codehaus.plexus.util.cli.CommandLineUtils$1.call(CommandLineUtils.java:186)
	... 26 more
[ERROR] Failed to execute goal org.eclipse.tycho:tycho-surefire-plugin:0.16.0:test (default-test) on project org.jboss.tools.jsf.vpe.seam.test: Error while executing platform: org.codehaus.plexus.util.cli.CommandLineTimeOutException: Error while executing external command, process killed. Process timeout out after 3600 seconds -> [Help 1]
org.apache.maven.lifecycle.LifecycleExecutionException: Failed to execute goal org.eclipse.tycho:tycho-surefire-plugin:0.16.0:test (default-test) on project org.jboss.tools.jsf.vpe.seam.test: Error while executing platform
	at org.apache.maven.lifecycle.internal.MojoExecutor.execute(MojoExecutor.java:217)
	at org.apache.maven.lifecycle.internal.MojoExecutor.execute(MojoExecutor.java:153)
	at org.apache.maven.lifecycle.internal.MojoExecutor.execute(MojoExecutor.java:145)
	at org.apache.maven.lifecycle.internal.LifecycleModuleBuilder.buildProject(LifecycleModuleBuilder.java:84)
	at org.apache.maven.lifecycle.internal.LifecycleModuleBuilder.buildProject(LifecycleModuleBuilder.java:59)
	at org.apache.maven.lifecycle.internal.LifecycleStarter.singleThreadedBuild(LifecycleStarter.java:183)
	at org.apache.maven.lifecycle.internal.LifecycleStarter.execute(LifecycleStarter.java:161)
	at org.apache.maven.DefaultMaven.doExecute(DefaultMaven.java:320)
	at org.apache.maven.DefaultMaven.execute(DefaultMaven.java:156)
	at org.apache.maven.cli.MavenCli.execute(MavenCli.java:537)
	at org.apache.maven.cli.MavenCli.doMain(MavenCli.java:196)
	at org.apache.maven.cli.MavenCli.main(MavenCli.java:141)
	at sun.reflect.NativeMethodAccessorImpl.invoke0(Native Method)
	at sun.reflect.NativeMethodAccessorImpl.invoke(NativeMethodAccessorImpl.java:39)
	at sun.reflect.DelegatingMethodAccessorImpl.invoke(DelegatingMethodAccessorImpl.java:25)
	at java.lang.reflect.Method.invoke(Method.java:597)
	at org.codehaus.plexus.classworlds.launcher.Launcher.launchEnhanced(Launcher.java:290)
	at org.codehaus.plexus.classworlds.launcher.Launcher.launch(Launcher.java:230)
	at org.codehaus.plexus.classworlds.launcher.Launcher.mainWithExitCode(Launcher.java:409)
	at org.codehaus.plexus.classworlds.launcher.Launcher.main(Launcher.java:352)
Caused by: org.apache.maven.plugin.MojoExecutionException: Error while executing platform
	at org.eclipse.tycho.surefire.TestMojo.runTest(TestMojo.java:670)
	at org.eclipse.tycho.surefire.TestMojo.execute(TestMojo.java:452)
	at org.apache.maven.plugin.DefaultBuildPluginManager.executeMojo(DefaultBuildPluginManager.java:101)
	at org.apache.maven.lifecycle.internal.MojoExecutor.execute(MojoExecutor.java:209)
	... 19 more
Caused by: org.eclipse.sisu.equinox.launching.EquinoxLaunchingException: org.codehaus.plexus.util.cli.CommandLineTimeOutException: Error while executing external command, process killed.
	at org.eclipse.sisu.equinox.launching.internal.DefaultEquinoxLauncher.execute(DefaultEquinoxLauncher.java:74)
	at org.eclipse.tycho.surefire.TestMojo.runTest(TestMojo.java:668)
	... 22 more
Caused by: org.codehaus.plexus.util.cli.CommandLineTimeOutException: Error while executing external command, process killed.
	at org.codehaus.plexus.util.cli.CommandLineUtils$1.call(CommandLineUtils.java:213)
	at org.codehaus.plexus.util.cli.CommandLineUtils.executeCommandLine(CommandLineUtils.java:114)
	at org.codehaus.plexus.util.cli.CommandLineUtils.executeCommandLine(CommandLineUtils.java:88)
	at org.eclipse.sisu.equinox.launching.internal.DefaultEquinoxLauncher.execute(DefaultEquinoxLauncher.java:72)
	... 23 more
Caused by: java.lang.InterruptedException: Process timeout out after 3600 seconds
	at org.codehaus.plexus.util.cli.CommandLineUtils$1.call(CommandLineUtils.java:186)
	... 26 more
[ERROR] 
[ERROR] Re-run Maven using the -X switch to enable full debug logging.
[ERROR] 
[ERROR] For more information about the errors and possible solutions, please read the following articles:
[ERROR] [Help 1] http://cwiki.apache.org/confluence/display/MAVEN/MojoExecutionException
[ERROR] 
[ERROR] After correcting the problems, you can resume the build with the command
[ERROR]   mvn <goals> -rf :org.jboss.tools.jsf.vpe.jbpm.test
Build step 'Invoke top-level Maven targets' marked build as failure
Terminating xvnc.
$ vncserver -kill :135
Killing Xvnc process ID 2272
Archiving artifacts
Recording test results
Description set: 




More information about the jbosstools-builds mailing list