[jbosstools-builds] Build failed in Jenkins: jbosstools-vpe_master #446

ci-builds at redhat.com ci-builds at redhat.com
Mon Nov 11 08:25:31 EST 2013


See <http://jenkins.mw.lab.eng.bos.redhat.com/hudson/job/jbosstools-vpe_master/446/changes>

Changes:

[yradtsevich] JBIDE-15640 BrowserSim: use JavaFX WebView as a browser engine

------------------------------------------
[...truncated 4747 lines...]
[INFO] 
[INFO] --- jacoco-maven-plugin:0.6.1.201212231917:prepare-agent (default) @ org.jboss.tools.xulrunner.feature ---
[INFO] argLine set to -javaagent:<http://jenkins.mw.lab.eng.bos.redhat.com/hudson/job/jbosstools-vpe_master/ws/.repository/org/jacoco/org.jacoco.agent/0.6.1.201212231917/org.jacoco.agent-0.6.1.201212231917-runtime.jar=destfile=/mnt/hudson_workspace/workspace/jbosstools-vpe_master/sources/target/jacoco.exec,append=true,includes=org.jboss.tools.*>
[INFO] 
[INFO] --- tycho-source-plugin:0.19.0:plugin-source (plugin-source) @ org.jboss.tools.xulrunner.feature ---
[INFO] 
[INFO] --- tycho-packaging-plugin:0.19.0:package-feature (default-package-feature) @ org.jboss.tools.xulrunner.feature ---
[INFO] Building jar: <http://jenkins.mw.lab.eng.bos.redhat.com/hudson/job/jbosstools-vpe_master/ws/sources/features/org.jboss.tools.xulrunner.feature/target/org.jboss.tools.xulrunner.feature-3.5.100-SNAPSHOT.jar>
[INFO] 
[INFO] --- tycho-p2-plugin:0.19.0:p2-metadata-default (default-p2-metadata-default) @ org.jboss.tools.xulrunner.feature ---
[INFO] 
[INFO] --- tycho-p2-plugin:0.19.0:feature-p2-metadata (default-feature-p2-metadata) @ org.jboss.tools.xulrunner.feature ---
[INFO] 
[INFO] --- repository-utils:0.16.0.CR2:generate-repository-facade (generate-facade) @ org.jboss.tools.xulrunner.feature ---
[INFO] 
[INFO] --- tycho-pack200b-plugin:0.19.0:pack (pack200-pack) @ org.jboss.tools.xulrunner.feature ---
[INFO] 
[INFO] --- tycho-source-feature-plugin:0.19.0:source-feature (source-feature) @ org.jboss.tools.xulrunner.feature ---
[INFO] Fetching org.mozilla.xpcom.source_1.9.2.16.jar from http://download.jboss.org/jbosstools/builds/staging/jbosstools-vpe_master/all/repo/plugins/ (0B of 548.07kB at 0B/s)
[INFO] Fetching org.mozilla.xulrunner.cocoa.macosx.source_1.9.2.16.jar from http://download.jboss.org/jbosstools/builds/staging/jbosstools-vpe_master/all/repo/plugins/ (0B of 13.49MB at 0B/s)
[INFO] Fetching org.mozilla.xulrunner.cocoa.macosx.source_1.9.2.16.jar from http://download.jboss.org/jbosstools/builds/staging/jbosstools-vpe_master/all/repo/plugins/ (835.71kB of 13.49MB at 831.71kB/s)
[INFO] Fetching org.mozilla.xulrunner.cocoa.macosx.source_1.9.2.16.jar from http://download.jboss.org/jbosstools/builds/staging/jbosstools-vpe_master/all/repo/plugins/ (3.1MB of 13.49MB at 1.52MB/s)
[INFO] Fetching org.mozilla.xulrunner.cocoa.macosx.source_1.9.2.16.jar from http://download.jboss.org/jbosstools/builds/staging/jbosstools-vpe_master/all/repo/plugins/ (6.91MB of 13.49MB at 2.23MB/s)
[INFO] Fetching org.mozilla.xulrunner.cocoa.macosx.source_1.9.2.16.jar from http://download.jboss.org/jbosstools/builds/staging/jbosstools-vpe_master/all/repo/plugins/ (10.65MB of 13.49MB at 2.63MB/s)
[INFO] Fetching org.mozilla.xulrunner.gtk.linux.x86.source_1.9.2.16b.jar from http://download.jboss.org/jbosstools/builds/staging/jbosstools-vpe_master/all/repo/plugins/ (0B of 2.22kB at 0B/s)
[INFO] Fetching org.mozilla.xulrunner.gtk.linux.x86_64.source_1.9.2.19pre.jar from http://download.jboss.org/jbosstools/builds/staging/jbosstools-vpe_master/all/repo/plugins/ (0B of 2.31kB at 0B/s)
[INFO] Fetching org.mozilla.xulrunner.win32.win32.x86.source_1.9.2.16b.jar from http://download.jboss.org/jbosstools/builds/staging/jbosstools-vpe_master/all/repo/plugins/ (0B of 2.22kB at 0B/s)
[INFO] Building jar: <http://jenkins.mw.lab.eng.bos.redhat.com/hudson/job/jbosstools-vpe_master/ws/sources/features/org.jboss.tools.xulrunner.feature/target/org.jboss.tools.xulrunner.feature-3.5.100-SNAPSHOT-sources-feature.jar>
[INFO] 
[INFO] --- tycho-p2-plugin:0.19.0:p2-metadata (attached-p2-metadata) @ org.jboss.tools.xulrunner.feature ---
[INFO] 
[INFO] --- tycho-p2-plugin:0.19.0:p2-metadata (p2-metadata) @ org.jboss.tools.xulrunner.feature ---
[WARNING] Artifact org.jboss.tools.vpe.features:org.jboss.tools.xulrunner.feature:xml:p2metadata:3.5.100-SNAPSHOT already attached to project, ignoring duplicate
[WARNING] Artifact org.jboss.tools.vpe.features:org.jboss.tools.xulrunner.feature:xml:p2artifacts:3.5.100-SNAPSHOT already attached to project, ignoring duplicate
[INFO] 
[INFO] --- maven-install-plugin:2.3.1:install (default-install) @ org.jboss.tools.xulrunner.feature ---
[INFO] Installing <http://jenkins.mw.lab.eng.bos.redhat.com/hudson/job/jbosstools-vpe_master/ws/sources/features/org.jboss.tools.xulrunner.feature/target/org.jboss.tools.xulrunner.feature-3.5.100-SNAPSHOT.jar> to <http://jenkins.mw.lab.eng.bos.redhat.com/hudson/job/jbosstools-vpe_master/ws/.repository/org/jboss/tools/vpe/features/org.jboss.tools.xulrunner.feature/3.5.100-SNAPSHOT/org.jboss.tools.xulrunner.feature-3.5.100-SNAPSHOT.jar>
[INFO] Installing <http://jenkins.mw.lab.eng.bos.redhat.com/hudson/job/jbosstools-vpe_master/ws/sources/features/org.jboss.tools.xulrunner.feature/pom.xml> to <http://jenkins.mw.lab.eng.bos.redhat.com/hudson/job/jbosstools-vpe_master/ws/.repository/org/jboss/tools/vpe/features/org.jboss.tools.xulrunner.feature/3.5.100-SNAPSHOT/org.jboss.tools.xulrunner.feature-3.5.100-SNAPSHOT.pom>
[INFO] Installing <http://jenkins.mw.lab.eng.bos.redhat.com/hudson/job/jbosstools-vpe_master/ws/sources/features/org.jboss.tools.xulrunner.feature/target/org.jboss.tools.xulrunner.feature-3.5.100-SNAPSHOT-sources-feature.jar> to <http://jenkins.mw.lab.eng.bos.redhat.com/hudson/job/jbosstools-vpe_master/ws/.repository/org/jboss/tools/vpe/features/org.jboss.tools.xulrunner.feature/3.5.100-SNAPSHOT/org.jboss.tools.xulrunner.feature-3.5.100-SNAPSHOT-sources-feature.jar>
[INFO] Installing <http://jenkins.mw.lab.eng.bos.redhat.com/hudson/job/jbosstools-vpe_master/ws/sources/features/org.jboss.tools.xulrunner.feature/target/p2content.xml> to <http://jenkins.mw.lab.eng.bos.redhat.com/hudson/job/jbosstools-vpe_master/ws/.repository/org/jboss/tools/vpe/features/org.jboss.tools.xulrunner.feature/3.5.100-SNAPSHOT/org.jboss.tools.xulrunner.feature-3.5.100-SNAPSHOT-p2metadata.xml>
[INFO] Installing <http://jenkins.mw.lab.eng.bos.redhat.com/hudson/job/jbosstools-vpe_master/ws/sources/features/org.jboss.tools.xulrunner.feature/target/p2artifacts.xml> to <http://jenkins.mw.lab.eng.bos.redhat.com/hudson/job/jbosstools-vpe_master/ws/.repository/org/jboss/tools/vpe/features/org.jboss.tools.xulrunner.feature/3.5.100-SNAPSHOT/org.jboss.tools.xulrunner.feature-3.5.100-SNAPSHOT-p2artifacts.xml>
[INFO] 
[INFO] --- tycho-p2-plugin:0.19.0:update-local-index (default-update-local-index) @ org.jboss.tools.xulrunner.feature ---
[INFO]                                                                         
[INFO] ------------------------------------------------------------------------
[INFO] Building org.jboss.tools.vpe.browsersim.feature 3.5.100-SNAPSHOT
[INFO] ------------------------------------------------------------------------
[INFO] 
[INFO] --- maven-clean-plugin:2.4.1:clean (default-clean) @ org.jboss.tools.vpe.browsersim.feature ---
[INFO] Deleting <http://jenkins.mw.lab.eng.bos.redhat.com/hudson/job/jbosstools-vpe_master/ws/sources/features/org.jboss.tools.vpe.browsersim.feature/target>
[INFO] 
[INFO] --- tycho-packaging-plugin:0.19.0:build-qualifier-aggregator (default-build-qualifier-aggregator) @ org.jboss.tools.vpe.browsersim.feature ---
[INFO] The project's OSGi version is 3.5.100.Alpha1-v20131111-1323-B446
[INFO] 
[INFO] --- tycho-packaging-plugin:0.19.0:validate-id (default-validate-id) @ org.jboss.tools.vpe.browsersim.feature ---
[INFO] 
[INFO] --- tycho-packaging-plugin:0.19.0:validate-version (default-validate-version) @ org.jboss.tools.vpe.browsersim.feature ---
[INFO] 
[INFO] --- jacoco-maven-plugin:0.6.1.201212231917:prepare-agent (default) @ org.jboss.tools.vpe.browsersim.feature ---
[INFO] argLine set to -javaagent:<http://jenkins.mw.lab.eng.bos.redhat.com/hudson/job/jbosstools-vpe_master/ws/.repository/org/jacoco/org.jacoco.agent/0.6.1.201212231917/org.jacoco.agent-0.6.1.201212231917-runtime.jar=destfile=/mnt/hudson_workspace/workspace/jbosstools-vpe_master/sources/target/jacoco.exec,append=true,includes=org.jboss.tools.*>
[INFO] 
[INFO] --- tycho-source-plugin:0.19.0:plugin-source (plugin-source) @ org.jboss.tools.vpe.browsersim.feature ---
[INFO] 
[INFO] --- tycho-packaging-plugin:0.19.0:package-feature (default-package-feature) @ org.jboss.tools.vpe.browsersim.feature ---
[INFO] Building jar: <http://jenkins.mw.lab.eng.bos.redhat.com/hudson/job/jbosstools-vpe_master/ws/sources/features/org.jboss.tools.vpe.browsersim.feature/target/org.jboss.tools.vpe.browsersim.feature-3.5.100-SNAPSHOT.jar>
[INFO] 
[INFO] --- tycho-p2-plugin:0.19.0:p2-metadata-default (default-p2-metadata-default) @ org.jboss.tools.vpe.browsersim.feature ---
[INFO] 
[INFO] --- tycho-p2-plugin:0.19.0:feature-p2-metadata (default-feature-p2-metadata) @ org.jboss.tools.vpe.browsersim.feature ---
[INFO] 
[INFO] --- repository-utils:0.16.0.CR2:generate-repository-facade (generate-facade) @ org.jboss.tools.vpe.browsersim.feature ---
[INFO] 
[INFO] --- tycho-pack200b-plugin:0.19.0:pack (pack200-pack) @ org.jboss.tools.vpe.browsersim.feature ---
[INFO] 
[INFO] --- tycho-source-feature-plugin:0.19.0:source-feature (source-feature) @ org.jboss.tools.vpe.browsersim.feature ---
[INFO] Building jar: <http://jenkins.mw.lab.eng.bos.redhat.com/hudson/job/jbosstools-vpe_master/ws/sources/features/org.jboss.tools.vpe.browsersim.feature/target/org.jboss.tools.vpe.browsersim.feature-3.5.100-SNAPSHOT-sources-feature.jar>
[INFO] 
[INFO] --- tycho-p2-plugin:0.19.0:p2-metadata (attached-p2-metadata) @ org.jboss.tools.vpe.browsersim.feature ---
[INFO] 
[INFO] --- tycho-p2-plugin:0.19.0:p2-metadata (p2-metadata) @ org.jboss.tools.vpe.browsersim.feature ---
[WARNING] Artifact org.jboss.tools.vpe.browsersim.features:org.jboss.tools.vpe.browsersim.feature:xml:p2metadata:3.5.100-SNAPSHOT already attached to project, ignoring duplicate
[WARNING] Artifact org.jboss.tools.vpe.browsersim.features:org.jboss.tools.vpe.browsersim.feature:xml:p2artifacts:3.5.100-SNAPSHOT already attached to project, ignoring duplicate
[INFO] 
[INFO] --- maven-install-plugin:2.3.1:install (default-install) @ org.jboss.tools.vpe.browsersim.feature ---
[INFO] Installing <http://jenkins.mw.lab.eng.bos.redhat.com/hudson/job/jbosstools-vpe_master/ws/sources/features/org.jboss.tools.vpe.browsersim.feature/target/org.jboss.tools.vpe.browsersim.feature-3.5.100-SNAPSHOT.jar> to <http://jenkins.mw.lab.eng.bos.redhat.com/hudson/job/jbosstools-vpe_master/ws/.repository/org/jboss/tools/vpe/browsersim/features/org.jboss.tools.vpe.browsersim.feature/3.5.100-SNAPSHOT/org.jboss.tools.vpe.browsersim.feature-3.5.100-SNAPSHOT.jar>
[INFO] Installing <http://jenkins.mw.lab.eng.bos.redhat.com/hudson/job/jbosstools-vpe_master/ws/sources/features/org.jboss.tools.vpe.browsersim.feature/pom.xml> to <http://jenkins.mw.lab.eng.bos.redhat.com/hudson/job/jbosstools-vpe_master/ws/.repository/org/jboss/tools/vpe/browsersim/features/org.jboss.tools.vpe.browsersim.feature/3.5.100-SNAPSHOT/org.jboss.tools.vpe.browsersim.feature-3.5.100-SNAPSHOT.pom>
[INFO] Installing <http://jenkins.mw.lab.eng.bos.redhat.com/hudson/job/jbosstools-vpe_master/ws/sources/features/org.jboss.tools.vpe.browsersim.feature/target/org.jboss.tools.vpe.browsersim.feature-3.5.100-SNAPSHOT-sources-feature.jar> to <http://jenkins.mw.lab.eng.bos.redhat.com/hudson/job/jbosstools-vpe_master/ws/.repository/org/jboss/tools/vpe/browsersim/features/org.jboss.tools.vpe.browsersim.feature/3.5.100-SNAPSHOT/org.jboss.tools.vpe.browsersim.feature-3.5.100-SNAPSHOT-sources-feature.jar>
[INFO] Installing <http://jenkins.mw.lab.eng.bos.redhat.com/hudson/job/jbosstools-vpe_master/ws/sources/features/org.jboss.tools.vpe.browsersim.feature/target/p2content.xml> to <http://jenkins.mw.lab.eng.bos.redhat.com/hudson/job/jbosstools-vpe_master/ws/.repository/org/jboss/tools/vpe/browsersim/features/org.jboss.tools.vpe.browsersim.feature/3.5.100-SNAPSHOT/org.jboss.tools.vpe.browsersim.feature-3.5.100-SNAPSHOT-p2metadata.xml>
[INFO] Installing <http://jenkins.mw.lab.eng.bos.redhat.com/hudson/job/jbosstools-vpe_master/ws/sources/features/org.jboss.tools.vpe.browsersim.feature/target/p2artifacts.xml> to <http://jenkins.mw.lab.eng.bos.redhat.com/hudson/job/jbosstools-vpe_master/ws/.repository/org/jboss/tools/vpe/browsersim/features/org.jboss.tools.vpe.browsersim.feature/3.5.100-SNAPSHOT/org.jboss.tools.vpe.browsersim.feature-3.5.100-SNAPSHOT-p2artifacts.xml>
[INFO] 
[INFO] --- tycho-p2-plugin:0.19.0:update-local-index (default-update-local-index) @ org.jboss.tools.vpe.browsersim.feature ---
[INFO]                                                                         
[INFO] ------------------------------------------------------------------------
[INFO] Building org.jboss.tools.vpe.cordovasim.feature 3.5.100-SNAPSHOT
[INFO] ------------------------------------------------------------------------
[INFO] 
[INFO] --- maven-clean-plugin:2.4.1:clean (default-clean) @ org.jboss.tools.vpe.cordovasim.feature ---
[INFO] Deleting <http://jenkins.mw.lab.eng.bos.redhat.com/hudson/job/jbosstools-vpe_master/ws/sources/features/org.jboss.tools.vpe.cordovasim.feature/target>
[INFO] 
[INFO] --- tycho-packaging-plugin:0.19.0:build-qualifier-aggregator (default-build-qualifier-aggregator) @ org.jboss.tools.vpe.cordovasim.feature ---
[INFO] The project's OSGi version is 3.5.100.Alpha1-v20131111-1323-B446
[INFO] 
[INFO] --- tycho-packaging-plugin:0.19.0:validate-id (default-validate-id) @ org.jboss.tools.vpe.cordovasim.feature ---
[INFO] 
[INFO] --- tycho-packaging-plugin:0.19.0:validate-version (default-validate-version) @ org.jboss.tools.vpe.cordovasim.feature ---
[INFO] 
[INFO] --- jacoco-maven-plugin:0.6.1.201212231917:prepare-agent (default) @ org.jboss.tools.vpe.cordovasim.feature ---
[INFO] argLine set to -javaagent:<http://jenkins.mw.lab.eng.bos.redhat.com/hudson/job/jbosstools-vpe_master/ws/.repository/org/jacoco/org.jacoco.agent/0.6.1.201212231917/org.jacoco.agent-0.6.1.201212231917-runtime.jar=destfile=/mnt/hudson_workspace/workspace/jbosstools-vpe_master/sources/target/jacoco.exec,append=true,includes=org.jboss.tools.*>
[INFO] 
[INFO] --- tycho-source-plugin:0.19.0:plugin-source (plugin-source) @ org.jboss.tools.vpe.cordovasim.feature ---
[INFO] 
[INFO] --- tycho-packaging-plugin:0.19.0:package-feature (default-package-feature) @ org.jboss.tools.vpe.cordovasim.feature ---
[INFO] Building jar: <http://jenkins.mw.lab.eng.bos.redhat.com/hudson/job/jbosstools-vpe_master/ws/sources/features/org.jboss.tools.vpe.cordovasim.feature/target/org.jboss.tools.vpe.cordovasim.feature-3.5.100-SNAPSHOT.jar>
[INFO] 
[INFO] --- tycho-p2-plugin:0.19.0:p2-metadata-default (default-p2-metadata-default) @ org.jboss.tools.vpe.cordovasim.feature ---
[INFO] 
[INFO] --- tycho-p2-plugin:0.19.0:feature-p2-metadata (default-feature-p2-metadata) @ org.jboss.tools.vpe.cordovasim.feature ---
[INFO] 
[INFO] --- repository-utils:0.16.0.CR2:generate-repository-facade (generate-facade) @ org.jboss.tools.vpe.cordovasim.feature ---
[INFO] 
[INFO] --- tycho-pack200b-plugin:0.19.0:pack (pack200-pack) @ org.jboss.tools.vpe.cordovasim.feature ---
[INFO] 
[INFO] --- tycho-source-feature-plugin:0.19.0:source-feature (source-feature) @ org.jboss.tools.vpe.cordovasim.feature ---
[INFO] Building jar: <http://jenkins.mw.lab.eng.bos.redhat.com/hudson/job/jbosstools-vpe_master/ws/sources/features/org.jboss.tools.vpe.cordovasim.feature/target/org.jboss.tools.vpe.cordovasim.feature-3.5.100-SNAPSHOT-sources-feature.jar>
[INFO] 
[INFO] --- tycho-p2-plugin:0.19.0:p2-metadata (attached-p2-metadata) @ org.jboss.tools.vpe.cordovasim.feature ---
[INFO] 
[INFO] --- tycho-p2-plugin:0.19.0:p2-metadata (p2-metadata) @ org.jboss.tools.vpe.cordovasim.feature ---
[WARNING] Artifact org.jboss.tools.vpe.cordovasim.features:org.jboss.tools.vpe.cordovasim.feature:xml:p2metadata:3.5.100-SNAPSHOT already attached to project, ignoring duplicate
[WARNING] Artifact org.jboss.tools.vpe.cordovasim.features:org.jboss.tools.vpe.cordovasim.feature:xml:p2artifacts:3.5.100-SNAPSHOT already attached to project, ignoring duplicate
[INFO] 
[INFO] --- maven-install-plugin:2.3.1:install (default-install) @ org.jboss.tools.vpe.cordovasim.feature ---
[INFO] Installing <http://jenkins.mw.lab.eng.bos.redhat.com/hudson/job/jbosstools-vpe_master/ws/sources/features/org.jboss.tools.vpe.cordovasim.feature/target/org.jboss.tools.vpe.cordovasim.feature-3.5.100-SNAPSHOT.jar> to <http://jenkins.mw.lab.eng.bos.redhat.com/hudson/job/jbosstools-vpe_master/ws/.repository/org/jboss/tools/vpe/cordovasim/features/org.jboss.tools.vpe.cordovasim.feature/3.5.100-SNAPSHOT/org.jboss.tools.vpe.cordovasim.feature-3.5.100-SNAPSHOT.jar>
[INFO] Installing <http://jenkins.mw.lab.eng.bos.redhat.com/hudson/job/jbosstools-vpe_master/ws/sources/features/org.jboss.tools.vpe.cordovasim.feature/pom.xml> to <http://jenkins.mw.lab.eng.bos.redhat.com/hudson/job/jbosstools-vpe_master/ws/.repository/org/jboss/tools/vpe/cordovasim/features/org.jboss.tools.vpe.cordovasim.feature/3.5.100-SNAPSHOT/org.jboss.tools.vpe.cordovasim.feature-3.5.100-SNAPSHOT.pom>
[INFO] Installing <http://jenkins.mw.lab.eng.bos.redhat.com/hudson/job/jbosstools-vpe_master/ws/sources/features/org.jboss.tools.vpe.cordovasim.feature/target/org.jboss.tools.vpe.cordovasim.feature-3.5.100-SNAPSHOT-sources-feature.jar> to <http://jenkins.mw.lab.eng.bos.redhat.com/hudson/job/jbosstools-vpe_master/ws/.repository/org/jboss/tools/vpe/cordovasim/features/org.jboss.tools.vpe.cordovasim.feature/3.5.100-SNAPSHOT/org.jboss.tools.vpe.cordovasim.feature-3.5.100-SNAPSHOT-sources-feature.jar>
[INFO] Installing <http://jenkins.mw.lab.eng.bos.redhat.com/hudson/job/jbosstools-vpe_master/ws/sources/features/org.jboss.tools.vpe.cordovasim.feature/target/p2content.xml> to <http://jenkins.mw.lab.eng.bos.redhat.com/hudson/job/jbosstools-vpe_master/ws/.repository/org/jboss/tools/vpe/cordovasim/features/org.jboss.tools.vpe.cordovasim.feature/3.5.100-SNAPSHOT/org.jboss.tools.vpe.cordovasim.feature-3.5.100-SNAPSHOT-p2metadata.xml>
[INFO] Installing <http://jenkins.mw.lab.eng.bos.redhat.com/hudson/job/jbosstools-vpe_master/ws/sources/features/org.jboss.tools.vpe.cordovasim.feature/target/p2artifacts.xml> to <http://jenkins.mw.lab.eng.bos.redhat.com/hudson/job/jbosstools-vpe_master/ws/.repository/org/jboss/tools/vpe/cordovasim/features/org.jboss.tools.vpe.cordovasim.feature/3.5.100-SNAPSHOT/org.jboss.tools.vpe.cordovasim.feature-3.5.100-SNAPSHOT-p2artifacts.xml>
[INFO] 
[INFO] --- tycho-p2-plugin:0.19.0:update-local-index (default-update-local-index) @ org.jboss.tools.vpe.cordovasim.feature ---
[INFO]                                                                         
[INFO] ------------------------------------------------------------------------
[INFO] Skipping vpe.site
[INFO] This project has been banned from the build due to previous failures.
[INFO] ------------------------------------------------------------------------
[INFO] ------------------------------------------------------------------------
[INFO] Reactor Summary:
[INFO] 
[INFO] vpe.all ........................................... SUCCESS [55.697s]
[INFO] Parent to package containing SWT stuff to support Windows 32 bits  SUCCESS [0.019s]
[INFO] Feature containing SWT stuff to support Windows 32 bits  SUCCESS [7.869s]
[INFO] Repository containing SWT stuff to support Windows 32 bits  SUCCESS [2.336s]
[INFO] vpe.plugins ....................................... SUCCESS [0.021s]
[INFO] org.jboss.tools.vpe.xulrunner ..................... SUCCESS [26.376s]
[INFO] org.jboss.tools.vpe.resref ........................ SUCCESS [1.853s]
[INFO] org.jboss.tools.vpe ............................... SUCCESS [9.276s]
[INFO] org.jboss.tools.vpe.docbook ....................... SUCCESS [1.045s]
[INFO] org.jboss.tools.vpe.html .......................... SUCCESS [1.002s]
[INFO] org.jboss.tools.vpe.jsp ........................... SUCCESS [0.999s]
[INFO] org.jboss.tools.vpe.spring ........................ SUCCESS [0.920s]
[INFO] org.jboss.tools.vpe.ui.palette .................... SUCCESS [0.893s]
[INFO] org.jboss.tools.xulrunner ......................... SUCCESS [0.328s]
[INFO] org.jboss.tools.xulrunner.initializer ............. SUCCESS [0.445s]
[INFO] org.jboss.tools.vpe.browsersim.browser ............ SUCCESS [0.935s]
[INFO] org.jboss.tools.vpe.browsersim .................... SUCCESS [3.987s]
[INFO] org.jboss.tools.vpe.browsersim.eclipse ............ SUCCESS [1.159s]
[INFO] org.jboss.tools.vpe.browsersim.win32.win32.x86_64 . SUCCESS [53.315s]
[INFO] org.jboss.tools.vpe.cordovasim.ripple ............. SUCCESS [2.160s]
[INFO] org.jboss.tools.vpe.cordovasim .................... SUCCESS [1.334s]
[INFO] org.jboss.tools.vpe.cordovasim.eclipse ............ SUCCESS [1.488s]
[INFO] vpe.tests ......................................... SUCCESS [0.018s]
[INFO] org.jboss.tools.vpe.base.test ..................... SUCCESS [1.609s]
[INFO] org.jboss.tools.vpe.docbook.test .................. SUCCESS [1.249s]
[INFO] org.jboss.tools.vpe.ui.test ....................... SUCCESS [1.623s]
[INFO] org.jboss.tools.vpe.html.test ..................... SUCCESS [1.348s]
[INFO] org.jboss.tools.vpe.spring.test ................... SUCCESS [1.052s]
[INFO] org.jboss.tools.vpe.jsp.test ...................... SUCCESS [1.225s]
[INFO] org.jboss.tools.vpe.test .......................... SUCCESS [1.190s]
[INFO] org.jboss.tools.vpe.xulrunner.test ................ SUCCESS [0.869s]
[INFO] org.jboss.tools.vpe.browsersim.browser.test ....... FAILURE [0.078s]
[INFO] org.jboss.tools.vpe.browsersim.eclipse.test ....... SUCCESS [0.902s]
[INFO] vpe.features ...................................... SUCCESS [0.026s]
[INFO] org.jboss.tools.vpe.feature ....................... SUCCESS [0.716s]
[INFO] org.jboss.tools.vpe.test.feature .................. SKIPPED
[INFO] org.jboss.tools.xulrunner.feature ................. SUCCESS [7.553s]
[INFO] org.jboss.tools.vpe.browsersim.feature ............ SUCCESS [0.239s]
[INFO] org.jboss.tools.vpe.cordovasim.feature ............ SUCCESS [0.194s]
[INFO] vpe.site .......................................... SKIPPED
[INFO] ------------------------------------------------------------------------
[INFO] BUILD FAILURE
[INFO] ------------------------------------------------------------------------
[INFO] Total time: 14:46.797s
[INFO] Finished at: Mon Nov 11 08:25:30 EST 2013
[INFO] Final Memory: 102M/676M
[INFO] ------------------------------------------------------------------------
[ERROR] Failed to execute goal org.eclipse.tycho:tycho-compiler-plugin:0.19.0:compile (default-compile) on project org.jboss.tools.vpe.browsersim.browser.test: Compilation failure: Compilation failure:
[ERROR] <http://jenkins.mw.lab.eng.bos.redhat.com/hudson/job/jbosstools-vpe_master/ws/sources/tests/org.jboss.tools.vpe.browsersim.browser.test/src/org/jboss/tools/vpe/browsersim/browser/test/WebKitTests.java>:[39]
[ERROR] final AbstractWebKitBrowser webKitBrowser = new WebKitBrowserFactory().createBrowser(shell, SWT.NONE);
[ERROR] ^^^^^^^^^^^^^^^^^^^^^^^^^^^^^^^^^^^^^^^^^^^^^^^^^^^^^^^^^
[ERROR] Type mismatch: cannot convert from IBrowser to AbstractWebKitBrowser
[ERROR] <http://jenkins.mw.lab.eng.bos.redhat.com/hudson/job/jbosstools-vpe_master/ws/sources/tests/org.jboss.tools.vpe.browsersim.browser.test/src/org/jboss/tools/vpe/browsersim/browser/test/WebKitTests.java>:[45]
[ERROR] webKitBrowser.setDefaultUserAgent(CUSTOM_USER_AGENT);
[ERROR] ^^^^^^^^^^^^^^^^^^^
[ERROR] The method setDefaultUserAgent(String) is undefined for the type AbstractWebKitBrowser
[ERROR] <http://jenkins.mw.lab.eng.bos.redhat.com/hudson/job/jbosstools-vpe_master/ws/sources/tests/org.jboss.tools.vpe.browsersim.browser.test/src/org/jboss/tools/vpe/browsersim/browser/test/WebKitTests.java>:[49]
[ERROR] webKitBrowser.setDefaultUserAgent(null);
[ERROR] ^^^^^^^^^^^^^^^^^^^
[ERROR] The method setDefaultUserAgent(null) is undefined for the type AbstractWebKitBrowser
[ERROR] 3 problems (3 errors)
[ERROR] -> [Help 1]
org.apache.maven.lifecycle.LifecycleExecutionException: Failed to execute goal org.eclipse.tycho:tycho-compiler-plugin:0.19.0:compile (default-compile) on project org.jboss.tools.vpe.browsersim.browser.test: Compilation failure
	at org.apache.maven.lifecycle.internal.MojoExecutor.execute(MojoExecutor.java:213)
	at org.apache.maven.lifecycle.internal.MojoExecutor.execute(MojoExecutor.java:153)
	at org.apache.maven.lifecycle.internal.MojoExecutor.execute(MojoExecutor.java:145)
	at org.apache.maven.lifecycle.internal.LifecycleModuleBuilder.buildProject(LifecycleModuleBuilder.java:84)
	at org.apache.maven.lifecycle.internal.LifecycleModuleBuilder.buildProject(LifecycleModuleBuilder.java:59)
	at org.apache.maven.lifecycle.internal.LifecycleStarter.singleThreadedBuild(LifecycleStarter.java:183)
	at org.apache.maven.lifecycle.internal.LifecycleStarter.execute(LifecycleStarter.java:161)
	at org.apache.maven.DefaultMaven.doExecute(DefaultMaven.java:320)
	at org.apache.maven.DefaultMaven.execute(DefaultMaven.java:156)
	at org.apache.maven.cli.MavenCli.execute(MavenCli.java:537)
	at org.apache.maven.cli.MavenCli.doMain(MavenCli.java:196)
	at org.apache.maven.cli.MavenCli.main(MavenCli.java:141)
	at sun.reflect.NativeMethodAccessorImpl.invoke0(Native Method)
	at sun.reflect.NativeMethodAccessorImpl.invoke(NativeMethodAccessorImpl.java:39)
	at sun.reflect.DelegatingMethodAccessorImpl.invoke(DelegatingMethodAccessorImpl.java:25)
	at java.lang.reflect.Method.invoke(Method.java:597)
	at org.codehaus.plexus.classworlds.launcher.Launcher.launchEnhanced(Launcher.java:290)
	at org.codehaus.plexus.classworlds.launcher.Launcher.launch(Launcher.java:230)
	at org.codehaus.plexus.classworlds.launcher.Launcher.mainWithExitCode(Launcher.java:409)
	at org.codehaus.plexus.classworlds.launcher.Launcher.main(Launcher.java:352)
Caused by: copied.org.apache.maven.plugin.CompilationFailureException: Compilation failure
	at copied.org.apache.maven.plugin.AbstractCompilerMojo.execute(AbstractCompilerMojo.java:441)
	at org.eclipse.tycho.compiler.AbstractOsgiCompilerMojo.execute(AbstractOsgiCompilerMojo.java:237)
	at org.apache.maven.plugin.DefaultBuildPluginManager.executeMojo(DefaultBuildPluginManager.java:101)
	at org.apache.maven.lifecycle.internal.MojoExecutor.execute(MojoExecutor.java:209)
	... 19 more
[ERROR] 
[ERROR] Re-run Maven using the -X switch to enable full debug logging.
[ERROR] 
[ERROR] For more information about the errors and possible solutions, please read the following articles:
[ERROR] [Help 1] http://cwiki.apache.org/confluence/display/MAVEN/MojoFailureException
[ERROR] 
[ERROR] After correcting the problems, you can resume the build with the command
[ERROR]   mvn <goals> -rf :org.jboss.tools.vpe.browsersim.browser.test
Build step 'Invoke top-level Maven targets' marked build as failure
Xvfb stopping
Archiving artifacts
Recording test results
Description set: 


More information about the jbosstools-builds mailing list