[jbosstools-builds] Build failed in Jenkins: jbosstools-integration-tests.aggregate_master #159

ci-builds at redhat.com ci-builds at redhat.com
Tue Feb 11 18:45:15 EST 2014


See <http://jenkins.mw.lab.eng.bos.redhat.com/hudson/job/jbosstools-integration-tests.aggregate_master/159/changes>

Changes:

[vpakan] Fixes label of Project Template within New JSF project wizard

[vpakan] Fixes JSF2 Attribute rename menu item label

[vpakan] Adds searching for view via title prefix

------------------------------------------
[...truncated 9099 lines...]
[INFO] Installing <http://jenkins.mw.lab.eng.bos.redhat.com/hudson/job/jbosstools-integration-tests.aggregate_master/ws/sources/tests/org.jboss.tools.maven.ui.bot.test/target/p2content.xml> to <http://jenkins.mw.lab.eng.bos.redhat.com/hudson/job/jbosstools-integration-tests.aggregate_master/ws/.repository/org/jboss/tools/maven/tests/org.jboss.tools.maven.ui.bot.test/4.2.0-SNAPSHOT/org.jboss.tools.maven.ui.bot.test-4.2.0-SNAPSHOT-p2metadata.xml>
[INFO] Installing <http://jenkins.mw.lab.eng.bos.redhat.com/hudson/job/jbosstools-integration-tests.aggregate_master/ws/sources/tests/org.jboss.tools.maven.ui.bot.test/target/p2artifacts.xml> to <http://jenkins.mw.lab.eng.bos.redhat.com/hudson/job/jbosstools-integration-tests.aggregate_master/ws/.repository/org/jboss/tools/maven/tests/org.jboss.tools.maven.ui.bot.test/4.2.0-SNAPSHOT/org.jboss.tools.maven.ui.bot.test-4.2.0-SNAPSHOT-p2artifacts.xml>
[INFO] 
[INFO] --- tycho-p2-plugin:0.19.0:update-local-index (default-update-local-index) @ org.jboss.tools.maven.ui.bot.test ---
[INFO]                                                                         
[INFO] ------------------------------------------------------------------------
[INFO] Building org.jboss.tools.mylyn.ui.bot.test 4.2.0-SNAPSHOT
[INFO] ------------------------------------------------------------------------
[INFO] 
[INFO] --- maven-clean-plugin:2.5:clean (default-clean) @ org.jboss.tools.mylyn.ui.bot.test ---
[INFO] 
[INFO] --- tycho-packaging-plugin:0.19.0:build-qualifier (default-build-qualifier) @ org.jboss.tools.mylyn.ui.bot.test ---
[INFO] The project's OSGi version is 4.2.0.Alpha2-v20140211-2340-B159
[INFO] 
[INFO] --- tycho-packaging-plugin:0.19.0:validate-id (default-validate-id) @ org.jboss.tools.mylyn.ui.bot.test ---
[INFO] 
[INFO] --- tycho-packaging-plugin:0.19.0:validate-version (default-validate-version) @ org.jboss.tools.mylyn.ui.bot.test ---
[INFO] 
[INFO] --- jacoco-maven-plugin:0.6.4.201312101107:prepare-agent (default) @ org.jboss.tools.mylyn.ui.bot.test ---
[INFO] tycho.testArgLine set to -javaagent:<http://jenkins.mw.lab.eng.bos.redhat.com/hudson/job/jbosstools-integration-tests.aggregate_master/ws/.repository/org/jacoco/org.jacoco.agent/0.6.4.201312101107/org.jacoco.agent-0.6.4.201312101107-runtime.jar=destfile=/mnt/hudson_workspace/workspace/jbosstools-integration-tests.aggregate_master/sources/target/jacoco.exec,append=true,includes=org.jboss.tools.*>
[INFO] 
[INFO] --- maven-resources-plugin:2.4.1:resources (default-resources) @ org.jboss.tools.mylyn.ui.bot.test ---
[INFO] Using 'ISO-8859-1' encoding to copy filtered resources.
[INFO] skip non existing resourceDirectory <http://jenkins.mw.lab.eng.bos.redhat.com/hudson/job/jbosstools-integration-tests.aggregate_master/ws/sources/tests/org.jboss.tools.mylyn.ui.bot.test/src/main/resources>
[INFO] 
[INFO] --- tycho-compiler-plugin:0.19.0:compile (default-compile) @ org.jboss.tools.mylyn.ui.bot.test ---
[INFO] Compiling 7 source files to <http://jenkins.mw.lab.eng.bos.redhat.com/hudson/job/jbosstools-integration-tests.aggregate_master/ws/sources/tests/org.jboss.tools.mylyn.ui.bot.test/target/classes>
[INFO] 
[INFO] --- maven-resources-plugin:2.4.1:testResources (default-testResources) @ org.jboss.tools.mylyn.ui.bot.test ---
[INFO] Using 'ISO-8859-1' encoding to copy filtered resources.
[INFO] skip non existing resourceDirectory <http://jenkins.mw.lab.eng.bos.redhat.com/hudson/job/jbosstools-integration-tests.aggregate_master/ws/sources/tests/org.jboss.tools.mylyn.ui.bot.test/src/test/resources>
[INFO] 
[INFO] --- tycho-source-plugin:0.19.0:plugin-source (plugin-source) @ org.jboss.tools.mylyn.ui.bot.test ---
[WARNING] bundle localization file <http://jenkins.mw.lab.eng.bos.redhat.com/hudson/job/jbosstools-integration-tests.aggregate_master/ws/sources/tests/org.jboss.tools.mylyn.ui.bot.test/plugin.properties> not found
[INFO] Building jar: <http://jenkins.mw.lab.eng.bos.redhat.com/hudson/job/jbosstools-integration-tests.aggregate_master/ws/sources/tests/org.jboss.tools.mylyn.ui.bot.test/target/org.jboss.tools.mylyn.ui.bot.test-4.2.0-SNAPSHOT-sources.jar>
[INFO] 
[INFO] --- tycho-packaging-plugin:0.19.0:package-plugin (default-package-plugin) @ org.jboss.tools.mylyn.ui.bot.test ---
[INFO] Building jar: <http://jenkins.mw.lab.eng.bos.redhat.com/hudson/job/jbosstools-integration-tests.aggregate_master/ws/sources/tests/org.jboss.tools.mylyn.ui.bot.test/target/org.jboss.tools.mylyn.ui.bot.test-4.2.0-SNAPSHOT.jar>
[INFO] 
[INFO] --- tycho-p2-plugin:0.19.0:p2-metadata-default (default-p2-metadata-default) @ org.jboss.tools.mylyn.ui.bot.test ---
[INFO] 
[INFO] --- repository-utils:0.19.0-SNAPSHOT:generate-repository-facade (generate-facade) @ org.jboss.tools.mylyn.ui.bot.test ---
[INFO] 
[INFO] --- tycho-pack200a-plugin:0.19.0:normalize (pack200-normalize) @ org.jboss.tools.mylyn.ui.bot.test ---
[INFO] Pack200 normalizing jar <http://jenkins.mw.lab.eng.bos.redhat.com/hudson/job/jbosstools-integration-tests.aggregate_master/ws/sources/tests/org.jboss.tools.mylyn.ui.bot.test/target/org.jboss.tools.mylyn.ui.bot.test-4.2.0-SNAPSHOT.jar>
[INFO] 
[INFO] --- exec-maven-plugin:1.2.1:exec (jarsign) @ org.jboss.tools.mylyn.ui.bot.test ---
[INFO] skipping execute as per configuraion
[INFO] 
[INFO] --- tycho-pack200b-plugin:0.19.0:pack (pack200-pack) @ org.jboss.tools.mylyn.ui.bot.test ---
[INFO] Pack200 packing jar <http://jenkins.mw.lab.eng.bos.redhat.com/hudson/job/jbosstools-integration-tests.aggregate_master/ws/sources/tests/org.jboss.tools.mylyn.ui.bot.test/target/org.jboss.tools.mylyn.ui.bot.test-4.2.0-SNAPSHOT.jar>
[INFO] 
[INFO] --- tycho-p2-plugin:0.19.0:p2-metadata (attached-p2-metadata) @ org.jboss.tools.mylyn.ui.bot.test ---
[INFO] 
[INFO] --- tycho-p2-plugin:0.19.0:p2-metadata (p2-metadata) @ org.jboss.tools.mylyn.ui.bot.test ---
[INFO] 
[INFO] --- tycho-surefire-plugin:0.19.0:test (default-test) @ org.jboss.tools.mylyn.ui.bot.test ---
[INFO] Skipping tests
[INFO] 
[INFO] --- maven-install-plugin:2.3.1:install (default-install) @ org.jboss.tools.mylyn.ui.bot.test ---
[INFO] Installing <http://jenkins.mw.lab.eng.bos.redhat.com/hudson/job/jbosstools-integration-tests.aggregate_master/ws/sources/tests/org.jboss.tools.mylyn.ui.bot.test/target/org.jboss.tools.mylyn.ui.bot.test-4.2.0-SNAPSHOT.jar> to <http://jenkins.mw.lab.eng.bos.redhat.com/hudson/job/jbosstools-integration-tests.aggregate_master/ws/.repository/org/jboss/tools/mylyn/tests/org.jboss.tools.mylyn.ui.bot.test/4.2.0-SNAPSHOT/org.jboss.tools.mylyn.ui.bot.test-4.2.0-SNAPSHOT.jar>
[INFO] Installing <http://jenkins.mw.lab.eng.bos.redhat.com/hudson/job/jbosstools-integration-tests.aggregate_master/ws/sources/tests/org.jboss.tools.mylyn.ui.bot.test/pom.xml> to <http://jenkins.mw.lab.eng.bos.redhat.com/hudson/job/jbosstools-integration-tests.aggregate_master/ws/.repository/org/jboss/tools/mylyn/tests/org.jboss.tools.mylyn.ui.bot.test/4.2.0-SNAPSHOT/org.jboss.tools.mylyn.ui.bot.test-4.2.0-SNAPSHOT.pom>
[INFO] Installing <http://jenkins.mw.lab.eng.bos.redhat.com/hudson/job/jbosstools-integration-tests.aggregate_master/ws/sources/tests/org.jboss.tools.mylyn.ui.bot.test/target/org.jboss.tools.mylyn.ui.bot.test-4.2.0-SNAPSHOT-sources.jar> to <http://jenkins.mw.lab.eng.bos.redhat.com/hudson/job/jbosstools-integration-tests.aggregate_master/ws/.repository/org/jboss/tools/mylyn/tests/org.jboss.tools.mylyn.ui.bot.test/4.2.0-SNAPSHOT/org.jboss.tools.mylyn.ui.bot.test-4.2.0-SNAPSHOT-sources.jar>
[INFO] Installing <http://jenkins.mw.lab.eng.bos.redhat.com/hudson/job/jbosstools-integration-tests.aggregate_master/ws/sources/tests/org.jboss.tools.mylyn.ui.bot.test/target/org.jboss.tools.mylyn.ui.bot.test-4.2.0-SNAPSHOT.jar.pack.gz> to <http://jenkins.mw.lab.eng.bos.redhat.com/hudson/job/jbosstools-integration-tests.aggregate_master/ws/.repository/org/jboss/tools/mylyn/tests/org.jboss.tools.mylyn.ui.bot.test/4.2.0-SNAPSHOT/org.jboss.tools.mylyn.ui.bot.test-4.2.0-SNAPSHOT-pack200.jar.pack.gz>
[INFO] Installing <http://jenkins.mw.lab.eng.bos.redhat.com/hudson/job/jbosstools-integration-tests.aggregate_master/ws/sources/tests/org.jboss.tools.mylyn.ui.bot.test/target/p2content.xml> to <http://jenkins.mw.lab.eng.bos.redhat.com/hudson/job/jbosstools-integration-tests.aggregate_master/ws/.repository/org/jboss/tools/mylyn/tests/org.jboss.tools.mylyn.ui.bot.test/4.2.0-SNAPSHOT/org.jboss.tools.mylyn.ui.bot.test-4.2.0-SNAPSHOT-p2metadata.xml>
[INFO] Installing <http://jenkins.mw.lab.eng.bos.redhat.com/hudson/job/jbosstools-integration-tests.aggregate_master/ws/sources/tests/org.jboss.tools.mylyn.ui.bot.test/target/p2artifacts.xml> to <http://jenkins.mw.lab.eng.bos.redhat.com/hudson/job/jbosstools-integration-tests.aggregate_master/ws/.repository/org/jboss/tools/mylyn/tests/org.jboss.tools.mylyn.ui.bot.test/4.2.0-SNAPSHOT/org.jboss.tools.mylyn.ui.bot.test-4.2.0-SNAPSHOT-p2artifacts.xml>
[INFO] 
[INFO] --- tycho-p2-plugin:0.19.0:update-local-index (default-update-local-index) @ org.jboss.tools.mylyn.ui.bot.test ---
[INFO]                                                                         
[INFO] ------------------------------------------------------------------------
[INFO] Building org.jboss.tools.openshift.ui.bot.test 4.2.0-SNAPSHOT
[INFO] ------------------------------------------------------------------------
[INFO] 
[INFO] --- maven-clean-plugin:2.5:clean (default-clean) @ org.jboss.tools.openshift.ui.bot.test ---
[INFO] 
[INFO] --- tycho-packaging-plugin:0.19.0:build-qualifier (default-build-qualifier) @ org.jboss.tools.openshift.ui.bot.test ---
[INFO] The project's OSGi version is 4.2.0.Alpha2-v20140211-2340-B159
[INFO] 
[INFO] --- tycho-packaging-plugin:0.19.0:validate-id (default-validate-id) @ org.jboss.tools.openshift.ui.bot.test ---
[INFO] 
[INFO] --- tycho-packaging-plugin:0.19.0:validate-version (default-validate-version) @ org.jboss.tools.openshift.ui.bot.test ---
[INFO] 
[INFO] --- jacoco-maven-plugin:0.6.4.201312101107:prepare-agent (default) @ org.jboss.tools.openshift.ui.bot.test ---
[INFO] tycho.testArgLine set to -javaagent:<http://jenkins.mw.lab.eng.bos.redhat.com/hudson/job/jbosstools-integration-tests.aggregate_master/ws/.repository/org/jacoco/org.jacoco.agent/0.6.4.201312101107/org.jacoco.agent-0.6.4.201312101107-runtime.jar=destfile=/mnt/hudson_workspace/workspace/jbosstools-integration-tests.aggregate_master/sources/target/jacoco.exec,append=true,includes=org.jboss.tools.*>
[INFO] 
[INFO] --- maven-resources-plugin:2.4.1:resources (default-resources) @ org.jboss.tools.openshift.ui.bot.test ---
[INFO] Using 'ISO-8859-1' encoding to copy filtered resources.
[INFO] skip non existing resourceDirectory <http://jenkins.mw.lab.eng.bos.redhat.com/hudson/job/jbosstools-integration-tests.aggregate_master/ws/sources/tests/org.jboss.tools.openshift.ui.bot.test/src/main/resources>
[INFO] 
[INFO] --- tycho-compiler-plugin:0.19.0:compile (default-compile) @ org.jboss.tools.openshift.ui.bot.test ---
[INFO] Compiling 44 source files to <http://jenkins.mw.lab.eng.bos.redhat.com/hudson/job/jbosstools-integration-tests.aggregate_master/ws/sources/tests/org.jboss.tools.openshift.ui.bot.test/target/classes>
[INFO] 
[INFO] --- maven-resources-plugin:2.4.1:testResources (default-testResources) @ org.jboss.tools.openshift.ui.bot.test ---
[INFO] Using 'ISO-8859-1' encoding to copy filtered resources.
[INFO] skip non existing resourceDirectory <http://jenkins.mw.lab.eng.bos.redhat.com/hudson/job/jbosstools-integration-tests.aggregate_master/ws/sources/tests/org.jboss.tools.openshift.ui.bot.test/src/test/resources>
[INFO] 
[INFO] --- tycho-source-plugin:0.19.0:plugin-source (plugin-source) @ org.jboss.tools.openshift.ui.bot.test ---
[INFO] Building jar: <http://jenkins.mw.lab.eng.bos.redhat.com/hudson/job/jbosstools-integration-tests.aggregate_master/ws/sources/tests/org.jboss.tools.openshift.ui.bot.test/target/org.jboss.tools.openshift.ui.bot.test-4.2.0-SNAPSHOT-sources.jar>
[INFO] 
[INFO] --- tycho-packaging-plugin:0.19.0:package-plugin (default-package-plugin) @ org.jboss.tools.openshift.ui.bot.test ---
[INFO] Building jar: <http://jenkins.mw.lab.eng.bos.redhat.com/hudson/job/jbosstools-integration-tests.aggregate_master/ws/sources/tests/org.jboss.tools.openshift.ui.bot.test/target/org.jboss.tools.openshift.ui.bot.test-4.2.0-SNAPSHOT.jar>
[INFO] 
[INFO] --- tycho-p2-plugin:0.19.0:p2-metadata-default (default-p2-metadata-default) @ org.jboss.tools.openshift.ui.bot.test ---
[INFO] 
[INFO] --- repository-utils:0.19.0-SNAPSHOT:generate-repository-facade (generate-facade) @ org.jboss.tools.openshift.ui.bot.test ---
[INFO] 
[INFO] --- tycho-pack200a-plugin:0.19.0:normalize (pack200-normalize) @ org.jboss.tools.openshift.ui.bot.test ---
[INFO] Pack200 normalizing jar <http://jenkins.mw.lab.eng.bos.redhat.com/hudson/job/jbosstools-integration-tests.aggregate_master/ws/sources/tests/org.jboss.tools.openshift.ui.bot.test/target/org.jboss.tools.openshift.ui.bot.test-4.2.0-SNAPSHOT.jar>
[INFO] 
[INFO] --- exec-maven-plugin:1.2.1:exec (jarsign) @ org.jboss.tools.openshift.ui.bot.test ---
[INFO] skipping execute as per configuraion
[INFO] 
[INFO] --- tycho-pack200b-plugin:0.19.0:pack (pack200-pack) @ org.jboss.tools.openshift.ui.bot.test ---
[INFO] Pack200 packing jar <http://jenkins.mw.lab.eng.bos.redhat.com/hudson/job/jbosstools-integration-tests.aggregate_master/ws/sources/tests/org.jboss.tools.openshift.ui.bot.test/target/org.jboss.tools.openshift.ui.bot.test-4.2.0-SNAPSHOT.jar>
[INFO] 
[INFO] --- tycho-p2-plugin:0.19.0:p2-metadata (attached-p2-metadata) @ org.jboss.tools.openshift.ui.bot.test ---
[INFO] 
[INFO] --- tycho-p2-plugin:0.19.0:p2-metadata (p2-metadata) @ org.jboss.tools.openshift.ui.bot.test ---
[INFO] 
[INFO] --- tycho-surefire-plugin:0.19.0:test (default-test) @ org.jboss.tools.openshift.ui.bot.test ---
[INFO] Skipping tests
[INFO] 
[INFO] --- maven-install-plugin:2.3.1:install (default-install) @ org.jboss.tools.openshift.ui.bot.test ---
[INFO] Installing <http://jenkins.mw.lab.eng.bos.redhat.com/hudson/job/jbosstools-integration-tests.aggregate_master/ws/sources/tests/org.jboss.tools.openshift.ui.bot.test/target/org.jboss.tools.openshift.ui.bot.test-4.2.0-SNAPSHOT.jar> to <http://jenkins.mw.lab.eng.bos.redhat.com/hudson/job/jbosstools-integration-tests.aggregate_master/ws/.repository/org/jboss/tools/openshift/tests/org.jboss.tools.openshift.ui.bot.test/4.2.0-SNAPSHOT/org.jboss.tools.openshift.ui.bot.test-4.2.0-SNAPSHOT.jar>
[INFO] Installing <http://jenkins.mw.lab.eng.bos.redhat.com/hudson/job/jbosstools-integration-tests.aggregate_master/ws/sources/tests/org.jboss.tools.openshift.ui.bot.test/pom.xml> to <http://jenkins.mw.lab.eng.bos.redhat.com/hudson/job/jbosstools-integration-tests.aggregate_master/ws/.repository/org/jboss/tools/openshift/tests/org.jboss.tools.openshift.ui.bot.test/4.2.0-SNAPSHOT/org.jboss.tools.openshift.ui.bot.test-4.2.0-SNAPSHOT.pom>
[INFO] Installing <http://jenkins.mw.lab.eng.bos.redhat.com/hudson/job/jbosstools-integration-tests.aggregate_master/ws/sources/tests/org.jboss.tools.openshift.ui.bot.test/target/org.jboss.tools.openshift.ui.bot.test-4.2.0-SNAPSHOT-sources.jar> to <http://jenkins.mw.lab.eng.bos.redhat.com/hudson/job/jbosstools-integration-tests.aggregate_master/ws/.repository/org/jboss/tools/openshift/tests/org.jboss.tools.openshift.ui.bot.test/4.2.0-SNAPSHOT/org.jboss.tools.openshift.ui.bot.test-4.2.0-SNAPSHOT-sources.jar>
[INFO] Installing <http://jenkins.mw.lab.eng.bos.redhat.com/hudson/job/jbosstools-integration-tests.aggregate_master/ws/sources/tests/org.jboss.tools.openshift.ui.bot.test/target/org.jboss.tools.openshift.ui.bot.test-4.2.0-SNAPSHOT.jar.pack.gz> to <http://jenkins.mw.lab.eng.bos.redhat.com/hudson/job/jbosstools-integration-tests.aggregate_master/ws/.repository/org/jboss/tools/openshift/tests/org.jboss.tools.openshift.ui.bot.test/4.2.0-SNAPSHOT/org.jboss.tools.openshift.ui.bot.test-4.2.0-SNAPSHOT-pack200.jar.pack.gz>
[INFO] Installing <http://jenkins.mw.lab.eng.bos.redhat.com/hudson/job/jbosstools-integration-tests.aggregate_master/ws/sources/tests/org.jboss.tools.openshift.ui.bot.test/target/p2content.xml> to <http://jenkins.mw.lab.eng.bos.redhat.com/hudson/job/jbosstools-integration-tests.aggregate_master/ws/.repository/org/jboss/tools/openshift/tests/org.jboss.tools.openshift.ui.bot.test/4.2.0-SNAPSHOT/org.jboss.tools.openshift.ui.bot.test-4.2.0-SNAPSHOT-p2metadata.xml>
[INFO] Installing <http://jenkins.mw.lab.eng.bos.redhat.com/hudson/job/jbosstools-integration-tests.aggregate_master/ws/sources/tests/org.jboss.tools.openshift.ui.bot.test/target/p2artifacts.xml> to <http://jenkins.mw.lab.eng.bos.redhat.com/hudson/job/jbosstools-integration-tests.aggregate_master/ws/.repository/org/jboss/tools/openshift/tests/org.jboss.tools.openshift.ui.bot.test/4.2.0-SNAPSHOT/org.jboss.tools.openshift.ui.bot.test-4.2.0-SNAPSHOT-p2artifacts.xml>
[INFO] 
[INFO] --- tycho-p2-plugin:0.19.0:update-local-index (default-update-local-index) @ org.jboss.tools.openshift.ui.bot.test ---
[INFO]                                                                         
[INFO] ------------------------------------------------------------------------
[INFO] Skipping org.jboss.tools.portlet.ui.bot.test
[INFO] This project has been banned from the build due to previous failures.
[INFO] ------------------------------------------------------------------------
[INFO]                                                                         
[INFO] ------------------------------------------------------------------------
[INFO] Skipping org.jboss.tools.runtime.as.ui.bot.test
[INFO] This project has been banned from the build due to previous failures.
[INFO] ------------------------------------------------------------------------
[INFO]                                                                         
[INFO] ------------------------------------------------------------------------
[INFO] Skipping org.jboss.tools.seam.ui.bot.test
[INFO] This project has been banned from the build due to previous failures.
[INFO] ------------------------------------------------------------------------
[INFO]                                                                         
[INFO] ------------------------------------------------------------------------
[INFO] Skipping org.jboss.tools.ui.bot.ext.test
[INFO] This project has been banned from the build due to previous failures.
[INFO] ------------------------------------------------------------------------
[INFO]                                                                         
[INFO] ------------------------------------------------------------------------
[INFO] Skipping org.jboss.tools.ws.ui.bot.test
[INFO] This project has been banned from the build due to previous failures.
[INFO] ------------------------------------------------------------------------
[INFO]                                                                         
[INFO] ------------------------------------------------------------------------
[INFO] Skipping integration-tests.site
[INFO] This project has been banned from the build due to previous failures.
[INFO] ------------------------------------------------------------------------
[INFO] ------------------------------------------------------------------------
[INFO] Reactor Summary:
[INFO] 
[INFO] integration-tests.all ............................. SUCCESS [4:41.991s]
[INFO] integration-tests.plugins ......................... SUCCESS [0.030s]
[INFO] org.jboss.ide.eclipse.as.reddeer .................. SUCCESS [1:32.694s]
[INFO] org.jboss.tools.archives.reddeer .................. SUCCESS [2.538s]
[INFO] org.jboss.tools.cdi.reddeer ....................... SUCCESS [1.506s]
[INFO] org.jboss.tools.common.reddeer .................... SUCCESS [1.447s]
[INFO] org.jboss.tools.hibernate.reddeer ................. SUCCESS [2.080s]
[INFO] org.jboss.tools.ui.bot.ext ........................ FAILURE [6.885s]
[INFO] org.jboss.tools.jst.ui.bot ........................ SKIPPED
[INFO] org.jboss.tools.ws.reddeer ........................ SKIPPED
[INFO] org.jboss.tools.maven.reddeer ..................... SUCCESS [2.047s]
[INFO] integration-tests.tests ........................... SUCCESS [0.039s]
[INFO] org.jboss.ide.eclipse.as.ui.bot.test .............. SKIPPED
[INFO] org.jboss.tools.aerogear.ui.bot.test .............. SKIPPED
[INFO] org.jboss.tools.archives.ui.bot.test .............. SKIPPED
[INFO] org.jboss.tools.cdi.bot.test ...................... SKIPPED
[INFO] org.jboss.tools.cdi.seam3.bot.test ................ SKIPPED
[INFO] org.jboss.tools.central.ui.bot.test ............... SKIPPED
[INFO] org.jboss.tools.deltaspike.ui.bot.test ............ SKIPPED
[INFO] org.jboss.tools.dummy.ui.bot.test ................. SKIPPED
[INFO] org.jboss.tools.forge.ui.bot.test ................. SKIPPED
[INFO] org.jboss.tools.freemarker.ui.bot.test ............ SUCCESS [2.480s]
[INFO] org.jboss.tools.hibernate.ui.bot.test ............. SKIPPED
[INFO] org.jboss.tools.vpe.ui.bot.test ................... SKIPPED
[INFO] org.jboss.tools.jsf.ui.bot.test ................... SKIPPED
[INFO] org.jboss.tools.maven.ui.bot.test ................. SUCCESS [3:45.648s]
[INFO] org.jboss.tools.mylyn.ui.bot.test ................. SUCCESS [2.025s]
[INFO] org.jboss.tools.openshift.ui.bot.test ............. SUCCESS [3.477s]
[INFO] org.jboss.tools.portlet.ui.bot.test ............... SKIPPED
[INFO] org.jboss.tools.runtime.as.ui.bot.test ............ SKIPPED
[INFO] org.jboss.tools.seam.ui.bot.test .................. SKIPPED
[INFO] org.jboss.tools.ui.bot.ext.test ................... SKIPPED
[INFO] org.jboss.tools.ws.ui.bot.test .................... SKIPPED
[INFO] integration-tests.site ............................ SKIPPED
[INFO] ------------------------------------------------------------------------
[INFO] BUILD FAILURE
[INFO] ------------------------------------------------------------------------
[INFO] Total time: 29:11.241s
[INFO] Finished at: Tue Feb 11 18:45:13 EST 2014
[INFO] Final Memory: 128M/599M
[INFO] ------------------------------------------------------------------------
[ERROR] Failed to execute goal org.eclipse.tycho:tycho-compiler-plugin:0.19.0:compile (default-compile) on project org.jboss.tools.ui.bot.ext: Compilation failure: Compilation failure:
[ERROR] <http://jenkins.mw.lab.eng.bos.redhat.com/hudson/job/jbosstools-integration-tests.aggregate_master/ws/sources/plugins/org.jboss.tools.ui.bot.ext/src/org/jboss/tools/ui/bot/ext/SWTBotExt.java>:[13]
[ERROR] import static org.eclipse.swtbot.eclipse.finder.matchers.WidgetMatcherFactory.withTitle;
[ERROR] ^^^^^^^^^^^^^^^^^^^^^^^^^^^^^^^^^^^^^^^^^^^^^^^^^^^^^^^^^^^^^^^^^^^^^^^^^
[ERROR] The import org.eclipse.swtbot.eclipse.finder.matchers.WidgetMatcherFactory.withTitle cannot be resolved
[ERROR] 1 problem (1 error)
[ERROR] -> [Help 1]
org.apache.maven.lifecycle.LifecycleExecutionException: Failed to execute goal org.eclipse.tycho:tycho-compiler-plugin:0.19.0:compile (default-compile) on project org.jboss.tools.ui.bot.ext: Compilation failure
	at org.apache.maven.lifecycle.internal.MojoExecutor.execute(MojoExecutor.java:212)
	at org.apache.maven.lifecycle.internal.MojoExecutor.execute(MojoExecutor.java:153)
	at org.apache.maven.lifecycle.internal.MojoExecutor.execute(MojoExecutor.java:145)
	at org.apache.maven.lifecycle.internal.LifecycleModuleBuilder.buildProject(LifecycleModuleBuilder.java:84)
	at org.apache.maven.lifecycle.internal.LifecycleModuleBuilder.buildProject(LifecycleModuleBuilder.java:59)
	at org.apache.maven.lifecycle.internal.LifecycleStarter.singleThreadedBuild(LifecycleStarter.java:183)
	at org.apache.maven.lifecycle.internal.LifecycleStarter.execute(LifecycleStarter.java:161)
	at org.apache.maven.DefaultMaven.doExecute(DefaultMaven.java:317)
	at org.apache.maven.DefaultMaven.execute(DefaultMaven.java:152)
	at org.apache.maven.cli.MavenCli.execute(MavenCli.java:555)
	at org.apache.maven.cli.MavenCli.doMain(MavenCli.java:214)
	at org.apache.maven.cli.MavenCli.main(MavenCli.java:158)
	at sun.reflect.NativeMethodAccessorImpl.invoke0(Native Method)
	at sun.reflect.NativeMethodAccessorImpl.invoke(NativeMethodAccessorImpl.java:39)
	at sun.reflect.DelegatingMethodAccessorImpl.invoke(DelegatingMethodAccessorImpl.java:25)
	at java.lang.reflect.Method.invoke(Method.java:597)
	at org.codehaus.plexus.classworlds.launcher.Launcher.launchEnhanced(Launcher.java:289)
	at org.codehaus.plexus.classworlds.launcher.Launcher.launch(Launcher.java:229)
	at org.codehaus.plexus.classworlds.launcher.Launcher.mainWithExitCode(Launcher.java:415)
	at org.codehaus.plexus.classworlds.launcher.Launcher.main(Launcher.java:356)
Caused by: copied.org.apache.maven.plugin.CompilationFailureException: Compilation failure
	at copied.org.apache.maven.plugin.AbstractCompilerMojo.execute(AbstractCompilerMojo.java:441)
	at org.eclipse.tycho.compiler.AbstractOsgiCompilerMojo.execute(AbstractOsgiCompilerMojo.java:237)
	at org.apache.maven.plugin.DefaultBuildPluginManager.executeMojo(DefaultBuildPluginManager.java:106)
	at org.apache.maven.lifecycle.internal.MojoExecutor.execute(MojoExecutor.java:208)
	... 19 more
[ERROR] 
[ERROR] Re-run Maven using the -X switch to enable full debug logging.
[ERROR] 
[ERROR] For more information about the errors and possible solutions, please read the following articles:
[ERROR] [Help 1] http://cwiki.apache.org/confluence/display/MAVEN/MojoFailureException
[ERROR] 
[ERROR] After correcting the problems, you can resume the build with the command
[ERROR]   mvn <goals> -rf :org.jboss.tools.ui.bot.ext
Build step 'Invoke top-level Maven targets' marked build as failure
Description set: 


More information about the jbosstools-builds mailing list