[jbosstools-builds] Build failed in Jenkins: jbosstools-server_4.2.luna #121

ci-builds at redhat.com ci-builds at redhat.com
Thu Feb 19 14:37:17 EST 2015


See <http://jenkins.mw.lab.eng.bos.redhat.com/hudson/job/jbosstools-server_4.2.luna/121/>

------------------------------------------
[...truncated 6253 lines...]
[INFO] --- exec-maven-plugin:1.2.1:exec (jarsign) @ org.jboss.ide.eclipse.as.test ---
[INFO] skipping execute as per configuraion
[INFO] 
[INFO] --- tycho-pack200b-plugin:0.22.0:pack (pack200-pack) @ org.jboss.ide.eclipse.as.test ---
[INFO] Pack200 packing jar <http://jenkins.mw.lab.eng.bos.redhat.com/hudson/job/jbosstools-server_4.2.luna/ws/sources/as/tests/org.jboss.ide.eclipse.as.test/target/org.jboss.ide.eclipse.as.test-3.0.3-SNAPSHOT.jar>
[INFO] 
[INFO] --- tycho-p2-plugin:0.22.0:p2-metadata (attached-p2-metadata) @ org.jboss.ide.eclipse.as.test ---
[INFO] 
[INFO] --- tycho-p2-plugin:0.22.0:p2-metadata (p2-metadata) @ org.jboss.ide.eclipse.as.test ---
[INFO] 
[INFO] --- tycho-surefire-plugin:0.22.0:test (default-test) @ org.jboss.ide.eclipse.as.test ---
[INFO] Expected eclipse log file: <http://jenkins.mw.lab.eng.bos.redhat.com/hudson/job/jbosstools-server_4.2.luna/121/artifact/sources/as/tests/org.jboss.ide.eclipse.as.test/target/work/data/.metadata/.log>
[INFO] Command line:
	[/qa/tools/opt/x86_64/jdk1.7.0_67/jre/bin/java, -Dosgi.noShutdown=false, -Dosgi.os=linux, -Dosgi.ws=gtk, -Dosgi.arch=x86_64, -javaagent:<http://jenkins.mw.lab.eng.bos.redhat.com/hudson/job/jbosstools-server_4.2.luna/ws/.repository/org/jacoco/org.jacoco.agent/0.7.1.201405082137/org.jacoco.agent-0.7.1.201405082137-runtime.jar=destfile=/mnt/hudson_workspace/workspace/jbosstools-server_4.2.luna/sources/as/target/jacoco.exec,append=true,includes=org.jboss.tools.*,> -Xms512m, -Xmx1024m, -XX:PermSize=256m, -XX:MaxPermSize=256m, -Dusage_reporting_enabled=false, -Dorg.jboss.tools.tests.skipPrivateRequirements=false, -Dorg.eclipse.ui.testsDisableWorkbenchAutoSave=true, -Dosgi.clean=true, -jar, <http://jenkins.mw.lab.eng.bos.redhat.com/hudson/job/jbosstools-server_4.2.luna/ws/.repository/p2/osgi/bundle/org.eclipse.equinox.launcher/1.3.0.v20140415-2008/org.eclipse.equinox.launcher-1.3.0.v20140415-2008.jar,> -data, <http://jenkins.mw.lab.eng.bos.redhat.com/hudson/job/jbosstools-server_4.2.luna/ws/sources/as/tests/org.jboss.ide.eclipse.as.test/target/work/data,> -install, <http://jenkins.mw.lab.eng.bos.redhat.com/hudson/job/jbosstools-server_4.2.luna/ws/sources/as/tests/org.jboss.ide.eclipse.as.test/target/work,> -configuration, <http://jenkins.mw.lab.eng.bos.redhat.com/hudson/job/jbosstools-server_4.2.luna/ws/sources/as/tests/org.jboss.ide.eclipse.as.test/target/work/configuration,> -application, org.eclipse.tycho.surefire.osgibooter.uitest, -testproperties, <http://jenkins.mw.lab.eng.bos.redhat.com/hudson/job/jbosstools-server_4.2.luna/ws/sources/as/tests/org.jboss.ide.eclipse.as.test/target/surefire.properties]>

-------------------------------------------------------
 T E S T S
-------------------------------------------------------
Running org.jboss.ide.eclipse.as.test.ASTestSuite
Tests run: 7, Failures: 0, Errors: 0, Skipped: 0, Time elapsed: 0.082 sec - in org.jboss.ide.eclipse.as.test.ASTestSuite
testParse(org.jboss.ide.eclipse.as.test.util.ArgsUtilTest)  Time elapsed: 0.012 sec
testInnerQuotesMultipleSet(org.jboss.ide.eclipse.as.test.util.ArgsUtilTest)  Time elapsed: 0.001 sec
testShortArgMatch(org.jboss.ide.eclipse.as.test.util.ArgsUtilTest)  Time elapsed: 0 sec
testOuterQuoteMultipleSet(org.jboss.ide.eclipse.as.test.util.ArgsUtilTest)  Time elapsed: 0 sec
testReplace(org.jboss.ide.eclipse.as.test.util.ArgsUtilTest)  Time elapsed: 0.001 sec
testLongArgMatch(org.jboss.ide.eclipse.as.test.util.ArgsUtilTest)  Time elapsed: 0 sec
testSetToNulLWithQuotes(org.jboss.ide.eclipse.as.test.util.ArgsUtilTest)  Time elapsed: 0 sec

Results :

Tests run: 7, Failures: 0, Errors: 0, Skipped: 0

[INFO] All tests passed!
[INFO] 
[INFO] --- repository-utils:0.22.1-SNAPSHOT:compare-version-with-baselines (default) @ org.jboss.ide.eclipse.as.test ---
[INFO]                                                                         
[INFO] ------------------------------------------------------------------------
[INFO] Skipping org.jboss.ide.eclipse.as.ui.test
[INFO] This project has been banned from the build due to previous failures.
[INFO] ------------------------------------------------------------------------
[INFO]                                                                         
[INFO] ------------------------------------------------------------------------
[INFO] Building org.jboss.tools.jmx.ui.test 1.6.3-SNAPSHOT
[INFO] ------------------------------------------------------------------------
[INFO] 
[INFO] --- tycho-packaging-plugin:0.22.0:build-qualifier (default-build-qualifier) @ org.jboss.tools.jmx.ui.test ---
[INFO] The project's OSGi version is 1.6.3.Beta1-v20150219-1932-B121
[INFO] 
[INFO] --- tycho-packaging-plugin:0.22.0:validate-id (default-validate-id) @ org.jboss.tools.jmx.ui.test ---
[INFO] 
[INFO] --- tycho-packaging-plugin:0.22.0:validate-version (default-validate-version) @ org.jboss.tools.jmx.ui.test ---
[INFO] 
[INFO] --- jacoco-maven-plugin:0.7.1.201405082137:prepare-agent (default) @ org.jboss.tools.jmx.ui.test ---
[INFO] tycho.testArgLine set to -javaagent:<http://jenkins.mw.lab.eng.bos.redhat.com/hudson/job/jbosstools-server_4.2.luna/ws/.repository/org/jacoco/org.jacoco.agent/0.7.1.201405082137/org.jacoco.agent-0.7.1.201405082137-runtime.jar=destfile=/mnt/hudson_workspace/workspace/jbosstools-server_4.2.luna/sources/jmx/target/jacoco.exec,append=true,includes=org.jboss.tools.jmx.ui*>
[INFO] 
[INFO] --- maven-resources-plugin:2.4.1:resources (default-resources) @ org.jboss.tools.jmx.ui.test ---
[INFO] Using 'ISO-8859-1' encoding to copy filtered resources.
[INFO] skip non existing resourceDirectory <http://jenkins.mw.lab.eng.bos.redhat.com/hudson/job/jbosstools-server_4.2.luna/ws/sources/jmx/tests/org.jboss.tools.jmx.ui.test/src/main/resources>
[INFO] 
[INFO] --- tycho-compiler-plugin:0.22.0:compile (default-compile) @ org.jboss.tools.jmx.ui.test ---
[INFO] Nothing to compile - all classes are up to date
[INFO] 
[INFO] --- maven-resources-plugin:2.4.1:testResources (default-testResources) @ org.jboss.tools.jmx.ui.test ---
[INFO] Using 'ISO-8859-1' encoding to copy filtered resources.
[INFO] skip non existing resourceDirectory <http://jenkins.mw.lab.eng.bos.redhat.com/hudson/job/jbosstools-server_4.2.luna/ws/sources/jmx/tests/org.jboss.tools.jmx.ui.test/src/test/resources>
[INFO] 
[INFO] --- tycho-source-plugin:0.22.0:plugin-source (plugin-source) @ org.jboss.tools.jmx.ui.test ---
[INFO] Building jar: <http://jenkins.mw.lab.eng.bos.redhat.com/hudson/job/jbosstools-server_4.2.luna/ws/sources/jmx/tests/org.jboss.tools.jmx.ui.test/target/org.jboss.tools.jmx.ui.test-1.6.3-SNAPSHOT-sources.jar>
[INFO] 
[INFO] --- target-platform-configuration:0.22.0:target-platform (default-target-platform) @ org.jboss.tools.jmx.ui.test ---
[INFO] 
[INFO] --- tycho-packaging-plugin:0.22.0:package-plugin (default-package-plugin) @ org.jboss.tools.jmx.ui.test ---
[INFO] Building jar: <http://jenkins.mw.lab.eng.bos.redhat.com/hudson/job/jbosstools-server_4.2.luna/ws/sources/jmx/tests/org.jboss.tools.jmx.ui.test/target/org.jboss.tools.jmx.ui.test-1.6.3-SNAPSHOT.jar>
[INFO] 
[INFO] --- tycho-p2-plugin:0.22.0:p2-metadata-default (default-p2-metadata-default) @ org.jboss.tools.jmx.ui.test ---
[INFO] 
[INFO] --- repository-utils:0.22.1-SNAPSHOT:generate-repository-facade (generate-facade) @ org.jboss.tools.jmx.ui.test ---
[INFO] 
[INFO] --- tycho-pack200a-plugin:0.22.0:normalize (pack200-normalize) @ org.jboss.tools.jmx.ui.test ---
[INFO] Pack200 normalizing jar <http://jenkins.mw.lab.eng.bos.redhat.com/hudson/job/jbosstools-server_4.2.luna/ws/sources/jmx/tests/org.jboss.tools.jmx.ui.test/target/org.jboss.tools.jmx.ui.test-1.6.3-SNAPSHOT.jar>
[INFO] 
[INFO] --- exec-maven-plugin:1.2.1:exec (jarsign) @ org.jboss.tools.jmx.ui.test ---
[INFO] skipping execute as per configuraion
[INFO] 
[INFO] --- tycho-pack200b-plugin:0.22.0:pack (pack200-pack) @ org.jboss.tools.jmx.ui.test ---
[INFO] Pack200 packing jar <http://jenkins.mw.lab.eng.bos.redhat.com/hudson/job/jbosstools-server_4.2.luna/ws/sources/jmx/tests/org.jboss.tools.jmx.ui.test/target/org.jboss.tools.jmx.ui.test-1.6.3-SNAPSHOT.jar>
[INFO] 
[INFO] --- tycho-p2-plugin:0.22.0:p2-metadata (attached-p2-metadata) @ org.jboss.tools.jmx.ui.test ---
[INFO] 
[INFO] --- tycho-p2-plugin:0.22.0:p2-metadata (p2-metadata) @ org.jboss.tools.jmx.ui.test ---
[INFO] 
[INFO] --- tycho-surefire-plugin:0.22.0:test (default-test) @ org.jboss.tools.jmx.ui.test ---
[INFO] Expected eclipse log file: <http://jenkins.mw.lab.eng.bos.redhat.com/hudson/job/jbosstools-server_4.2.luna/121/artifact/sources/jmx/tests/org.jboss.tools.jmx.ui.test/target/work/data/.metadata/.log>
[INFO] Command line:
	[/qa/tools/opt/x86_64/jdk1.7.0_67/jre/bin/java, -Dosgi.noShutdown=false, -Dosgi.os=linux, -Dosgi.ws=gtk, -Dosgi.arch=x86_64, -javaagent:<http://jenkins.mw.lab.eng.bos.redhat.com/hudson/job/jbosstools-server_4.2.luna/ws/.repository/org/jacoco/org.jacoco.agent/0.7.1.201405082137/org.jacoco.agent-0.7.1.201405082137-runtime.jar=destfile=/mnt/hudson_workspace/workspace/jbosstools-server_4.2.luna/sources/jmx/target/jacoco.exec,append=true,includes=org.jboss.tools.jmx.ui*,> -Xms512m, -Xmx1024m, -XX:PermSize=256m, -XX:MaxPermSize=256m, -Dusage_reporting_enabled=false, -Dorg.jboss.tools.tests.skipPrivateRequirements=false, -Dorg.eclipse.ui.testsDisableWorkbenchAutoSave=true, -Dosgi.clean=true, -jar, <http://jenkins.mw.lab.eng.bos.redhat.com/hudson/job/jbosstools-server_4.2.luna/ws/.repository/p2/osgi/bundle/org.eclipse.equinox.launcher/1.3.0.v20140415-2008/org.eclipse.equinox.launcher-1.3.0.v20140415-2008.jar,> -data, <http://jenkins.mw.lab.eng.bos.redhat.com/hudson/job/jbosstools-server_4.2.luna/ws/sources/jmx/tests/org.jboss.tools.jmx.ui.test/target/work/data,> -install, <http://jenkins.mw.lab.eng.bos.redhat.com/hudson/job/jbosstools-server_4.2.luna/ws/sources/jmx/tests/org.jboss.tools.jmx.ui.test/target/work,> -configuration, <http://jenkins.mw.lab.eng.bos.redhat.com/hudson/job/jbosstools-server_4.2.luna/ws/sources/jmx/tests/org.jboss.tools.jmx.ui.test/target/work/configuration,> -application, org.eclipse.tycho.surefire.osgibooter.uitest, -testproperties, <http://jenkins.mw.lab.eng.bos.redhat.com/hudson/job/jbosstools-server_4.2.luna/ws/sources/jmx/tests/org.jboss.tools.jmx.ui.test/target/surefire.properties]>

-------------------------------------------------------
 T E S T S
-------------------------------------------------------
Running org.jboss.tools.jmx.ui.test.JMXUIAllTests
Tests run: 10, Failures: 0, Errors: 0, Skipped: 0, Time elapsed: 0.077 sec - in org.jboss.tools.jmx.ui.test.JMXUIAllTests
testCharValue(org.jboss.tools.jmx.ui.internal.test.MBeanUtilsTestCase)  Time elapsed: 0.007 sec
testFloatValue(org.jboss.tools.jmx.ui.internal.test.MBeanUtilsTestCase)  Time elapsed: 0.001 sec
testByteValue(org.jboss.tools.jmx.ui.internal.test.MBeanUtilsTestCase)  Time elapsed: 0.001 sec
testBooleanValue(org.jboss.tools.jmx.ui.internal.test.MBeanUtilsTestCase)  Time elapsed: 0.001 sec
testNonPrimitiveType(org.jboss.tools.jmx.ui.internal.test.MBeanUtilsTestCase)  Time elapsed: 0.001 sec
testLongValue(org.jboss.tools.jmx.ui.internal.test.MBeanUtilsTestCase)  Time elapsed: 0 sec
testShortValue(org.jboss.tools.jmx.ui.internal.test.MBeanUtilsTestCase)  Time elapsed: 0.002 sec
testIntValue(org.jboss.tools.jmx.ui.internal.test.MBeanUtilsTestCase)  Time elapsed: 0.001 sec
testNullValue(org.jboss.tools.jmx.ui.internal.test.MBeanUtilsTestCase)  Time elapsed: 0.001 sec
testDoubleValue(org.jboss.tools.jmx.ui.internal.test.MBeanUtilsTestCase)  Time elapsed: 0.001 sec

Results :

Tests run: 10, Failures: 0, Errors: 0, Skipped: 0

[INFO] All tests passed!
[INFO] 
[INFO] --- repository-utils:0.22.1-SNAPSHOT:compare-version-with-baselines (default) @ org.jboss.tools.jmx.ui.test ---
[INFO]                                                                         
[INFO] ------------------------------------------------------------------------
[INFO] Building wtp.tests 1.1.3-SNAPSHOT
[INFO] ------------------------------------------------------------------------
[INFO] 
[INFO] --- jacoco-maven-plugin:0.7.1.201405082137:prepare-agent (default) @ tests ---
[INFO] argLine set to -javaagent:<http://jenkins.mw.lab.eng.bos.redhat.com/hudson/job/jbosstools-server_4.2.luna/ws/.repository/org/jacoco/org.jacoco.agent/0.7.1.201405082137/org.jacoco.agent-0.7.1.201405082137-runtime.jar=destfile=/mnt/hudson_workspace/workspace/jbosstools-server_4.2.luna/sources/target/jacoco.exec,append=true,includes=org.jboss.tools.*>
[INFO] 
[INFO] --- tycho-source-plugin:0.22.0:plugin-source (plugin-source) @ tests ---
[INFO] 
[INFO] --- repository-utils:0.22.1-SNAPSHOT:generate-repository-facade (generate-facade) @ tests ---
[INFO] 
[INFO] --- tycho-pack200a-plugin:0.22.0:normalize (pack200-normalize) @ tests ---
[INFO] 
[INFO] --- exec-maven-plugin:1.2.1:exec (jarsign) @ tests ---
[INFO] skipping execute as per configuraion
[INFO] 
[INFO] --- tycho-pack200b-plugin:0.22.0:pack (pack200-pack) @ tests ---
[INFO] 
[INFO] --- tycho-p2-plugin:0.22.0:p2-metadata (attached-p2-metadata) @ tests ---
[INFO] 
[INFO] --- tycho-p2-plugin:0.22.0:p2-metadata (p2-metadata) @ tests ---
[INFO] 
[INFO] --- repository-utils:0.22.1-SNAPSHOT:compare-version-with-baselines (default) @ tests ---
[INFO]                                                                         
[INFO] ------------------------------------------------------------------------
[INFO] Skipping org.jboss.tools.wtp.runtimes.tomcat.tests
[INFO] This project has been banned from the build due to previous failures.
[INFO] ------------------------------------------------------------------------
[INFO]                                                                         
[INFO] ------------------------------------------------------------------------
[INFO] Building server.all.tests 4.2.3-SNAPSHOT
[INFO] ------------------------------------------------------------------------
[INFO] 
[INFO] --- jacoco-maven-plugin:0.7.1.201405082137:prepare-agent (default) @ server.all.tests ---
[INFO] argLine set to -javaagent:<http://jenkins.mw.lab.eng.bos.redhat.com/hudson/job/jbosstools-server_4.2.luna/ws/.repository/org/jacoco/org.jacoco.agent/0.7.1.201405082137/org.jacoco.agent-0.7.1.201405082137-runtime.jar=destfile=/mnt/hudson_workspace/workspace/jbosstools-server_4.2.luna/target/jacoco.exec,append=true,includes=org.jboss.tools.*>
[INFO] 
[INFO] --- tycho-source-plugin:0.22.0:plugin-source (plugin-source) @ server.all.tests ---
[INFO] 
[INFO] --- repository-utils:0.22.1-SNAPSHOT:generate-repository-facade (generate-facade) @ server.all.tests ---
[INFO] 
[INFO] --- tycho-pack200a-plugin:0.22.0:normalize (pack200-normalize) @ server.all.tests ---
[INFO] 
[INFO] --- exec-maven-plugin:1.2.1:exec (jarsign) @ server.all.tests ---
[INFO] skipping execute as per configuraion
[INFO] 
[INFO] --- tycho-pack200b-plugin:0.22.0:pack (pack200-pack) @ server.all.tests ---
[INFO] 
[INFO] --- tycho-p2-plugin:0.22.0:p2-metadata (attached-p2-metadata) @ server.all.tests ---
[INFO] 
[INFO] --- tycho-p2-plugin:0.22.0:p2-metadata (p2-metadata) @ server.all.tests ---
[INFO] 
[INFO] --- repository-utils:0.22.1-SNAPSHOT:compare-version-with-baselines (default) @ server.all.tests ---
[INFO] ------------------------------------------------------------------------
[INFO] Reactor Summary:
[INFO] 
[INFO] archives.tests .................................... SUCCESS [0.565s]
[INFO] org.jboss.ide.eclipse.archives.test ............... SUCCESS [1:28.827s]
[INFO] org.jboss.ide.eclipse.archives.ui.test ............ SUCCESS [25.949s]
[INFO] jmx.tests ......................................... SUCCESS [0.031s]
[INFO] org.jboss.tools.jmx.core.test ..................... SUCCESS [11.550s]
[INFO] as.tests .......................................... SUCCESS [0.028s]
[INFO] org.jboss.tools.as.test.core ...................... FAILURE [2:26.735s]
[INFO] org.jboss.ide.eclipse.as.archives.integration.test  SKIPPED
[INFO] org.jboss.ide.eclipse.as.management.as7.tests ..... SKIPPED
[INFO] org.jboss.ide.eclipse.as.test ..................... SUCCESS [22.948s]
[INFO] org.jboss.ide.eclipse.as.ui.test .................. SKIPPED
[INFO] org.jboss.tools.jmx.ui.test ....................... SUCCESS [12.541s]
[INFO] wtp.tests ......................................... SUCCESS [0.014s]
[INFO] org.jboss.tools.wtp.runtimes.tomcat.tests ......... SKIPPED
[INFO] server.all.tests .................................. SUCCESS [0.013s]
[INFO] ------------------------------------------------------------------------
[INFO] BUILD FAILURE
[INFO] ------------------------------------------------------------------------
[INFO] Total time: 7:47.856s
[INFO] Finished at: Thu Feb 19 14:37:14 EST 2015
[INFO] Final Memory: 80M/654M
[INFO] ------------------------------------------------------------------------
[ERROR] Failed to execute goal com.googlecode.maven-download-plugin:maven-download-plugin:1.1.0:wget (install-wildfly-8.0.0.Beta1) on project org.jboss.tools.as.test.core: IO Error: /home/hudson/static_build_env/jbds/download-cache/wildfly-8.0.0.Beta1.zip (No such file or directory) -> [Help 1]
org.apache.maven.lifecycle.LifecycleExecutionException: Failed to execute goal com.googlecode.maven-download-plugin:maven-download-plugin:1.1.0:wget (install-wildfly-8.0.0.Beta1) on project org.jboss.tools.as.test.core: IO Error
	at org.apache.maven.lifecycle.internal.MojoExecutor.execute(MojoExecutor.java:216)
	at org.apache.maven.lifecycle.internal.MojoExecutor.execute(MojoExecutor.java:153)
	at org.apache.maven.lifecycle.internal.MojoExecutor.execute(MojoExecutor.java:145)
	at org.apache.maven.lifecycle.internal.LifecycleModuleBuilder.buildProject(LifecycleModuleBuilder.java:84)
	at org.apache.maven.lifecycle.internal.LifecycleModuleBuilder.buildProject(LifecycleModuleBuilder.java:59)
	at org.apache.maven.lifecycle.internal.LifecycleStarter.singleThreadedBuild(LifecycleStarter.java:183)
	at org.apache.maven.lifecycle.internal.LifecycleStarter.execute(LifecycleStarter.java:161)
	at org.apache.maven.DefaultMaven.doExecute(DefaultMaven.java:317)
	at org.apache.maven.DefaultMaven.execute(DefaultMaven.java:152)
	at org.apache.maven.cli.MavenCli.execute(MavenCli.java:555)
	at org.apache.maven.cli.MavenCli.doMain(MavenCli.java:214)
	at org.apache.maven.cli.MavenCli.main(MavenCli.java:158)
	at sun.reflect.NativeMethodAccessorImpl.invoke0(Native Method)
	at sun.reflect.NativeMethodAccessorImpl.invoke(NativeMethodAccessorImpl.java:57)
	at sun.reflect.DelegatingMethodAccessorImpl.invoke(DelegatingMethodAccessorImpl.java:43)
	at java.lang.reflect.Method.invoke(Method.java:606)
	at org.codehaus.plexus.classworlds.launcher.Launcher.launchEnhanced(Launcher.java:289)
	at org.codehaus.plexus.classworlds.launcher.Launcher.launch(Launcher.java:229)
	at org.codehaus.plexus.classworlds.launcher.Launcher.mainWithExitCode(Launcher.java:415)
	at org.codehaus.plexus.classworlds.launcher.Launcher.main(Launcher.java:356)
Caused by: org.apache.maven.plugin.MojoExecutionException: IO Error
	at com.googlecode.WGet.execute(WGet.java:203)
	at org.apache.maven.plugin.DefaultBuildPluginManager.executeMojo(DefaultBuildPluginManager.java:106)
	at org.apache.maven.lifecycle.internal.MojoExecutor.execute(MojoExecutor.java:208)
	... 19 more
Caused by: java.io.FileNotFoundException: /home/hudson/static_build_env/jbds/download-cache/wildfly-8.0.0.Beta1.zip (No such file or directory)
	at java.io.FileInputStream.open(Native Method)
	at java.io.FileInputStream.<init>(FileInputStream.java:146)
	at com.googlecode.SignatureUtils.computeSignatureAsString(SignatureUtils.java:45)
	at com.googlecode.SignatureUtils.getMD5(SignatureUtils.java:61)
	at com.googlecode.DownloadCache.getEntry(DownloadCache.java:54)
	at com.googlecode.DownloadCache.getArtifact(DownloadCache.java:73)
	at com.googlecode.WGet.execute(WGet.java:165)
	... 21 more
[ERROR] 
[ERROR] Re-run Maven using the -X switch to enable full debug logging.
[ERROR] 
[ERROR] For more information about the errors and possible solutions, please read the following articles:
[ERROR] [Help 1] http://cwiki.apache.org/confluence/display/MAVEN/MojoExecutionException
[ERROR] 
[ERROR] After correcting the problems, you can resume the build with the command
[ERROR]   mvn <goals> -rf :org.jboss.tools.as.test.core
Build step 'Invoke top-level Maven targets' marked build as failure
Terminating xvnc.
$ vncserver -kill :86
Killing Xvnc process ID 16639
Window manager warning: Fatal IO error 11 (Resource temporarily unavailable) on display ':86'.
Archiving artifacts
Recording test results
Description set: 



More information about the jbosstools-builds mailing list