[jbosstools-builds] Build failed in Jenkins: jbosstools-central_4.4.neon #66

ci-builds at redhat.com ci-builds at redhat.com
Sun Mar 19 02:19:14 EDT 2017


See <http://jenkins.hosts.mwqe.eng.bos.redhat.com/hudson/job/jbosstools-central_4.4.neon/66/>

------------------------------------------
[...truncated 10921 lines...]
[INFO] --- jacoco-maven-plugin:0.7.1.201405082137:prepare-agent (default) @ org.jboss.tools.central.easymport.feature ---
[INFO] argLine set to -javaagent:<http://jenkins.hosts.mwqe.eng.bos.redhat.com/hudson/job/jbosstools-central_4.4.neon/ws/.repository/org/jacoco/org.jacoco.agent/0.7.1.201405082137/org.jacoco.agent-0.7.1.201405082137-runtime.jar=destfile=/mnt/hudson_workspace/workspace/jbosstools-central_4.4.neon/sources/central/target/jacoco.exec,append=true,includes=org.jboss.tools.*>
[INFO] 
[INFO] --- tycho-source-plugin:1.0.0:plugin-source (plugin-source) @ org.jboss.tools.central.easymport.feature ---
[INFO] 
[INFO] --- target-platform-configuration:1.0.0:target-platform (default-target-platform) @ org.jboss.tools.central.easymport.feature ---
[INFO] 
[INFO] --- tycho-packaging-plugin:1.0.0:package-feature (default-package-feature) @ org.jboss.tools.central.easymport.feature ---
[INFO] Building jar: <http://jenkins.hosts.mwqe.eng.bos.redhat.com/hudson/job/jbosstools-central_4.4.neon/ws/sources/central/features/org.jboss.tools.central.easymport.feature/target/org.jboss.tools.central.easymport.feature-4.4.2-SNAPSHOT.jar>
[INFO] 
[INFO] --- tycho-p2-plugin:1.0.0:p2-metadata-default (default-p2-metadata-default) @ org.jboss.tools.central.easymport.feature ---
[INFO] 
[INFO] --- tycho-p2-plugin:1.0.0:feature-p2-metadata (default-feature-p2-metadata) @ org.jboss.tools.central.easymport.feature ---
[INFO] 
[INFO] --- repository-utils:1.0.0-SNAPSHOT:generate-repository-facade (generate-facade) @ org.jboss.tools.central.easymport.feature ---
[INFO] 
[INFO] --- tycho-pack200a-plugin:1.0.0:normalize (pack200-normalize) @ org.jboss.tools.central.easymport.feature ---
[INFO] 
[INFO] --- exec-maven-plugin:1.2.1:exec (jarsign) @ org.jboss.tools.central.easymport.feature ---
[INFO] skipping execute as per configuraion
[INFO] 
[INFO] --- tycho-pack200b-plugin:1.0.0:pack (pack200-pack) @ org.jboss.tools.central.easymport.feature ---
[INFO] 
[INFO] --- tycho-source-feature-plugin:1.0.0:source-feature (source-feature) @ org.jboss.tools.central.easymport.feature ---
[INFO] 
[INFO] --- tycho-p2-plugin:1.0.0:p2-metadata (attached-p2-metadata) @ org.jboss.tools.central.easymport.feature ---
[INFO] No baseline version MavenProject: org.jboss.tools.central.features:org.jboss.tools.central.easymport.feature:4.4.2-SNAPSHOT @ <http://jenkins.hosts.mwqe.eng.bos.redhat.com/hudson/job/jbosstools-central_4.4.neon/ws/sources/central/features/org.jboss.tools.central.easymport.feature/pom.xml>
[INFO] 
[INFO] --- tycho-p2-plugin:1.0.0:p2-metadata (p2-metadata) @ org.jboss.tools.central.easymport.feature ---
[INFO] No baseline version MavenProject: org.jboss.tools.central.features:org.jboss.tools.central.easymport.feature:4.4.2-SNAPSHOT @ <http://jenkins.hosts.mwqe.eng.bos.redhat.com/hudson/job/jbosstools-central_4.4.neon/ws/sources/central/features/org.jboss.tools.central.easymport.feature/pom.xml>
[INFO] 
[INFO] --- tycho-p2-extras-plugin:1.0.0:compare-version-with-baselines (default) @ org.jboss.tools.central.easymport.feature ---
[INFO] Fetching org.jboss.tools.central.easymport.feature_4.4.2.v20160929-0420.jar from http://download.jboss.org/jbosstools/static/neon/stable/updates/core/4.4.3.Final/features/ (6.77kB)
[INFO] Fetching org.jboss.tools.central.easymport.feature_4.4.2.v20160929-0420.jar from http://download.jboss.org/jbosstools/static/neon/stable/updates/core/4.4.3.Final/features/ (6.77kB)
[INFO]                                                                         
[INFO] ------------------------------------------------------------------------
[INFO] Skipping central.maven.examples.site
[INFO] This project has been banned from the build due to previous failures.
[INFO] ------------------------------------------------------------------------
[INFO] ------------------------------------------------------------------------
[INFO] Reactor Summary:
[INFO] 
[INFO] jbosstools-central ................................. SUCCESS [  1.650 s]
[INFO] discovery.all ...................................... SUCCESS [  0.023 s]
[INFO] discovery.plugins .................................. SUCCESS [  0.016 s]
[INFO] org.jboss.tools.discovery.core ..................... SUCCESS [ 22.406 s]
[INFO] discovery.tests .................................... SUCCESS [  0.014 s]
[INFO] maven.all .......................................... SUCCESS [  0.015 s]
[INFO] maven.features ..................................... SUCCESS [  0.025 s]
[INFO] maven.plugins ...................................... SUCCESS [  0.017 s]
[INFO] org.jboss.tools.maven.core ......................... SUCCESS [  5.186 s]
[INFO] org.jboss.tools.maven.ui ........................... SUCCESS [  4.158 s]
[INFO] org.jboss.tools.maven.conversion.ui ................ SUCCESS [  3.575 s]
[INFO] org.jboss.tools.maven.feature ...................... SUCCESS [  1.998 s]
[INFO] org.jboss.tools.maven.seam ......................... SUCCESS [  3.278 s]
[INFO] org.jboss.tools.maven.seam.feature ................. SUCCESS [  2.057 s]
[INFO] org.jboss.tools.maven.cdi .......................... SUCCESS [  3.587 s]
[INFO] org.jboss.tools.maven.cdi.feature .................. SUCCESS [  1.901 s]
[INFO] org.jboss.tools.maven.hibernate .................... SUCCESS [  2.932 s]
[INFO] org.jboss.tools.maven.hibernate.feature ............ SUCCESS [  1.865 s]
[INFO] org.jboss.tools.maven.portlet ...................... SUCCESS [  3.229 s]
[INFO] org.jboss.tools.maven.portlet.feature .............. SUCCESS [  2.130 s]
[INFO] maven.tests ........................................ SUCCESS [  0.009 s]
[INFO] org.jboss.tools.maven.common.test .................. SUCCESS [  0.725 s]
[INFO] org.jboss.tools.maven.jbosspackaging ............... SUCCESS [  2.901 s]
[INFO] org.jboss.tools.maven.jdt .......................... SUCCESS [  3.136 s]
[INFO] org.jboss.tools.maven.configurators.tests .......... SUCCESS [  4.786 s]
[INFO] org.jboss.tools.maven.conversion.test .............. SUCCESS [  0.641 s]
[INFO] maven.test-framework ............................... SUCCESS [  0.010 s]
[INFO] org.jboss.tools.maven.reddeer ...................... SUCCESS [  0.573 s]
[INFO] org.jboss.tools.maven.sourcelookup.core ............ SUCCESS [  2.941 s]
[INFO] org.jboss.tools.maven.sourcelookup.ui .............. SUCCESS [  2.878 s]
[INFO] org.jboss.tools.maven.sourcelookup.test ............ SUCCESS [  9.420 s]
[INFO] org.jboss.tools.maven.test.feature ................. SUCCESS [  0.396 s]
[INFO] org.jboss.tools.maven.jbosspackaging.feature ....... SUCCESS [  1.911 s]
[INFO] org.jboss.tools.maven.sourcelookup.feature ......... SUCCESS [  1.905 s]
[INFO] org.jboss.tools.maven.jdt.feature .................. SUCCESS [  1.761 s]
[INFO] examples.all ....................................... SUCCESS [  0.013 s]
[INFO] examples.features .................................. SUCCESS [  0.008 s]
[INFO] examples.plugins ................................... SUCCESS [  0.009 s]
[INFO] org.jboss.tools.project.examples ................... SUCCESS [  5.487 s]
[INFO] org.jboss.tools.community.project.examples ......... SUCCESS [  2.513 s]
[INFO] org.jboss.tools.community.project.examples.feature . SUCCESS [  1.768 s]
[INFO] org.jboss.tools.project.examples.cheatsheet ........ SUCCESS [  3.108 s]
[INFO] org.jboss.tools.project.examples.feature ........... SUCCESS [  1.792 s]
[INFO] org.jboss.tools.maven.project.examples ............. SUCCESS [  4.079 s]
[INFO] org.jboss.tools.maven.project.examples.feature ..... SUCCESS [  1.937 s]
[INFO] org.jboss.tools.project.examples.seam .............. SUCCESS [  2.838 s]
[INFO] org.jboss.tools.project.examples.seam.feature ...... SUCCESS [  2.427 s]
[INFO] examples.tests ..................................... SUCCESS [  0.012 s]
[INFO] org.jboss.tools.maven.examples.test ................ SUCCESS [  0.968 s]
[INFO] org.jboss.tools.project.examples.test .............. SUCCESS [ 11.445 s]
[INFO] org.jboss.tools.project.examples.test.feature ...... SUCCESS [  0.323 s]
[INFO] central.all ........................................ SUCCESS [  0.008 s]
[INFO] central.plugins .................................... SUCCESS [  0.007 s]
[INFO] org.jboss.tools.central ............................ FAILURE [01:17 min]
[INFO] org.jboss.tools.community.central .................. SKIPPED
[INFO] org.jboss.tools.central.themes ..................... FAILURE [  1.149 s]
[INFO] central.features ................................... SUCCESS [  0.017 s]
[INFO] org.jboss.tools.central.feature .................... SKIPPED
[INFO] org.jboss.tools.community.central.feature .......... SKIPPED
[INFO] org.jboss.tools.central.themes.feature ............. SKIPPED
[INFO] central.test-framework ............................. SUCCESS [  0.007 s]
[INFO] org.jboss.tools.central.reddeer .................... SUCCESS [  0.578 s]
[INFO] central.tests ...................................... SUCCESS [  0.007 s]
[INFO] org.jboss.tools.central.test ....................... SKIPPED
[INFO] org.jboss.tools.central.test.feature ............... SKIPPED
[INFO] org.jboss.tools.central.easymport.feature .......... FAILURE [  0.339 s]
[INFO] central.maven.examples.site ........................ SKIPPED
[INFO] ------------------------------------------------------------------------
[INFO] BUILD FAILURE
[INFO] ------------------------------------------------------------------------
[INFO] Total time: 19:08 min
[INFO] Finished at: 2017-03-19T06:19:10+00:00
[INFO] Final Memory: 237M/799M
[INFO] ------------------------------------------------------------------------
[ERROR] Failed to execute goal org.eclipse.tycho:tycho-p2-plugin:1.0.0:p2-metadata (attached-p2-metadata) on project org.jboss.tools.central: Execution attached-p2-metadata of goal org.eclipse.tycho:tycho-p2-plugin:1.0.0:p2-metadata failed: Error trying to download org.jboss.tools.central version 2.1.3.v20170116-1347 from http://download.jboss.org/jbosstools/neon/staging/updates/core/4.4.4.AM1:
[ERROR] Download of osgi.bundle,org.jboss.tools.central,2.1.3.v20170116-1347 failed on repository http://download.jboss.org/jbosstools/neon/staging/updates/core/4.4.4.AM1. Retrying. :
[ERROR] Unable to read repository at http://download.jboss.org/jbosstools/neon/staging/updates/core/4.4.4.AM1/plugins/org.jboss.tools.central_2.1.3.v20170116-1347.jar.pack.gz. Premature end of Content-Length delimited message body (expected: 587255; received: 255849
[ERROR] -> [Help 1]
org.apache.maven.lifecycle.LifecycleExecutionException: Failed to execute goal org.eclipse.tycho:tycho-p2-plugin:1.0.0:p2-metadata (attached-p2-metadata) on project org.jboss.tools.central: Execution attached-p2-metadata of goal org.eclipse.tycho:tycho-p2-plugin:1.0.0:p2-metadata failed: Error trying to download org.jboss.tools.central version 2.1.3.v20170116-1347 from http://download.jboss.org/jbosstools/neon/staging/updates/core/4.4.4.AM1:
Download of osgi.bundle,org.jboss.tools.central,2.1.3.v20170116-1347 failed on repository http://download.jboss.org/jbosstools/neon/staging/updates/core/4.4.4.AM1. Retrying. :
   Unable to read repository at http://download.jboss.org/jbosstools/neon/staging/updates/core/4.4.4.AM1/plugins/org.jboss.tools.central_2.1.3.v20170116-1347.jar.pack.gz.
	at org.apache.maven.lifecycle.internal.MojoExecutor.execute(MojoExecutor.java:212)
	at org.apache.maven.lifecycle.internal.MojoExecutor.execute(MojoExecutor.java:153)
	at org.apache.maven.lifecycle.internal.MojoExecutor.execute(MojoExecutor.java:145)
	at org.apache.maven.lifecycle.internal.LifecycleModuleBuilder.buildProject(LifecycleModuleBuilder.java:116)
	at org.apache.maven.lifecycle.internal.LifecycleModuleBuilder.buildProject(LifecycleModuleBuilder.java:80)
	at org.apache.maven.lifecycle.internal.builder.singlethreaded.SingleThreadedBuilder.build(SingleThreadedBuilder.java:51)
	at org.apache.maven.lifecycle.internal.LifecycleStarter.execute(LifecycleStarter.java:128)
	at org.apache.maven.DefaultMaven.doExecute(DefaultMaven.java:307)
	at org.apache.maven.DefaultMaven.doExecute(DefaultMaven.java:193)
	at org.apache.maven.DefaultMaven.execute(DefaultMaven.java:106)
	at org.apache.maven.cli.MavenCli.execute(MavenCli.java:863)
	at org.apache.maven.cli.MavenCli.doMain(MavenCli.java:288)
	at org.apache.maven.cli.MavenCli.main(MavenCli.java:199)
	at sun.reflect.NativeMethodAccessorImpl.invoke0(Native Method)
	at sun.reflect.NativeMethodAccessorImpl.invoke(NativeMethodAccessorImpl.java:62)
	at sun.reflect.DelegatingMethodAccessorImpl.invoke(DelegatingMethodAccessorImpl.java:43)
	at java.lang.reflect.Method.invoke(Method.java:498)
	at org.codehaus.plexus.classworlds.launcher.Launcher.launchEnhanced(Launcher.java:289)
	at org.codehaus.plexus.classworlds.launcher.Launcher.launch(Launcher.java:229)
	at org.codehaus.plexus.classworlds.launcher.Launcher.mainWithExitCode(Launcher.java:415)
	at org.codehaus.plexus.classworlds.launcher.Launcher.main(Launcher.java:356)
Caused by: org.apache.maven.plugin.PluginExecutionException: Execution attached-p2-metadata of goal org.eclipse.tycho:tycho-p2-plugin:1.0.0:p2-metadata failed: Error trying to download org.jboss.tools.central version 2.1.3.v20170116-1347 from http://download.jboss.org/jbosstools/neon/staging/updates/core/4.4.4.AM1:
Download of osgi.bundle,org.jboss.tools.central,2.1.3.v20170116-1347 failed on repository http://download.jboss.org/jbosstools/neon/staging/updates/core/4.4.4.AM1. Retrying. :
   Unable to read repository at http://download.jboss.org/jbosstools/neon/staging/updates/core/4.4.4.AM1/plugins/org.jboss.tools.central_2.1.3.v20170116-1347.jar.pack.gz.
	at org.apache.maven.plugin.DefaultBuildPluginManager.executeMojo(DefaultBuildPluginManager.java:145)
	at org.apache.maven.lifecycle.internal.MojoExecutor.execute(MojoExecutor.java:207)
	... 20 more
Caused by: java.lang.RuntimeException: Error trying to download org.jboss.tools.central version 2.1.3.v20170116-1347 from http://download.jboss.org/jbosstools/neon/staging/updates/core/4.4.4.AM1:
Download of osgi.bundle,org.jboss.tools.central,2.1.3.v20170116-1347 failed on repository http://download.jboss.org/jbosstools/neon/staging/updates/core/4.4.4.AM1. Retrying. :
   Unable to read repository at http://download.jboss.org/jbosstools/neon/staging/updates/core/4.4.4.AM1/plugins/org.jboss.tools.central_2.1.3.v20170116-1347.jar.pack.gz.
	at org.eclipse.tycho.p2.tools.baseline.BaselineServiceImpl.getProjectBaseline(BaselineServiceImpl.java:134)
	at org.eclipse.tycho.plugins.p2.BaselineValidator.validateAndReplace(BaselineValidator.java:87)
	at org.eclipse.tycho.plugins.p2.P2MetadataMojo.attachP2Metadata(P2MetadataMojo.java:152)
	at org.eclipse.tycho.plugins.p2.P2MetadataMojo.execute(P2MetadataMojo.java:107)
	at org.apache.maven.plugin.DefaultBuildPluginManager.executeMojo(DefaultBuildPluginManager.java:134)
	... 21 more
Caused by: org.apache.http.ConnectionClosedException: Premature end of Content-Length delimited message body (expected: 587255; received: 255849
	at org.apache.http.impl.io.ContentLengthInputStream.read(ContentLengthInputStream.java:180)
	at org.apache.http.conn.EofSensorInputStream.read(EofSensorInputStream.java:137)
	at java.io.FilterInputStream.read(FilterInputStream.java:133)
	at java.io.FilterInputStream.read(FilterInputStream.java:107)
	at org.eclipse.ecf.provider.filetransfer.retrieve.AbstractRetrieveFileTransfer$1.performFileTransfer(AbstractRetrieveFileTransfer.java:178)
	at org.eclipse.ecf.filetransfer.FileTransferJob.run(FileTransferJob.java:74)
	at org.eclipse.core.internal.jobs.Worker.run(Worker.java:55)
[ERROR] Failed to execute goal org.eclipse.tycho.extras:tycho-p2-extras-plugin:1.0.0:compare-version-with-baselines (default) on project org.jboss.tools.central.themes: Duplicate version but different content found for (org.jboss.tools.central.themes/2.1.3.v20161214-0939). Also exists in baseline, but its content is different. -> [Help 2]
org.apache.maven.lifecycle.LifecycleExecutionException: Failed to execute goal org.eclipse.tycho.extras:tycho-p2-extras-plugin:1.0.0:compare-version-with-baselines (default) on project org.jboss.tools.central.themes: Duplicate version but different content found for (org.jboss.tools.central.themes/2.1.3.v20161214-0939). Also exists in baseline, but its content is different.
	at org.apache.maven.lifecycle.internal.MojoExecutor.execute(MojoExecutor.java:212)
	at org.apache.maven.lifecycle.internal.MojoExecutor.execute(MojoExecutor.java:153)
	at org.apache.maven.lifecycle.internal.MojoExecutor.execute(MojoExecutor.java:145)
	at org.apache.maven.lifecycle.internal.LifecycleModuleBuilder.buildProject(LifecycleModuleBuilder.java:116)
	at org.apache.maven.lifecycle.internal.LifecycleModuleBuilder.buildProject(LifecycleModuleBuilder.java:80)
	at org.apache.maven.lifecycle.internal.builder.singlethreaded.SingleThreadedBuilder.build(SingleThreadedBuilder.java:51)
	at org.apache.maven.lifecycle.internal.LifecycleStarter.execute(LifecycleStarter.java:128)
	at org.apache.maven.DefaultMaven.doExecute(DefaultMaven.java:307)
	at org.apache.maven.DefaultMaven.doExecute(DefaultMaven.java:193)
	at org.apache.maven.DefaultMaven.execute(DefaultMaven.java:106)
	at org.apache.maven.cli.MavenCli.execute(MavenCli.java:863)
	at org.apache.maven.cli.MavenCli.doMain(MavenCli.java:288)
	at org.apache.maven.cli.MavenCli.main(MavenCli.java:199)
	at sun.reflect.NativeMethodAccessorImpl.invoke0(Native Method)
	at sun.reflect.NativeMethodAccessorImpl.invoke(NativeMethodAccessorImpl.java:62)
	at sun.reflect.DelegatingMethodAccessorImpl.invoke(DelegatingMethodAccessorImpl.java:43)
	at java.lang.reflect.Method.invoke(Method.java:498)
	at org.codehaus.plexus.classworlds.launcher.Launcher.launchEnhanced(Launcher.java:289)
	at org.codehaus.plexus.classworlds.launcher.Launcher.launch(Launcher.java:229)
	at org.codehaus.plexus.classworlds.launcher.Launcher.mainWithExitCode(Launcher.java:415)
	at org.codehaus.plexus.classworlds.launcher.Launcher.main(Launcher.java:356)
Caused by: org.apache.maven.plugin.MojoFailureException: Duplicate version but different content found for (org.jboss.tools.central.themes/2.1.3.v20161214-0939). Also exists in baseline, but its content is different.
	at org.eclipse.tycho.plugins.p2.extras.CompareWithBaselineMojo.execute(CompareWithBaselineMojo.java:178)
	at org.apache.maven.plugin.DefaultBuildPluginManager.executeMojo(DefaultBuildPluginManager.java:134)
	at org.apache.maven.lifecycle.internal.MojoExecutor.execute(MojoExecutor.java:207)
	... 20 more
Caused by: org.apache.maven.plugin.MojoFailureException: Duplicate version but different content found for (org.jboss.tools.central.themes/2.1.3.v20161214-0939). Also exists in baseline, but its content is different.
	at org.eclipse.tycho.plugins.p2.extras.CompareWithBaselineMojo.execute(CompareWithBaselineMojo.java:159)
	... 22 more
[ERROR] Failed to execute goal org.eclipse.tycho.extras:tycho-p2-extras-plugin:1.0.0:compare-version-with-baselines (default) on project org.jboss.tools.central.easymport.feature: Duplicate version but different content found for (org.jboss.tools.central.easymport.feature.feature.jar/4.4.2.v20160929-0420). Also exists in baseline, but its content is different. -> [Help 2]
org.apache.maven.lifecycle.LifecycleExecutionException: Failed to execute goal org.eclipse.tycho.extras:tycho-p2-extras-plugin:1.0.0:compare-version-with-baselines (default) on project org.jboss.tools.central.easymport.feature: Duplicate version but different content found for (org.jboss.tools.central.easymport.feature.feature.jar/4.4.2.v20160929-0420). Also exists in baseline, but its content is different.
	at org.apache.maven.lifecycle.internal.MojoExecutor.execute(MojoExecutor.java:212)
	at org.apache.maven.lifecycle.internal.MojoExecutor.execute(MojoExecutor.java:153)
	at org.apache.maven.lifecycle.internal.MojoExecutor.execute(MojoExecutor.java:145)
	at org.apache.maven.lifecycle.internal.LifecycleModuleBuilder.buildProject(LifecycleModuleBuilder.java:116)
	at org.apache.maven.lifecycle.internal.LifecycleModuleBuilder.buildProject(LifecycleModuleBuilder.java:80)
	at org.apache.maven.lifecycle.internal.builder.singlethreaded.SingleThreadedBuilder.build(SingleThreadedBuilder.java:51)
	at org.apache.maven.lifecycle.internal.LifecycleStarter.execute(LifecycleStarter.java:128)
	at org.apache.maven.DefaultMaven.doExecute(DefaultMaven.java:307)
	at org.apache.maven.DefaultMaven.doExecute(DefaultMaven.java:193)
	at org.apache.maven.DefaultMaven.execute(DefaultMaven.java:106)
	at org.apache.maven.cli.MavenCli.execute(MavenCli.java:863)
	at org.apache.maven.cli.MavenCli.doMain(MavenCli.java:288)
	at org.apache.maven.cli.MavenCli.main(MavenCli.java:199)
	at sun.reflect.NativeMethodAccessorImpl.invoke0(Native Method)
	at sun.reflect.NativeMethodAccessorImpl.invoke(NativeMethodAccessorImpl.java:62)
	at sun.reflect.DelegatingMethodAccessorImpl.invoke(DelegatingMethodAccessorImpl.java:43)
	at java.lang.reflect.Method.invoke(Method.java:498)
	at org.codehaus.plexus.classworlds.launcher.Launcher.launchEnhanced(Launcher.java:289)
	at org.codehaus.plexus.classworlds.launcher.Launcher.launch(Launcher.java:229)
	at org.codehaus.plexus.classworlds.launcher.Launcher.mainWithExitCode(Launcher.java:415)
	at org.codehaus.plexus.classworlds.launcher.Launcher.main(Launcher.java:356)
Caused by: org.apache.maven.plugin.MojoFailureException: Duplicate version but different content found for (org.jboss.tools.central.easymport.feature.feature.jar/4.4.2.v20160929-0420). Also exists in baseline, but its content is different.
	at org.eclipse.tycho.plugins.p2.extras.CompareWithBaselineMojo.execute(CompareWithBaselineMojo.java:178)
	at org.apache.maven.plugin.DefaultBuildPluginManager.executeMojo(DefaultBuildPluginManager.java:134)
	at org.apache.maven.lifecycle.internal.MojoExecutor.execute(MojoExecutor.java:207)
	... 20 more
Caused by: org.apache.maven.plugin.MojoFailureException: Duplicate version but different content found for (org.jboss.tools.central.easymport.feature.feature.jar/4.4.2.v20160929-0420). Also exists in baseline, but its content is different.
	at org.eclipse.tycho.plugins.p2.extras.CompareWithBaselineMojo.execute(CompareWithBaselineMojo.java:159)
	... 22 more
[ERROR] 
[ERROR] Re-run Maven using the -X switch to enable full debug logging.
[ERROR] 
[ERROR] For more information about the errors and possible solutions, please read the following articles:
[ERROR] [Help 1] http://cwiki.apache.org/confluence/display/MAVEN/PluginExecutionException
[ERROR] [Help 2] http://cwiki.apache.org/confluence/display/MAVEN/MojoFailureException
[ERROR] 
[ERROR] After correcting the problems, you can resume the build with the command
[ERROR]   mvn <goals> -rf :org.jboss.tools.central
Build step 'Invoke top-level Maven targets' marked build as failure
Terminating xvnc.
$ vncserver -kill :91
Killing Xvnc process ID 18650
Checking console output
Archiving artifacts
Recording test results
ERROR: Publisher 'Publish JUnit test result report' failed: Test reports were found but none of them are new. Did tests run? 
For example, <http://jenkins.hosts.mwqe.eng.bos.redhat.com/hudson/job/jbosstools-central_4.4.neon/ws/sources/central/tests/org.jboss.tools.central.test/target/surefire-reports/TEST-org.jboss.tools.central.internal.CentralHelperTest.xml> is 1 day 0 hr old

[description-setter] Description set: 


More information about the jbosstools-builds mailing list