[jbosstools-builds] Build failed in Jenkins: jbosstools-javaee-tests-matrix_master_otherOS » jsf/tests,jdk1.8,windows&&x86_64 #229

ci-builds at redhat.com ci-builds at redhat.com
Thu Jan 25 16:21:15 EST 2018


See <http://jenkins.hosts.mwqe.eng.bos.redhat.com/hudson/job/jbosstools-javaee-tests-matrix_master_otherOS/SUB=jsf%2Ftests,jdk=jdk1.8,label_exp=windows&&x86_64/229/>

------------------------------------------
Started by upstream project "jbosstools-javaee-tests-matrix_master_otherOS" build number 229
originally caused by:
 Started by an SCM change
[EnvInject] - Loading node environment variables.
Building remotely on soa7-w8-x86_64 (w8 brIE mem2G mwqa_drives_services mem4G mem8G mwqa_drives_tools windows brIE11 mwqa_test_ips general x86_64 brFF) in workspace <http://jenkins.hosts.mwqe.eng.bos.redhat.com/hudson/job/jbosstools-javaee-tests-matrix_master_otherOS/SUB=jsf%2Ftests,jdk=jdk1.8,label_exp=windows&&x86_64/ws/>
java.io.IOException: Failed to mkdirs: <http://jenkins.hosts.mwqe.eng.bos.redhat.com/hudson/job/jbosstools-javaee-tests-matrix_master_otherOS/SUB=jsf%2Ftests,jdk=jdk1.8,label_exp=windows&&x86_64/ws/>
	at hudson.FilePath.mkdirs(FilePath.java:1162)
	at hudson.model.AbstractProject.checkout(AbstractProject.java:1267)
	at hudson.model.AbstractBuild$AbstractBuildExecution.defaultCheckout(AbstractBuild.java:609)
	at jenkins.scm.SCMCheckoutStrategy.checkout(SCMCheckoutStrategy.java:86)
	at hudson.model.AbstractBuild$AbstractBuildExecution.run(AbstractBuild.java:531)
	at hudson.model.Run.execute(Run.java:1738)
	at hudson.matrix.MatrixRun.run(MatrixRun.java:146)
	at hudson.model.ResourceController.execute(ResourceController.java:98)
	at hudson.model.Executor.run(Executor.java:408)
Retrying after 10 seconds
java.io.IOException: Failed to mkdirs: <http://jenkins.hosts.mwqe.eng.bos.redhat.com/hudson/job/jbosstools-javaee-tests-matrix_master_otherOS/SUB=jsf%2Ftests,jdk=jdk1.8,label_exp=windows&&x86_64/ws/>
	at hudson.FilePath.mkdirs(FilePath.java:1162)
	at hudson.model.AbstractProject.checkout(AbstractProject.java:1267)
	at hudson.model.AbstractBuild$AbstractBuildExecution.defaultCheckout(AbstractBuild.java:609)
	at jenkins.scm.SCMCheckoutStrategy.checkout(SCMCheckoutStrategy.java:86)
	at hudson.model.AbstractBuild$AbstractBuildExecution.run(AbstractBuild.java:531)
	at hudson.model.Run.execute(Run.java:1738)
	at hudson.matrix.MatrixRun.run(MatrixRun.java:146)
	at hudson.model.ResourceController.execute(ResourceController.java:98)
	at hudson.model.Executor.run(Executor.java:408)
Retrying after 10 seconds
java.io.IOException: Failed to mkdirs: <http://jenkins.hosts.mwqe.eng.bos.redhat.com/hudson/job/jbosstools-javaee-tests-matrix_master_otherOS/SUB=jsf%2Ftests,jdk=jdk1.8,label_exp=windows&&x86_64/ws/>
	at hudson.FilePath.mkdirs(FilePath.java:1162)
	at hudson.model.AbstractProject.checkout(AbstractProject.java:1267)
	at hudson.model.AbstractBuild$AbstractBuildExecution.defaultCheckout(AbstractBuild.java:609)
	at jenkins.scm.SCMCheckoutStrategy.checkout(SCMCheckoutStrategy.java:86)
	at hudson.model.AbstractBuild$AbstractBuildExecution.run(AbstractBuild.java:531)
	at hudson.model.Run.execute(Run.java:1738)
	at hudson.matrix.MatrixRun.run(MatrixRun.java:146)
	at hudson.model.ResourceController.execute(ResourceController.java:98)
	at hudson.model.Executor.run(Executor.java:408)
Retrying after 10 seconds
java.io.IOException: Failed to mkdirs: <http://jenkins.hosts.mwqe.eng.bos.redhat.com/hudson/job/jbosstools-javaee-tests-matrix_master_otherOS/SUB=jsf%2Ftests,jdk=jdk1.8,label_exp=windows&&x86_64/ws/>
	at hudson.FilePath.mkdirs(FilePath.java:1162)
	at hudson.model.AbstractProject.checkout(AbstractProject.java:1267)
	at hudson.model.AbstractBuild$AbstractBuildExecution.defaultCheckout(AbstractBuild.java:609)
	at jenkins.scm.SCMCheckoutStrategy.checkout(SCMCheckoutStrategy.java:86)
	at hudson.model.AbstractBuild$AbstractBuildExecution.run(AbstractBuild.java:531)
	at hudson.model.Run.execute(Run.java:1738)
	at hudson.matrix.MatrixRun.run(MatrixRun.java:146)
	at hudson.model.ResourceController.execute(ResourceController.java:98)
	at hudson.model.Executor.run(Executor.java:408)
Retrying after 10 seconds
java.io.IOException: Failed to mkdirs: <http://jenkins.hosts.mwqe.eng.bos.redhat.com/hudson/job/jbosstools-javaee-tests-matrix_master_otherOS/SUB=jsf%2Ftests,jdk=jdk1.8,label_exp=windows&&x86_64/ws/>
	at hudson.FilePath.mkdirs(FilePath.java:1162)
	at hudson.model.AbstractProject.checkout(AbstractProject.java:1267)
	at hudson.model.AbstractBuild$AbstractBuildExecution.defaultCheckout(AbstractBuild.java:609)
	at jenkins.scm.SCMCheckoutStrategy.checkout(SCMCheckoutStrategy.java:86)
	at hudson.model.AbstractBuild$AbstractBuildExecution.run(AbstractBuild.java:531)
	at hudson.model.Run.execute(Run.java:1738)
	at hudson.matrix.MatrixRun.run(MatrixRun.java:146)
	at hudson.model.ResourceController.execute(ResourceController.java:98)
	at hudson.model.Executor.run(Executor.java:408)
Retrying after 10 seconds
java.io.IOException: Failed to mkdirs: <http://jenkins.hosts.mwqe.eng.bos.redhat.com/hudson/job/jbosstools-javaee-tests-matrix_master_otherOS/SUB=jsf%2Ftests,jdk=jdk1.8,label_exp=windows&&x86_64/ws/>
	at hudson.FilePath.mkdirs(FilePath.java:1162)
	at hudson.model.AbstractProject.checkout(AbstractProject.java:1267)
	at hudson.model.AbstractBuild$AbstractBuildExecution.defaultCheckout(AbstractBuild.java:609)
	at jenkins.scm.SCMCheckoutStrategy.checkout(SCMCheckoutStrategy.java:86)
	at hudson.model.AbstractBuild$AbstractBuildExecution.run(AbstractBuild.java:531)
	at hudson.model.Run.execute(Run.java:1738)
	at hudson.matrix.MatrixRun.run(MatrixRun.java:146)
	at hudson.model.ResourceController.execute(ResourceController.java:98)
	at hudson.model.Executor.run(Executor.java:408)
Checking console output
Archiving artifacts
ERROR: Build step failed with exception
<http://jenkins.hosts.mwqe.eng.bos.redhat.com/hudson/job/jbosstools-javaee-tests-matrix_master_otherOS/SUB=jsf%2Ftests,jdk=jdk1.8,label_exp=windows&&x86_64/ws/> does not exist.
	at org.apache.tools.ant.types.AbstractFileSet.getDirectoryScanner(AbstractFileSet.java:483)
	at org.apache.tools.ant.types.AbstractFileSet.getDirectoryScanner(AbstractFileSet.java:460)
	at hudson.tasks.ArtifactArchiver$ListFiles.invoke(ArtifactArchiver.java:268)
	at hudson.tasks.ArtifactArchiver$ListFiles.invoke(ArtifactArchiver.java:252)
	at hudson.FilePath$FileCallableWrapper.call(FilePath.java:2688)
	at hudson.remoting.UserRequest.perform(UserRequest.java:121)
	at hudson.remoting.UserRequest.perform(UserRequest.java:49)
	at hudson.remoting.Request$2.run(Request.java:326)
	at hudson.remoting.InterceptingExecutorService$1.call(InterceptingExecutorService.java:68)
	at java.util.concurrent.FutureTask$Sync.innerRun(FutureTask.java:303)
	at java.util.concurrent.FutureTask.run(FutureTask.java:138)
	at java.util.concurrent.ThreadPoolExecutor$Worker.runTask(ThreadPoolExecutor.java:895)
	at java.util.concurrent.ThreadPoolExecutor$Worker.run(ThreadPoolExecutor.java:918)
	at java.lang.Thread.run(Thread.java:662)
	at ......remote call to soa7-w8-x86_64(Native Method)
	at hudson.remoting.Channel.attachCallSiteStackTrace(Channel.java:1413)
	at hudson.remoting.UserResponse.retrieve(UserRequest.java:221)
	at hudson.remoting.Channel.call(Channel.java:778)
	at hudson.FilePath.act(FilePath.java:978)
	at hudson.FilePath.act(FilePath.java:967)
	at hudson.tasks.ArtifactArchiver.perform(ArtifactArchiver.java:217)
	at hudson.tasks.BuildStepCompatibilityLayer.perform(BuildStepCompatibilityLayer.java:74)
	at hudson.tasks.BuildStepMonitor$1.perform(BuildStepMonitor.java:20)
	at hudson.model.AbstractBuild$AbstractBuildExecution.perform(AbstractBuild.java:776)
	at hudson.model.AbstractBuild$AbstractBuildExecution.performAllBuildSteps(AbstractBuild.java:723)
	at hudson.model.Build$BuildExecution.post2(Build.java:183)
	at hudson.model.AbstractBuild$AbstractBuildExecution.post(AbstractBuild.java:670)
	at hudson.model.Run.execute(Run.java:1763)
	at hudson.matrix.MatrixRun.run(MatrixRun.java:146)
	at hudson.model.ResourceController.execute(ResourceController.java:98)
	at hudson.model.Executor.run(Executor.java:408)
Build step 'Archive the artifacts' marked build as failure
Recording test results
ERROR: Build step failed with exception
<http://jenkins.hosts.mwqe.eng.bos.redhat.com/hudson/job/jbosstools-javaee-tests-matrix_master_otherOS/SUB=jsf%2Ftests,jdk=jdk1.8,label_exp=windows&&x86_64/ws/> does not exist.
	at org.apache.tools.ant.types.AbstractFileSet.getDirectoryScanner(AbstractFileSet.java:483)
	at org.apache.tools.ant.types.AbstractFileSet.getDirectoryScanner(AbstractFileSet.java:460)
	at hudson.tasks.junit.JUnitParser$ParseResultCallable.invoke(JUnitParser.java:127)
	at hudson.tasks.junit.JUnitParser$ParseResultCallable.invoke(JUnitParser.java:107)
	at hudson.FilePath$FileCallableWrapper.call(FilePath.java:2688)
	at hudson.remoting.UserRequest.perform(UserRequest.java:121)
	at hudson.remoting.UserRequest.perform(UserRequest.java:49)
	at hudson.remoting.Request$2.run(Request.java:326)
	at hudson.remoting.InterceptingExecutorService$1.call(InterceptingExecutorService.java:68)
	at java.util.concurrent.FutureTask$Sync.innerRun(FutureTask.java:303)
	at java.util.concurrent.FutureTask.run(FutureTask.java:138)
	at java.util.concurrent.ThreadPoolExecutor$Worker.runTask(ThreadPoolExecutor.java:895)
	at java.util.concurrent.ThreadPoolExecutor$Worker.run(ThreadPoolExecutor.java:918)
	at java.lang.Thread.run(Thread.java:662)
	at ......remote call to soa7-w8-x86_64(Native Method)
	at hudson.remoting.Channel.attachCallSiteStackTrace(Channel.java:1413)
	at hudson.remoting.UserResponse.retrieve(UserRequest.java:221)
	at hudson.remoting.Channel.call(Channel.java:778)
	at hudson.FilePath.act(FilePath.java:978)
	at hudson.FilePath.act(FilePath.java:967)
	at hudson.tasks.junit.JUnitParser.parseResult(JUnitParser.java:103)
	at hudson.tasks.junit.JUnitResultArchiver.parse(JUnitResultArchiver.java:126)
	at hudson.tasks.junit.JUnitResultArchiver.perform(JUnitResultArchiver.java:144)
	at hudson.tasks.BuildStepCompatibilityLayer.perform(BuildStepCompatibilityLayer.java:74)
	at hudson.tasks.BuildStepMonitor$1.perform(BuildStepMonitor.java:20)
	at hudson.model.AbstractBuild$AbstractBuildExecution.perform(AbstractBuild.java:776)
	at hudson.model.AbstractBuild$AbstractBuildExecution.performAllBuildSteps(AbstractBuild.java:723)
	at hudson.model.Build$BuildExecution.post2(Build.java:183)
	at hudson.model.AbstractBuild$AbstractBuildExecution.post(AbstractBuild.java:670)
	at hudson.model.Run.execute(Run.java:1763)
	at hudson.matrix.MatrixRun.run(MatrixRun.java:146)
	at hudson.model.ResourceController.execute(ResourceController.java:98)
	at hudson.model.Executor.run(Executor.java:408)
Build step 'Publish JUnit test result report' marked build as failure


More information about the jbosstools-builds mailing list