[jbosstools-builds] Build failed in Jenkins: jbosstools-forge_master #4084

dev-platform-jenkins at redhat.com dev-platform-jenkins at redhat.com
Mon Jul 6 23:15:52 EDT 2020


See <https://dev-platform-jenkins.rhev-ci-vms.eng.rdu2.redhat.com/job/jbosstools-forge_master/4084/display/redirect>

------------------------------------------
[...truncated 1.00 MB...]
[INFO] ------------------------------------------------------------------------
[INFO] Skipping forge.site
[INFO] This project has been banned from the build due to previous failures.
[INFO] ------------------------------------------------------------------------
[INFO] ------------------------------------------------------------------------
[INFO] Reactor Summary:
[INFO] 
[INFO] jbosstools-forge ................................... SUCCESS [01:35 min]
[INFO] forge.plugins ...................................... SUCCESS [  0.021 s]
[INFO] org.jboss.tools.aesh.runtime ....................... SUCCESS [01:13 min]
[INFO] org.jboss.tools.aesh.core .......................... SUCCESS [  3.552 s]
[INFO] org.jboss.tools.aesh.ui ............................ SUCCESS [  3.001 s]
[INFO] org.jboss.tools.aesh.example ....................... SUCCESS [  0.568 s]
[INFO] org.jboss.tools.forge.runtime ...................... FAILURE [08:27 min]
[INFO] org.jboss.tools.forge.core ......................... SKIPPED
[INFO] org.jboss.tools.forge.core.ext ..................... SUCCESS [  2.063 s]
[INFO] org.jboss.tools.forge.m2e .......................... SUCCESS [  1.752 s]
[INFO] org.jboss.tools.forge.runtime.ext .................. SUCCESS [  1.650 s]
[INFO] org.jboss.tools.forge.ui.notifications ............. SUCCESS [  1.858 s]
[INFO] org.jboss.tools.forge.ui ........................... SKIPPED
[INFO] org.jboss.tools.forge.ui.ext ....................... SUCCESS [  1.504 s]
[INFO] forge.tests ........................................ SUCCESS [  0.011 s]
[INFO] org.jboss.tools.aesh.core.test ..................... SUCCESS [  0.481 s]
[INFO] org.jboss.tools.aesh.ui.test ....................... SUCCESS [  0.589 s]
[INFO] org.jboss.tools.forge.core.test .................... SKIPPED
[INFO] org.jboss.tools.forge.core.ext.test ................ SUCCESS [  0.185 s]
[INFO] org.jboss.tools.forge.ui.test ...................... SKIPPED
[INFO] org.jboss.tools.forge.ui.ext.test .................. SUCCESS [  0.258 s]
[INFO] forge.features ..................................... SUCCESS [  0.016 s]
[INFO] org.jboss.tools.forge.m2e.feature .................. SUCCESS [  1.345 s]
[INFO] org.jboss.tools.forge.feature ...................... SKIPPED
[INFO] org.jboss.tools.forge.ext.feature .................. SUCCESS [  1.207 s]
[INFO] forge.test-framework ............................... SUCCESS [  0.009 s]
[INFO] org.jboss.tools.forge.reddeer ...................... SUCCESS [  0.420 s]
[INFO] org.jboss.tools.forge.test.feature ................. SKIPPED
[INFO] org.jboss.tools.forge.ext.test.feature ............. SUCCESS [  0.158 s]
[INFO] forge.site ......................................... SKIPPED
[INFO] ------------------------------------------------------------------------
[INFO] BUILD FAILURE
[INFO] ------------------------------------------------------------------------
[INFO] Total time: 20:32 min
[INFO] Finished at: 2020-07-06T23:15:46-04:00
[INFO] Final Memory: 110M/411M
[INFO] ------------------------------------------------------------------------
[ERROR] Failed to execute goal org.eclipse.tycho:tycho-p2-plugin:1.7.0:p2-metadata (attached-p2-metadata) on project org.jboss.tools.forge.runtime: Execution attached-p2-metadata of goal org.eclipse.tycho:tycho-p2-plugin:1.7.0:p2-metadata failed: Error trying to download org.jboss.tools.forge.runtime version 2.0.400.v20200218-0934 from http://download.jboss.org/jbosstools/static/photon/stable/updates/core/4.15.0.Final:
[ERROR] Download of osgi.bundle,org.jboss.tools.forge.runtime,2.0.400.v20200218-0934 failed on repository http://download.jboss.org/jbosstools/static/photon/stable/updates/core/4.15.0.Final. Retrying. :
[ERROR]    Unable to read repository at http://download.jboss.org/jbosstools/static/photon/stable/updates/core/4.15.0.Final/plugins/org.jboss.tools.forge.runtime_2.0.400.v20200218-0934.jar. Connection reset
[ERROR] -> [Help 1]
org.apache.maven.lifecycle.LifecycleExecutionException: Failed to execute goal org.eclipse.tycho:tycho-p2-plugin:1.7.0:p2-metadata (attached-p2-metadata) on project org.jboss.tools.forge.runtime: Execution attached-p2-metadata of goal org.eclipse.tycho:tycho-p2-plugin:1.7.0:p2-metadata failed: Error trying to download org.jboss.tools.forge.runtime version 2.0.400.v20200218-0934 from http://download.jboss.org/jbosstools/static/photon/stable/updates/core/4.15.0.Final:
Download of osgi.bundle,org.jboss.tools.forge.runtime,2.0.400.v20200218-0934 failed on repository http://download.jboss.org/jbosstools/static/photon/stable/updates/core/4.15.0.Final. Retrying. :
   Unable to read repository at http://download.jboss.org/jbosstools/static/photon/stable/updates/core/4.15.0.Final/plugins/org.jboss.tools.forge.runtime_2.0.400.v20200218-0934.jar.
    at org.apache.maven.lifecycle.internal.MojoExecutor.execute (MojoExecutor.java:213)
    at org.apache.maven.lifecycle.internal.MojoExecutor.execute (MojoExecutor.java:154)
    at org.apache.maven.lifecycle.internal.MojoExecutor.execute (MojoExecutor.java:146)
    at org.apache.maven.lifecycle.internal.LifecycleModuleBuilder.buildProject (LifecycleModuleBuilder.java:117)
    at org.apache.maven.lifecycle.internal.LifecycleModuleBuilder.buildProject (LifecycleModuleBuilder.java:81)
    at org.apache.maven.lifecycle.internal.builder.singlethreaded.SingleThreadedBuilder.build (SingleThreadedBuilder.java:51)
    at org.apache.maven.lifecycle.internal.LifecycleStarter.execute (LifecycleStarter.java:128)
    at org.apache.maven.DefaultMaven.doExecute (DefaultMaven.java:309)
    at org.apache.maven.DefaultMaven.doExecute (DefaultMaven.java:194)
    at org.apache.maven.DefaultMaven.execute (DefaultMaven.java:107)
    at org.apache.maven.cli.MavenCli.execute (MavenCli.java:955)
    at org.apache.maven.cli.MavenCli.doMain (MavenCli.java:290)
    at org.apache.maven.cli.MavenCli.main (MavenCli.java:194)
    at sun.reflect.NativeMethodAccessorImpl.invoke0 (Native Method)
    at sun.reflect.NativeMethodAccessorImpl.invoke (NativeMethodAccessorImpl.java:62)
    at sun.reflect.DelegatingMethodAccessorImpl.invoke (DelegatingMethodAccessorImpl.java:43)
    at java.lang.reflect.Method.invoke (Method.java:498)
    at org.codehaus.plexus.classworlds.launcher.Launcher.launchEnhanced (Launcher.java:289)
    at org.codehaus.plexus.classworlds.launcher.Launcher.launch (Launcher.java:229)
    at org.codehaus.plexus.classworlds.launcher.Launcher.mainWithExitCode (Launcher.java:415)
    at org.codehaus.plexus.classworlds.launcher.Launcher.main (Launcher.java:356)
Caused by: org.apache.maven.plugin.PluginExecutionException: Execution attached-p2-metadata of goal org.eclipse.tycho:tycho-p2-plugin:1.7.0:p2-metadata failed: Error trying to download org.jboss.tools.forge.runtime version 2.0.400.v20200218-0934 from http://download.jboss.org/jbosstools/static/photon/stable/updates/core/4.15.0.Final:
Download of osgi.bundle,org.jboss.tools.forge.runtime,2.0.400.v20200218-0934 failed on repository http://download.jboss.org/jbosstools/static/photon/stable/updates/core/4.15.0.Final. Retrying. :
   Unable to read repository at http://download.jboss.org/jbosstools/static/photon/stable/updates/core/4.15.0.Final/plugins/org.jboss.tools.forge.runtime_2.0.400.v20200218-0934.jar.
    at org.apache.maven.plugin.DefaultBuildPluginManager.executeMojo (DefaultBuildPluginManager.java:145)
    at org.apache.maven.lifecycle.internal.MojoExecutor.execute (MojoExecutor.java:208)
    at org.apache.maven.lifecycle.internal.MojoExecutor.execute (MojoExecutor.java:154)
    at org.apache.maven.lifecycle.internal.MojoExecutor.execute (MojoExecutor.java:146)
    at org.apache.maven.lifecycle.internal.LifecycleModuleBuilder.buildProject (LifecycleModuleBuilder.java:117)
    at org.apache.maven.lifecycle.internal.LifecycleModuleBuilder.buildProject (LifecycleModuleBuilder.java:81)
    at org.apache.maven.lifecycle.internal.builder.singlethreaded.SingleThreadedBuilder.build (SingleThreadedBuilder.java:51)
    at org.apache.maven.lifecycle.internal.LifecycleStarter.execute (LifecycleStarter.java:128)
    at org.apache.maven.DefaultMaven.doExecute (DefaultMaven.java:309)
    at org.apache.maven.DefaultMaven.doExecute (DefaultMaven.java:194)
    at org.apache.maven.DefaultMaven.execute (DefaultMaven.java:107)
    at org.apache.maven.cli.MavenCli.execute (MavenCli.java:955)
    at org.apache.maven.cli.MavenCli.doMain (MavenCli.java:290)
    at org.apache.maven.cli.MavenCli.main (MavenCli.java:194)
    at sun.reflect.NativeMethodAccessorImpl.invoke0 (Native Method)
    at sun.reflect.NativeMethodAccessorImpl.invoke (NativeMethodAccessorImpl.java:62)
    at sun.reflect.DelegatingMethodAccessorImpl.invoke (DelegatingMethodAccessorImpl.java:43)
    at java.lang.reflect.Method.invoke (Method.java:498)
    at org.codehaus.plexus.classworlds.launcher.Launcher.launchEnhanced (Launcher.java:289)
    at org.codehaus.plexus.classworlds.launcher.Launcher.launch (Launcher.java:229)
    at org.codehaus.plexus.classworlds.launcher.Launcher.mainWithExitCode (Launcher.java:415)
    at org.codehaus.plexus.classworlds.launcher.Launcher.main (Launcher.java:356)
Caused by: java.lang.RuntimeException: Error trying to download org.jboss.tools.forge.runtime version 2.0.400.v20200218-0934 from http://download.jboss.org/jbosstools/static/photon/stable/updates/core/4.15.0.Final:
Download of osgi.bundle,org.jboss.tools.forge.runtime,2.0.400.v20200218-0934 failed on repository http://download.jboss.org/jbosstools/static/photon/stable/updates/core/4.15.0.Final. Retrying. :
   Unable to read repository at http://download.jboss.org/jbosstools/static/photon/stable/updates/core/4.15.0.Final/plugins/org.jboss.tools.forge.runtime_2.0.400.v20200218-0934.jar.
    at org.eclipse.tycho.p2.tools.baseline.BaselineServiceImpl.getProjectBaseline (BaselineServiceImpl.java:134)
    at org.eclipse.tycho.plugins.p2.BaselineValidator.validateAndReplace (BaselineValidator.java:88)
    at org.eclipse.tycho.plugins.p2.P2MetadataMojo.attachP2Metadata (P2MetadataMojo.java:183)
    at org.eclipse.tycho.plugins.p2.P2MetadataMojo.execute (P2MetadataMojo.java:137)
    at org.apache.maven.plugin.DefaultBuildPluginManager.executeMojo (DefaultBuildPluginManager.java:134)
    at org.apache.maven.lifecycle.internal.MojoExecutor.execute (MojoExecutor.java:208)
    at org.apache.maven.lifecycle.internal.MojoExecutor.execute (MojoExecutor.java:154)
    at org.apache.maven.lifecycle.internal.MojoExecutor.execute (MojoExecutor.java:146)
    at org.apache.maven.lifecycle.internal.LifecycleModuleBuilder.buildProject (LifecycleModuleBuilder.java:117)
    at org.apache.maven.lifecycle.internal.LifecycleModuleBuilder.buildProject (LifecycleModuleBuilder.java:81)
    at org.apache.maven.lifecycle.internal.builder.singlethreaded.SingleThreadedBuilder.build (SingleThreadedBuilder.java:51)
    at org.apache.maven.lifecycle.internal.LifecycleStarter.execute (LifecycleStarter.java:128)
    at org.apache.maven.DefaultMaven.doExecute (DefaultMaven.java:309)
    at org.apache.maven.DefaultMaven.doExecute (DefaultMaven.java:194)
    at org.apache.maven.DefaultMaven.execute (DefaultMaven.java:107)
    at org.apache.maven.cli.MavenCli.execute (MavenCli.java:955)
    at org.apache.maven.cli.MavenCli.doMain (MavenCli.java:290)
    at org.apache.maven.cli.MavenCli.main (MavenCli.java:194)
    at sun.reflect.NativeMethodAccessorImpl.invoke0 (Native Method)
    at sun.reflect.NativeMethodAccessorImpl.invoke (NativeMethodAccessorImpl.java:62)
    at sun.reflect.DelegatingMethodAccessorImpl.invoke (DelegatingMethodAccessorImpl.java:43)
    at java.lang.reflect.Method.invoke (Method.java:498)
    at org.codehaus.plexus.classworlds.launcher.Launcher.launchEnhanced (Launcher.java:289)
    at org.codehaus.plexus.classworlds.launcher.Launcher.launch (Launcher.java:229)
    at org.codehaus.plexus.classworlds.launcher.Launcher.mainWithExitCode (Launcher.java:415)
    at org.codehaus.plexus.classworlds.launcher.Launcher.main (Launcher.java:356)
Caused by: java.net.SocketException: Connection reset
    at java.net.SocketInputStream.read (SocketInputStream.java:210)
    at java.net.SocketInputStream.read (SocketInputStream.java:141)
    at sun.security.ssl.InputRecord.readFully (InputRecord.java:465)
    at sun.security.ssl.InputRecord.readV3Record (InputRecord.java:593)
    at sun.security.ssl.InputRecord.read (InputRecord.java:532)
    at sun.security.ssl.SSLSocketImpl.readRecord (SSLSocketImpl.java:975)
    at sun.security.ssl.SSLSocketImpl.readDataRecord (SSLSocketImpl.java:933)
    at sun.security.ssl.AppInputStream.read (AppInputStream.java:105)
    at org.apache.http.impl.io.SessionInputBufferImpl.streamRead (SessionInputBufferImpl.java:137)
    at org.apache.http.impl.io.SessionInputBufferImpl.read (SessionInputBufferImpl.java:197)
    at org.apache.http.impl.io.ContentLengthInputStream.read (ContentLengthInputStream.java:176)
    at org.apache.http.conn.EofSensorInputStream.read (EofSensorInputStream.java:135)
    at java.io.FilterInputStream.read (FilterInputStream.java:133)
    at java.io.FilterInputStream.read (FilterInputStream.java:107)
    at org.eclipse.ecf.provider.filetransfer.retrieve.AbstractRetrieveFileTransfer$1.performFileTransfer (AbstractRetrieveFileTransfer.java:178)
    at org.eclipse.ecf.filetransfer.FileTransferJob.run (FileTransferJob.java:74)
    at org.eclipse.core.internal.jobs.Worker.run (Worker.java:63)
[ERROR] 
[ERROR] Re-run Maven using the -X switch to enable full debug logging.
[ERROR] 
[ERROR] For more information about the errors and possible solutions, please read the following articles:
[ERROR] [Help 1] http://cwiki.apache.org/confluence/display/MAVEN/PluginExecutionException
[ERROR] 
[ERROR] After correcting the problems, you can resume the build with the command
[ERROR]   mvn <goals> -rf :org.jboss.tools.forge.runtime
Build step 'Execute shell' marked build as failure
Terminating xvnc.
$ /usr/bin/vncserver -kill :60
Killing Xvnc process ID 21773
Archiving artifacts
Recording test results
ERROR: Step ‘Publish JUnit test result report’ failed: No test report files were found. Configuration error?
ERROR: [description-setter] Error while parsing logs for description-setter
java.io.IOException: java.lang.RuntimeException: Failed to serialize hudson.model.Actionable#actions for class hudson.model.FreeStyleBuild
	at hudson.XmlFile.write(XmlFile.java:200)
	at hudson.model.Run.save(Run.java:1994)
	at hudson.model.Run.setDescription(Run.java:2299)
	at hudson.plugins.descriptionsetter.DescriptionSetterHelper.setDescription(DescriptionSetterHelper.java:71)
	at hudson.plugins.descriptionsetter.DescriptionSetterPublisher.perform(DescriptionSetterPublisher.java:70)
	at hudson.tasks.BuildStepMonitor$1.perform(BuildStepMonitor.java:20)
	at hudson.model.AbstractBuild$AbstractBuildExecution.perform(AbstractBuild.java:744)
	at hudson.model.AbstractBuild$AbstractBuildExecution.performAllBuildSteps(AbstractBuild.java:690)
	at hudson.model.Build$BuildExecution.post2(Build.java:186)
	at hudson.model.AbstractBuild$AbstractBuildExecution.post(AbstractBuild.java:635)
	at hudson.model.Run.execute(Run.java:1823)
	at hudson.model.FreeStyleBuild.run(FreeStyleBuild.java:43)
	at hudson.model.ResourceController.execute(ResourceController.java:97)
	at hudson.model.Executor.run(Executor.java:429)
Caused by: java.lang.RuntimeException: Failed to serialize hudson.model.Actionable#actions for class hudson.model.FreeStyleBuild
	at hudson.util.RobustReflectionConverter$2.writeField(RobustReflectionConverter.java:256)
	at hudson.util.RobustReflectionConverter$2.visit(RobustReflectionConverter.java:224)
	at com.thoughtworks.xstream.converters.reflection.PureJavaReflectionProvider.visitSerializableFields(PureJavaReflectionProvider.java:138)
	at hudson.util.RobustReflectionConverter.doMarshal(RobustReflectionConverter.java:209)
	at hudson.util.RobustReflectionConverter.marshal(RobustReflectionConverter.java:150)
	at com.thoughtworks.xstream.core.AbstractReferenceMarshaller.convert(AbstractReferenceMarshaller.java:69)
	at com.thoughtworks.xstream.core.TreeMarshaller.convertAnother(TreeMarshaller.java:58)
	at com.thoughtworks.xstream.core.TreeMarshaller.convertAnother(TreeMarshaller.java:43)
	at com.thoughtworks.xstream.core.TreeMarshaller.start(TreeMarshaller.java:82)
	at com.thoughtworks.xstream.core.AbstractTreeMarshallingStrategy.marshal(AbstractTreeMarshallingStrategy.java:37)
	at com.thoughtworks.xstream.XStream.marshal(XStream.java:1026)
	at com.thoughtworks.xstream.XStream.marshal(XStream.java:1015)
	at com.thoughtworks.xstream.XStream.toXML(XStream.java:988)
	at hudson.XmlFile.write(XmlFile.java:193)
	... 13 more
Caused by: java.lang.RuntimeException: Failed to serialize hudson.model.CauseAction#causeBag for class hudson.model.CauseAction
	at hudson.util.RobustReflectionConverter$2.writeField(RobustReflectionConverter.java:256)
	at hudson.util.RobustReflectionConverter$2.visit(RobustReflectionConverter.java:224)
	at com.thoughtworks.xstream.converters.reflection.PureJavaReflectionProvider.visitSerializableFields(PureJavaReflectionProvider.java:138)
	at hudson.util.RobustReflectionConverter.doMarshal(RobustReflectionConverter.java:209)
	at hudson.util.RobustReflectionConverter.marshal(RobustReflectionConverter.java:150)
	at hudson.util.XStream2$PassthruConverter.marshal(XStream2.java:494)
	at hudson.util.XStream2$AssociatedConverterImpl.marshal(XStream2.java:464)
	at com.thoughtworks.xstream.core.AbstractReferenceMarshaller.convert(AbstractReferenceMarshaller.java:69)
	at com.thoughtworks.xstream.core.TreeMarshaller.convertAnother(TreeMarshaller.java:58)
	at com.thoughtworks.xstream.core.TreeMarshaller.convertAnother(TreeMarshaller.java:43)
	at com.thoughtworks.xstream.core.AbstractReferenceMarshaller$1.convertAnother(AbstractReferenceMarshaller.java:88)
	at com.thoughtworks.xstream.converters.collections.AbstractCollectionConverter.writeItem(AbstractCollectionConverter.java:64)
	at com.thoughtworks.xstream.converters.collections.CollectionConverter.marshal(CollectionConverter.java:74)
	at com.thoughtworks.xstream.core.AbstractReferenceMarshaller.convert(AbstractReferenceMarshaller.java:69)
	at com.thoughtworks.xstream.core.TreeMarshaller.convertAnother(TreeMarshaller.java:58)
	at com.thoughtworks.xstream.core.AbstractReferenceMarshaller$1.convertAnother(AbstractReferenceMarshaller.java:84)
	at hudson.util.RobustReflectionConverter.marshallField(RobustReflectionConverter.java:265)
	at hudson.util.RobustReflectionConverter$2.writeField(RobustReflectionConverter.java:252)
	... 26 more
Caused by: java.lang.RuntimeException: Failed to serialize com.cloudbees.plugins.flow.FlowCause#associatedJob for class com.cloudbees.plugins.flow.FlowCause
	at hudson.util.RobustReflectionConverter$2.writeField(RobustReflectionConverter.java:256)
	at hudson.util.RobustReflectionConverter$2.visit(RobustReflectionConverter.java:224)
	at com.thoughtworks.xstream.converters.reflection.PureJavaReflectionProvider.visitSerializableFields(PureJavaReflectionProvider.java:138)
	at hudson.util.RobustReflectionConverter.doMarshal(RobustReflectionConverter.java:209)
	at hudson.util.RobustReflectionConverter.marshal(RobustReflectionConverter.java:150)
	at com.thoughtworks.xstream.core.AbstractReferenceMarshaller.convert(AbstractReferenceMarshaller.java:69)
	at com.thoughtworks.xstream.core.TreeMarshaller.convertAnother(TreeMarshaller.java:58)
	at com.thoughtworks.xstream.core.TreeMarshaller.convertAnother(TreeMarshaller.java:43)
	at com.thoughtworks.xstream.core.AbstractReferenceMarshaller$1.convertAnother(AbstractReferenceMarshaller.java:88)
	at com.thoughtworks.xstream.converters.collections.AbstractCollectionConverter.writeItem(AbstractCollectionConverter.java:64)
	at com.thoughtworks.xstream.converters.collections.MapConverter.marshal(MapConverter.java:78)
	at com.thoughtworks.xstream.core.AbstractReferenceMarshaller.convert(AbstractReferenceMarshaller.java:69)
	at com.thoughtworks.xstream.core.TreeMarshaller.convertAnother(TreeMarshaller.java:58)
	at com.thoughtworks.xstream.core.AbstractReferenceMarshaller$1.convertAnother(AbstractReferenceMarshaller.java:84)
	at hudson.util.RobustReflectionConverter.marshallField(RobustReflectionConverter.java:265)
	at hudson.util.RobustReflectionConverter$2.writeField(RobustReflectionConverter.java:252)
	... 43 more
Caused by: java.lang.RuntimeException: Failed to serialize com.cloudbees.plugins.flow.JobInvocation#lock for class com.cloudbees.plugins.flow.JobInvocation
	at hudson.util.RobustReflectionConverter$2.writeField(RobustReflectionConverter.java:256)
	at hudson.util.RobustReflectionConverter$2.visit(RobustReflectionConverter.java:224)
	at com.thoughtworks.xstream.converters.reflection.PureJavaReflectionProvider.visitSerializableFields(PureJavaReflectionProvider.java:138)
	at hudson.util.RobustReflectionConverter.doMarshal(RobustReflectionConverter.java:209)
	at hudson.util.RobustReflectionConverter.marshal(RobustReflectionConverter.java:150)
	at com.thoughtworks.xstream.core.AbstractReferenceMarshaller.convert(AbstractReferenceMarshaller.java:69)
	at com.thoughtworks.xstream.core.TreeMarshaller.convertAnother(TreeMarshaller.java:58)
	at com.thoughtworks.xstream.core.AbstractReferenceMarshaller$1.convertAnother(AbstractReferenceMarshaller.java:84)
	at hudson.util.RobustReflectionConverter.marshallField(RobustReflectionConverter.java:265)
	at hudson.util.RobustReflectionConverter$2.writeField(RobustReflectionConverter.java:252)
	... 58 more
Caused by: java.lang.UnsupportedOperationException: Refusing to marshal java.util.concurrent.locks.ReentrantLock for security reasons; see https://jenkins.io/redirect/class-filter/
	at hudson.util.XStream2$BlacklistedTypesConverter.marshal(XStream2.java:546)
	at com.thoughtworks.xstream.core.AbstractReferenceMarshaller.convert(AbstractReferenceMarshaller.java:69)
	at com.thoughtworks.xstream.core.TreeMarshaller.convertAnother(TreeMarshaller.java:58)
	at com.thoughtworks.xstream.core.AbstractReferenceMarshaller$1.convertAnother(AbstractReferenceMarshaller.java:84)
	at hudson.util.RobustReflectionConverter.marshallField(RobustReflectionConverter.java:265)
	at hudson.util.RobustReflectionConverter$2.writeField(RobustReflectionConverter.java:252)
	... 67 more



More information about the jbosstools-builds mailing list