[jbosstools-builds] Build failed in Jenkins: jbosstools-base-Pull-Request #307

dev-platform-jenkins at redhat.com dev-platform-jenkins at redhat.com
Mon Mar 2 10:40:38 EST 2020


See <https://dev-platform-jenkins.rhev-ci-vms.eng.rdu2.redhat.com/job/jbosstools-base-Pull-Request/307/display/redirect?page=changes>

Changes:

[rob] Remove invalid import

------------------------------------------
[...truncated 929.86 KB...]
[INFO] --- build-helper-maven-plugin:1.7:regex-property (regex-property1) @ org.jboss.tools.foundation.checkup.test ---
[INFO] Setting property 'skipTestsOrITests' to 'true'.
[INFO] 
[INFO] --- build-helper-maven-plugin:1.7:regex-property (regex-property2) @ org.jboss.tools.foundation.checkup.test ---
[INFO] Setting property 'skipTestsWithPrivateRequirements' to 'true'.
[INFO] 
[INFO] --- maven-enforcer-plugin:1.4.1:enforce (core-has-ui-deps) @ org.jboss.tools.foundation.checkup.test ---
[INFO] 
[INFO] --- maven-enforcer-plugin:1.4.1:enforce (warn-no-snapshots-AMx) @ org.jboss.tools.foundation.checkup.test ---
[INFO] 
[INFO] --- maven-enforcer-plugin:1.4.1:enforce (enforce-no-snapshots-Final) @ org.jboss.tools.foundation.checkup.test ---
[INFO] 
[INFO] --- jacoco-maven-plugin:0.8.4:prepare-agent (default) @ org.jboss.tools.foundation.checkup.test ---
[INFO] tycho.testArgLine set to -javaagent:<https://dev-platform-jenkins.rhev-ci-vms.eng.rdu2.redhat.com/job/jbosstools-base-Pull-Request/ws/.repository/org/jacoco/org.jacoco.agent/0.8.4/org.jacoco.agent-0.8.4-runtime.jar=destfile=/mnt/hudson_workspace/workspace/jbosstools-base-Pull-Request/foundation/tests/org.jboss.tools.foundation.checkup.test/target/jacoco.exec,append=true>
[INFO] 
[INFO] --- maven-resources-plugin:2.4.1:resources (default-resources) @ org.jboss.tools.foundation.checkup.test ---
[INFO] Using 'ISO-8859-1' encoding to copy filtered resources.
[INFO] skip non existing resourceDirectory <https://dev-platform-jenkins.rhev-ci-vms.eng.rdu2.redhat.com/job/jbosstools-base-Pull-Request/ws/foundation/tests/org.jboss.tools.foundation.checkup.test/src/main/resources>
[INFO] 
[INFO] --- tycho-compiler-plugin:1.6.0:compile (default-compile) @ org.jboss.tools.foundation.checkup.test ---
[WARNING] Parameter 'useProjectSettings' is set to true, but preferences file '<https://dev-platform-jenkins.rhev-ci-vms.eng.rdu2.redhat.com/job/jbosstools-base-Pull-Request/ws/foundation/tests/org.jboss.tools.foundation.checkup.test/.settings/org.eclipse.jdt.core.prefs'> could not be found!
[INFO] Compiling 3 source files to <https://dev-platform-jenkins.rhev-ci-vms.eng.rdu2.redhat.com/job/jbosstools-base-Pull-Request/ws/foundation/tests/org.jboss.tools.foundation.checkup.test/target/classes>
[INFO] 
[INFO] --- maven-resources-plugin:2.4.1:testResources (default-testResources) @ org.jboss.tools.foundation.checkup.test ---
[INFO] Using 'ISO-8859-1' encoding to copy filtered resources.
[INFO] skip non existing resourceDirectory <https://dev-platform-jenkins.rhev-ci-vms.eng.rdu2.redhat.com/job/jbosstools-base-Pull-Request/ws/foundation/tests/org.jboss.tools.foundation.checkup.test/src/test/resources>
[INFO] 
[INFO] --- tycho-source-plugin:1.6.0:plugin-source (plugin-source) @ org.jboss.tools.foundation.checkup.test ---
[WARNING] Bundle-Vendor header not found in <https://dev-platform-jenkins.rhev-ci-vms.eng.rdu2.redhat.com/job/jbosstools-base-Pull-Request/ws/foundation/tests/org.jboss.tools.foundation.checkup.test/META-INF/MANIFEST.MF,> fallback to 'unknown' for source bundle
[INFO] Building jar: <https://dev-platform-jenkins.rhev-ci-vms.eng.rdu2.redhat.com/job/jbosstools-base-Pull-Request/ws/foundation/tests/org.jboss.tools.foundation.checkup.test/target/org.jboss.tools.foundation.checkup.test-1.6.0-SNAPSHOT-sources.jar>
[INFO] 
[INFO] --- target-platform-configuration:1.6.0:target-platform (default-target-platform) @ org.jboss.tools.foundation.checkup.test ---
[INFO] 
[INFO] --- tycho-packaging-plugin:1.6.0:package-plugin (default-package-plugin) @ org.jboss.tools.foundation.checkup.test ---
[INFO] Building jar: <https://dev-platform-jenkins.rhev-ci-vms.eng.rdu2.redhat.com/job/jbosstools-base-Pull-Request/ws/foundation/tests/org.jboss.tools.foundation.checkup.test/target/org.jboss.tools.foundation.checkup.test-1.6.0-SNAPSHOT.jar>
[INFO] 
[INFO] --- tycho-p2-plugin:1.6.0:p2-metadata-default (default-p2-metadata-default) @ org.jboss.tools.foundation.checkup.test ---
[INFO] No baseline version MavenProject: org.jboss.tools.foundation.tests:org.jboss.tools.foundation.checkup.test:1.6.0-SNAPSHOT @ <https://dev-platform-jenkins.rhev-ci-vms.eng.rdu2.redhat.com/job/jbosstools-base-Pull-Request/ws/foundation/tests/org.jboss.tools.foundation.checkup.test/pom.xml>
[INFO] 
[INFO] --- repository-utils:1.6.0:generate-repository-facade (generate-facade) @ org.jboss.tools.foundation.checkup.test ---
[INFO] 
[INFO] --- tycho-p2-plugin:1.6.0:p2-metadata (attached-p2-metadata) @ org.jboss.tools.foundation.checkup.test ---
[INFO] No baseline version MavenProject: org.jboss.tools.foundation.tests:org.jboss.tools.foundation.checkup.test:1.6.0-SNAPSHOT @ <https://dev-platform-jenkins.rhev-ci-vms.eng.rdu2.redhat.com/job/jbosstools-base-Pull-Request/ws/foundation/tests/org.jboss.tools.foundation.checkup.test/pom.xml>
[INFO] 
[INFO] --- tycho-surefire-plugin:1.6.0:test (default-test) @ org.jboss.tools.foundation.checkup.test ---
[INFO] Expected eclipse log file: <https://dev-platform-jenkins.rhev-ci-vms.eng.rdu2.redhat.com/job/jbosstools-base-Pull-Request/ws/foundation/tests/org.jboss.tools.foundation.checkup.test/target/work/data/.metadata/.log>
[INFO] Command line:
	[/qa/tools/opt/x86_64/openjdk-1.8.0.222.b10/jre/bin/java, -Dosgi.noShutdown=false, -Dosgi.os=linux, -Dosgi.ws=gtk, -Dosgi.arch=x86_64, -javaagent:<https://dev-platform-jenkins.rhev-ci-vms.eng.rdu2.redhat.com/job/jbosstools-base-Pull-Request/ws/.repository/org/jacoco/org.jacoco.agent/0.8.4/org.jacoco.agent-0.8.4-runtime.jar=destfile=/mnt/hudson_workspace/workspace/jbosstools-base-Pull-Request/foundation/tests/org.jboss.tools.foundation.checkup.test/target/jacoco.exec,append=true,> -Xms512m, -Xmx1024m, -XX:MetaspaceSize=256m, -Dusage_reporting_enabled=false, -Dorg.jboss.tools.tests.skipPrivateRequirements=true, -Dorg.eclipse.ui.testsDisableWorkbenchAutoSave=true, -Dosgi.clean=true, -jar, <https://dev-platform-jenkins.rhev-ci-vms.eng.rdu2.redhat.com/job/jbosstools-base-Pull-Request/ws/.repository/p2/osgi/bundle/org.eclipse.equinox.launcher/1.5.600.v20191014-2022/org.eclipse.equinox.launcher-1.5.600.v20191014-2022.jar,> -data, <https://dev-platform-jenkins.rhev-ci-vms.eng.rdu2.redhat.com/job/jbosstools-base-Pull-Request/ws/foundation/tests/org.jboss.tools.foundation.checkup.test/target/work/data,> -install, <https://dev-platform-jenkins.rhev-ci-vms.eng.rdu2.redhat.com/job/jbosstools-base-Pull-Request/ws/foundation/tests/org.jboss.tools.foundation.checkup.test/target/work,> -configuration, <https://dev-platform-jenkins.rhev-ci-vms.eng.rdu2.redhat.com/job/jbosstools-base-Pull-Request/ws/foundation/tests/org.jboss.tools.foundation.checkup.test/target/work/configuration,> -application, org.eclipse.tycho.surefire.osgibooter.headlesstest, -testproperties, <https://dev-platform-jenkins.rhev-ci-vms.eng.rdu2.redhat.com/job/jbosstools-base-Pull-Request/ws/foundation/tests/org.jboss.tools.foundation.checkup.test/target/surefire.properties,> -timeout, 2400000]
Running org.jboss.tools.foundation.checkup.test.JVMProblemDetectorTest
Tests run: 7, Failures: 0, Errors: 0, Skipped: 0, Time elapsed: 0.544 s - in org.jboss.tools.foundation.checkup.test.JVMProblemDetectorTest
testJVMProblemDetector(org.jboss.tools.foundation.checkup.test.JVMProblemDetectorTest)  Time elapsed: 0.179 s
testTwoSessionsDateBefore(org.jboss.tools.foundation.checkup.test.JVMProblemDetectorTest)  Time elapsed: 0.011 s
testOneSessionDateBefore(org.jboss.tools.foundation.checkup.test.JVMProblemDetectorTest)  Time elapsed: 0.001 s
testTwoSessionsDateAfter(org.jboss.tools.foundation.checkup.test.JVMProblemDetectorTest)  Time elapsed: 0.001 s
testUnresolvedClassesDialogProviders(org.jboss.tools.foundation.checkup.test.JVMProblemDetectorTest)  Time elapsed: 0.298 s
testOneSessionDateAfter(org.jboss.tools.foundation.checkup.test.JVMProblemDetectorTest)  Time elapsed: 0.001 s
testUnresolvedModulesDialogProviders(org.jboss.tools.foundation.checkup.test.JVMProblemDetectorTest)  Time elapsed: 0.009 s
Running org.jboss.tools.foundation.checkup.test.TestEnvironmentDetectorTest
Tests run: 1, Failures: 0, Errors: 0, Skipped: 0, Time elapsed: 0.004 s - in org.jboss.tools.foundation.checkup.test.TestEnvironmentDetectorTest
testDetector(org.jboss.tools.foundation.checkup.test.TestEnvironmentDetectorTest)  Time elapsed: 0.003 s

Results:

Tests run: 8, Failures: 0, Errors: 0, Skipped: 0

[INFO] All tests passed!
[INFO] 
[INFO] --- tycho-p2-extras-plugin:1.6.0:compare-version-with-baselines (default) @ org.jboss.tools.foundation.checkup.test ---
[INFO] 
[INFO] ------------------------------------------------------------------------
[INFO] Building org.jboss.tools.foundation.core.test 1.6.0-SNAPSHOT
[INFO] ------------------------------------------------------------------------
[INFO] 
[INFO] --- maven-clean-plugin:2.6.1:clean (default-clean) @ org.jboss.tools.foundation.core.test ---
[INFO] 
[INFO] --- tycho-packaging-plugin:1.6.0:build-qualifier (default-build-qualifier) @ org.jboss.tools.foundation.core.test ---
[INFO] The project's OSGi version is 1.6.0.v20200204-1817
[INFO] 
[INFO] --- tycho-packaging-plugin:1.6.0:validate-id (default-validate-id) @ org.jboss.tools.foundation.core.test ---
[INFO] 
[INFO] --- tycho-packaging-plugin:1.6.0:validate-version (default-validate-version) @ org.jboss.tools.foundation.core.test ---
[INFO] 
[INFO] --- build-helper-maven-plugin:1.7:regex-property (regex-property1) @ org.jboss.tools.foundation.core.test ---
[INFO] Setting property 'skipTestsOrITests' to 'true'.
[INFO] 
[INFO] --- build-helper-maven-plugin:1.7:regex-property (regex-property2) @ org.jboss.tools.foundation.core.test ---
[INFO] Setting property 'skipTestsWithPrivateRequirements' to 'true'.
[INFO] 
[INFO] --- maven-enforcer-plugin:1.4.1:enforce (core-has-ui-deps) @ org.jboss.tools.foundation.core.test ---
[INFO] 
[INFO] --- maven-enforcer-plugin:1.4.1:enforce (warn-no-snapshots-AMx) @ org.jboss.tools.foundation.core.test ---
[INFO] 
[INFO] --- maven-enforcer-plugin:1.4.1:enforce (enforce-no-snapshots-Final) @ org.jboss.tools.foundation.core.test ---
[INFO] 
[INFO] --- jacoco-maven-plugin:0.8.4:prepare-agent (default) @ org.jboss.tools.foundation.core.test ---
[INFO] tycho.testArgLine set to -javaagent:<https://dev-platform-jenkins.rhev-ci-vms.eng.rdu2.redhat.com/job/jbosstools-base-Pull-Request/ws/.repository/org/jacoco/org.jacoco.agent/0.8.4/org.jacoco.agent-0.8.4-runtime.jar=destfile=/mnt/hudson_workspace/workspace/jbosstools-base-Pull-Request/foundation/tests/org.jboss.tools.foundation.core.test/target/jacoco.exec,append=true>
[INFO] 
[INFO] --- maven-resources-plugin:2.4.1:resources (default-resources) @ org.jboss.tools.foundation.core.test ---
[INFO] Using 'ISO-8859-1' encoding to copy filtered resources.
[INFO] skip non existing resourceDirectory <https://dev-platform-jenkins.rhev-ci-vms.eng.rdu2.redhat.com/job/jbosstools-base-Pull-Request/ws/foundation/tests/org.jboss.tools.foundation.core.test/src/main/resources>
[INFO] 
[INFO] --- tycho-compiler-plugin:1.6.0:compile (default-compile) @ org.jboss.tools.foundation.core.test ---
[WARNING] Parameter 'useProjectSettings' is set to true, but preferences file '<https://dev-platform-jenkins.rhev-ci-vms.eng.rdu2.redhat.com/job/jbosstools-base-Pull-Request/ws/foundation/tests/org.jboss.tools.foundation.core.test/.settings/org.eclipse.jdt.core.prefs'> could not be found!
[INFO] Compiling 14 source files to <https://dev-platform-jenkins.rhev-ci-vms.eng.rdu2.redhat.com/job/jbosstools-base-Pull-Request/ws/foundation/tests/org.jboss.tools.foundation.core.test/target/classes>
[INFO] 
[INFO] ------------------------------------------------------------------------
[INFO] Skipping jbosstools-base
[INFO] This project has been banned from the build due to previous failures.
[INFO] ------------------------------------------------------------------------
[INFO] ------------------------------------------------------------------------
[INFO] Reactor Summary:
[INFO] 
[INFO] jbosstools-base .................................... SUCCESS [ 58.082 s]
[INFO] tests.all .......................................... SUCCESS [  0.012 s]
[INFO] tests.plugins ...................................... SUCCESS [  0.010 s]
[INFO] org.jboss.tools.tests .............................. SUCCESS [ 38.841 s]
[INFO] tests.tests ........................................ SUCCESS [  0.012 s]
[INFO] org.jboss.tools.tests.test ......................... SUCCESS [ 35.844 s]
[INFO] tests.features ..................................... SUCCESS [  0.012 s]
[INFO] foundation.all ..................................... SUCCESS [  0.008 s]
[INFO] foundation.features ................................ SUCCESS [  0.090 s]
[INFO] org.jboss.tools.foundation.license.feature ......... SUCCESS [  0.860 s]
[INFO] org.jboss.tools.test.feature ....................... SUCCESS [  0.212 s]
[INFO] foundation.plugins ................................. SUCCESS [  0.007 s]
[INFO] org.jboss.tools.foundation.core .................... SUCCESS [  8.205 s]
[INFO] org.jboss.tools.foundation.checkup ................. SUCCESS [  2.003 s]
[INFO] org.jboss.tools.foundation.ui ...................... SUCCESS [ 18.301 s]
[INFO] org.jboss.tools.foundation.security.linux .......... SUCCESS [  1.737 s]
[INFO] org.jboss.tools.foundation.help.ui ................. SUCCESS [  2.121 s]
[INFO] org.jboss.tools.foundation.feature ................. SUCCESS [  1.187 s]
[INFO] org.jboss.tools.foundation.security.linux.feature .. SUCCESS [  1.530 s]
[INFO] foundation.tests ................................... SUCCESS [  0.006 s]
[INFO] org.jboss.tools.foundation.checkup.test ............ SUCCESS [  5.029 s]
[INFO] org.jboss.tools.foundation.core.test ............... FAILURE [  0.195 s]
[INFO] org.jboss.tools.foundation.help.test ............... SKIPPED
[INFO] org.jboss.tools.foundation.ui.test ................. SKIPPED
[INFO] org.jboss.tools.foundation.test.feature ............ SKIPPED
[INFO] common.all ......................................... SKIPPED
[INFO] common.plugins ..................................... SKIPPED
[INFO] org.jboss.tools.common.core ........................ SKIPPED
[INFO] org.jboss.tools.common ............................. SKIPPED
[INFO] org.jboss.tools.common.resref.core ................. SKIPPED
[INFO] org.jboss.tools.common.el.core ..................... SKIPPED
[INFO] org.jboss.tools.common.model.ui.capabilities ....... SKIPPED
[INFO] org.jboss.tools.common.model ....................... SKIPPED
[INFO] org.jboss.tools.common.text.xml .................... SKIPPED
[INFO] org.jboss.tools.common.validation .................. SKIPPED
[INFO] org.jboss.tools.common.ui .......................... SKIPPED
[INFO] org.jboss.tools.common.text.ext .................... SKIPPED
[INFO] org.jboss.tools.common.model.ui .................... SKIPPED
[INFO] org.jboss.tools.common.el.ui ....................... SKIPPED
[INFO] org.jboss.tools.common.gef ......................... SKIPPED
[INFO] org.jboss.tools.common.meta.ui ..................... SKIPPED
[INFO] org.jboss.tools.common.projecttemplates ............ SKIPPED
[INFO] org.jboss.tools.common.resref.ui ................... SKIPPED
[INFO] org.jboss.tools.common.verification ................ SKIPPED
[INFO] org.jboss.tools.common.verification.ui ............. SKIPPED
[INFO] org.jboss.tools.common.jdt.debug ................... SKIPPED
[INFO] org.jboss.tools.common.jdt.debug.ui ................ SKIPPED
[INFO] org.jboss.tools.common.jdt ......................... SKIPPED
[INFO] org.jboss.tools.common.jdt.ui ...................... SKIPPED
[INFO] org.jboss.tools.common.mylyn ....................... SKIPPED
[INFO] org.jboss.tools.common.jaxb ........................ SKIPPED
[INFO] common.features .................................... SKIPPED
[INFO] org.jboss.tools.common.core.feature ................ SKIPPED
[INFO] org.jboss.tools.common.feature ..................... SKIPPED
[INFO] org.jboss.tools.common.text.ext.feature ............ SKIPPED
[INFO] org.jboss.tools.common.ui.feature .................. SKIPPED
[INFO] org.jboss.tools.common.verification.feature ........ SKIPPED
[INFO] org.jboss.tools.common.all.feature ................. SKIPPED
[INFO] common.test-framework .............................. SKIPPED
[INFO] org.jboss.tools.common.reddeer ..................... SKIPPED
[INFO] common.tests ....................................... SKIPPED
[INFO] org.jboss.tools.common.core.test ................... SKIPPED
[INFO] org.jboss.tools.common.test ........................ SKIPPED
[INFO] org.jboss.tools.common.el.core.test ................ SKIPPED
[INFO] org.jboss.tools.common.model.test .................. SKIPPED
[INFO] org.jboss.tools.common.model.ui.test ............... SKIPPED
[INFO] org.jboss.tools.common.base.test ................... SKIPPED
[INFO] org.jboss.tools.common.validation.test ............. SKIPPED
[INFO] org.jboss.tools.common.verification.test ........... SKIPPED
[INFO] org.jboss.tools.common.verification.ui.test ........ SKIPPED
[INFO] org.jboss.tools.common.ui.test ..................... SKIPPED
[INFO] org.jboss.tools.common.text.ext.test ............... SKIPPED
[INFO] org.jboss.tools.common.mylyn.test .................. SKIPPED
[INFO] org.jboss.tools.common.all.test.feature ............ SKIPPED
[INFO] org.jboss.tools.common.jdt.feature ................. SKIPPED
[INFO] org.jboss.tools.common.mylyn.feature ............... SKIPPED
[INFO] stacks.all ......................................... SKIPPED
[INFO] stacks.plugins ..................................... SKIPPED
[INFO] org.jboss.tools.stacks.core ........................ SKIPPED
[INFO] stacks.tests ....................................... SKIPPED
[INFO] org.jboss.tools.stacks.core.test ................... SKIPPED
[INFO] stacks.features .................................... SKIPPED
[INFO] org.jboss.tools.stacks.core.feature ................ SKIPPED
[INFO] org.jboss.tools.stacks.core.test.feature ........... SKIPPED
[INFO] runtime.all ........................................ SKIPPED
[INFO] runtime.plugins .................................... SKIPPED
[INFO] org.jboss.tools.runtime.core ....................... SKIPPED
[INFO] org.jboss.tools.runtime.ui ......................... SKIPPED
[INFO] runtime.test-framework ............................. SKIPPED
[INFO] org.jboss.tools.runtime.reddeer .................... SKIPPED
[INFO] runtime.tests ...................................... SKIPPED
[INFO] org.jboss.tools.runtime.test ....................... SKIPPED
[INFO] runtime.features ................................... SKIPPED
[INFO] org.jboss.tools.runtime.core.feature ............... SKIPPED
[INFO] org.jboss.tools.runtime.test.feature ............... SKIPPED
[INFO] usage.all .......................................... SKIPPED
[INFO] usage.plugins ...................................... SKIPPED
[INFO] org.jboss.tools.usage .............................. SKIPPED
[INFO] usage.tests ........................................ SKIPPED
[INFO] org.jboss.tools.usage.test ......................... SKIPPED
[INFO] usage.features ..................................... SKIPPED
[INFO] org.jboss.tools.usage.feature ...................... SKIPPED
[INFO] org.jboss.tools.usage.test.feature ................. SKIPPED
[INFO] base.site .......................................... SKIPPED
[INFO] Base JaCoCo Report ................................. SKIPPED
[INFO] ------------------------------------------------------------------------
[INFO] BUILD FAILURE
[INFO] ------------------------------------------------------------------------
[INFO] Total time: 11:21 min
[INFO] Finished at: 2020-03-02T10:40:33-05:00
[INFO] Final Memory: 181M/690M
[INFO] ------------------------------------------------------------------------
[ERROR] Failed to execute goal org.eclipse.tycho:tycho-compiler-plugin:1.6.0:compile (default-compile) on project org.jboss.tools.foundation.core.test: Compilation failure: Compilation failure: 
[ERROR] <https://dev-platform-jenkins.rhev-ci-vms.eng.rdu2.redhat.com/job/jbosstools-base-Pull-Request/ws/foundation/tests/org.jboss.tools.foundation.core.test/src/org/jboss/tools/foundation/core/properties/mock/MockDevStudioPropertiesProvider.java>:[27] 
[ERROR] 	protected String getCurrentVersion() {
[ERROR] 	                 ^^^^^^^^^^^^^^^^^^^
[ERROR] Cannot reduce the visibility of the inherited method from VersionPropertiesProvider
[ERROR] <https://dev-platform-jenkins.rhev-ci-vms.eng.rdu2.redhat.com/job/jbosstools-base-Pull-Request/ws/foundation/tests/org.jboss.tools.foundation.core.test/src/org/jboss/tools/foundation/core/properties/mock/MockDevStudioPropertiesProvider.java>:[32] 
[ERROR] 	protected String getContext() {
[ERROR] 	                 ^^^^^^^^^^^^
[ERROR] Cannot reduce the visibility of the inherited method from VersionPropertiesProvider
[ERROR] 2 problems (2 errors)
[ERROR] -> [Help 1]
[ERROR] 
[ERROR] To see the full stack trace of the errors, re-run Maven with the -e switch.
[ERROR] Re-run Maven using the -X switch to enable full debug logging.
[ERROR] 
[ERROR] For more information about the errors and possible solutions, please read the following articles:
[ERROR] [Help 1] http://cwiki.apache.org/confluence/display/MAVEN/MojoFailureException
[ERROR] 
[ERROR] After correcting the problems, you can resume the build with the command
[ERROR]   mvn <goals> -rf :org.jboss.tools.foundation.core.test
Build step 'Invoke top-level Maven targets' marked build as failure
Terminating xvnc.
$ /usr/bin/vncserver -kill :85
Killing Xvnc process ID 25140
Recording test results



More information about the jbosstools-builds mailing list