[jbossts-issues] [JBoss JIRA] (JBTM-1979) REST-AT integration API recovery tests failed on IPv6

Gytis Trikleris (JIRA) jira-events at lists.jboss.org
Wed Oct 16 08:56:02 EDT 2013


     [ https://issues.jboss.org/browse/JBTM-1979?page=com.atlassian.jira.plugin.system.issuetabpanels:all-tabpanel ]

Gytis Trikleris updated JBTM-1979:
----------------------------------

        Status: Resolved  (was: Pull Request Sent)
    Resolution: Done

    
> REST-AT integration API recovery tests failed on IPv6
> -----------------------------------------------------
>
>                 Key: JBTM-1979
>                 URL: https://issues.jboss.org/browse/JBTM-1979
>             Project: JBoss Transaction Manager
>          Issue Type: Bug
>      Security Level: Public(Everyone can see) 
>          Components: REST
>            Reporter: Gytis Trikleris
>            Assignee: Gytis Trikleris
>            Priority: Minor
>             Fix For: 5.0.0.Final
>
>
> http://172.17.131.2/view/Narayana+BlackTie/job/narayana-dualstack/137/consoleText
> {code}
> Running org.jboss.narayana.rest.integration.test.integration.RecoveryIntegrationTestCase
> Tests run: 4, Failures: 0, Errors: 4, Skipped: 0, Time elapsed: 5,989.309 sec <<< FAILURE!
> testCrashAfterPrepare(org.jboss.narayana.rest.integration.test.integration.RecoveryIntegrationTestCase)  Time elapsed: 2,994.019 sec  <<< ERROR!
> org.jboss.arquillian.container.spi.client.container.LifecycleException: Could not start container
> 	at org.jboss.as.arquillian.container.managed.ManagedDeployableContainer.startInternal(ManagedDeployableContainer.java:199)
> 	at org.jboss.as.arquillian.container.CommonDeployableContainer.start(CommonDeployableContainer.java:112)
> 	at org.jboss.arquillian.container.impl.ContainerImpl.start(ContainerImpl.java:199)
> 	at org.jboss.arquillian.container.impl.client.container.ContainerLifecycleController$8.perform(ContainerLifecycleController.java:163)
> 	at org.jboss.arquillian.container.impl.client.container.ContainerLifecycleController$8.perform(ContainerLifecycleController.java:157)
> 	at org.jboss.arquillian.container.impl.client.container.ContainerLifecycleController.forContainer(ContainerLifecycleController.java:255)
> 	at org.jboss.arquillian.container.impl.client.container.ContainerLifecycleController.startContainer(ContainerLifecycleController.java:156)
> 	at sun.reflect.NativeMethodAccessorImpl.invoke0(Native Method)
> 	at sun.reflect.NativeMethodAccessorImpl.invoke(NativeMethodAccessorImpl.java:57)
> 	at sun.reflect.DelegatingMethodAccessorImpl.invoke(DelegatingMethodAccessorImpl.java:43)
> 	at java.lang.reflect.Method.invoke(Method.java:601)
> 	at org.jboss.arquillian.core.impl.ObserverImpl.invoke(ObserverImpl.java:94)
> 	at org.jboss.arquillian.core.impl.EventContextImpl.invokeObservers(EventContextImpl.java:99)
> 	at org.jboss.arquillian.core.impl.EventContextImpl.proceed(EventContextImpl.java:81)
> 	at org.jboss.arquillian.container.impl.client.ContainerDeploymentContextHandler.createContainerContext(ContainerDeploymentContextHandler.java:57)
> 	at sun.reflect.NativeMethodAccessorImpl.invoke0(Native Method)
> 	at sun.reflect.NativeMethodAccessorImpl.invoke(NativeMethodAccessorImpl.java:57)
> 	at sun.reflect.DelegatingMethodAccessorImpl.invoke(DelegatingMethodAccessorImpl.java:43)
> 	at java.lang.reflect.Method.invoke(Method.java:601)
> 	at org.jboss.arquillian.core.impl.ObserverImpl.invoke(ObserverImpl.java:94)
> 	at org.jboss.arquillian.core.impl.EventContextImpl.proceed(EventContextImpl.java:88)
> 	at org.jboss.arquillian.core.impl.ManagerImpl.fire(ManagerImpl.java:135)
> 	at org.jboss.arquillian.core.impl.ManagerImpl.fire(ManagerImpl.java:115)
> 	at org.jboss.arquillian.core.impl.EventImpl.fire(EventImpl.java:67)
> 	at org.jboss.arquillian.container.test.impl.client.container.ClientContainerController.start(ClientContainerController.java:150)
> 	at org.jboss.narayana.rest.integration.test.integration.AbstractIntegrationTestCase.startContainer(AbstractIntegrationTestCase.java:65)
> 	at org.jboss.narayana.rest.integration.test.integration.RecoveryIntegrationTestCase.testCrashAfterPrepare(RecoveryIntegrationTestCase.java:57)
> 	at sun.reflect.NativeMethodAccessorImpl.invoke0(Native Method)
> 	at sun.reflect.NativeMethodAccessorImpl.invoke(NativeMethodAccessorImpl.java:57)
> 	at sun.reflect.DelegatingMethodAccessorImpl.invoke(DelegatingMethodAccessorImpl.java:43)
> 	at java.lang.reflect.Method.invoke(Method.java:601)
> 	at org.junit.runners.model.FrameworkMethod$1.runReflectiveCall(FrameworkMethod.java:45)
> 	at org.junit.internal.runners.model.ReflectiveCallable.run(ReflectiveCallable.java:15)
> 	at org.junit.runners.model.FrameworkMethod.invokeExplosively(FrameworkMethod.java:42)
> 	at org.jboss.arquillian.junit.Arquillian$6$1.invoke(Arquillian.java:270)
> 	at org.jboss.arquillian.container.test.impl.execution.LocalTestExecuter.execute(LocalTestExecuter.java:60)
> 	at sun.reflect.NativeMethodAccessorImpl.invoke0(Native Method)
> 	at sun.reflect.NativeMethodAccessorImpl.invoke(NativeMethodAccessorImpl.java:57)
> 	at sun.reflect.DelegatingMethodAccessorImpl.invoke(DelegatingMethodAccessorImpl.java:43)
> 	at java.lang.reflect.Method.invoke(Method.java:601)
> 	at org.jboss.arquillian.core.impl.ObserverImpl.invoke(ObserverImpl.java:94)
> 	at org.jboss.arquillian.core.impl.EventContextImpl.invokeObservers(EventContextImpl.java:99)
> 	at org.jboss.arquillian.core.impl.EventContextImpl.proceed(EventContextImpl.java:81)
> 	at org.jboss.arquillian.core.impl.ManagerImpl.fire(ManagerImpl.java:135)
> 	at org.jboss.arquillian.core.impl.ManagerImpl.fire(ManagerImpl.java:115)
> 	at org.jboss.arquillian.core.impl.EventImpl.fire(EventImpl.java:67)
> 	at org.jboss.arquillian.container.test.impl.execution.ClientTestExecuter.execute(ClientTestExecuter.java:53)
> 	at sun.reflect.NativeMethodAccessorImpl.invoke0(Native Method)
> 	at sun.reflect.NativeMethodAccessorImpl.invoke(NativeMethodAccessorImpl.java:57)
> 	at sun.reflect.DelegatingMethodAccessorImpl.invoke(DelegatingMethodAccessorImpl.java:43)
> 	at java.lang.reflect.Method.invoke(Method.java:601)
> 	at org.jboss.arquillian.core.impl.ObserverImpl.invoke(ObserverImpl.java:94)
> 	at org.jboss.arquillian.core.impl.EventContextImpl.invokeObservers(EventContextImpl.java:99)
> 	at org.jboss.arquillian.core.impl.EventContextImpl.proceed(EventContextImpl.java:81)
> 	at org.jboss.arquillian.container.test.impl.client.ContainerEventController.createContext(ContainerEventController.java:142)
> 	at org.jboss.arquillian.container.test.impl.client.ContainerEventController.createTestContext(ContainerEventController.java:129)
> 	at sun.reflect.NativeMethodAccessorImpl.invoke0(Native Method)
> 	at sun.reflect.NativeMethodAccessorImpl.invoke(NativeMethodAccessorImpl.java:57)
> 	at sun.reflect.DelegatingMethodAccessorImpl.invoke(DelegatingMethodAccessorImpl.java:43)
> 	at java.lang.reflect.Method.invoke(Method.java:601)
> 	at org.jboss.arquillian.core.impl.ObserverImpl.invoke(ObserverImpl.java:94)
> 	at org.jboss.arquillian.core.impl.EventContextImpl.proceed(EventContextImpl.java:88)
> 	at org.jboss.arquillian.test.impl.TestContextHandler.createTestContext(TestContextHandler.java:89)
> 	at sun.reflect.NativeMethodAccessorImpl.invoke0(Native Method)
> 	at sun.reflect.NativeMethodAccessorImpl.invoke(NativeMethodAccessorImpl.java:57)
> 	at sun.reflect.DelegatingMethodAccessorImpl.invoke(DelegatingMethodAccessorImpl.java:43)
> 	at java.lang.reflect.Method.invoke(Method.java:601)
> 	at org.jboss.arquillian.core.impl.ObserverImpl.invoke(ObserverImpl.java:94)
> 	at org.jboss.arquillian.core.impl.EventContextImpl.proceed(EventContextImpl.java:88)
> 	at org.jboss.arquillian.test.impl.TestContextHandler.createClassContext(TestContextHandler.java:75)
> 	at sun.reflect.NativeMethodAccessorImpl.invoke0(Native Method)
> 	at sun.reflect.NativeMethodAccessorImpl.invoke(NativeMethodAccessorImpl.java:57)
> 	at sun.reflect.DelegatingMethodAccessorImpl.invoke(DelegatingMethodAccessorImpl.java:43)
> 	at java.lang.reflect.Method.invoke(Method.java:601)
> 	at org.jboss.arquillian.core.impl.ObserverImpl.invoke(ObserverImpl.java:94)
> 	at org.jboss.arquillian.core.impl.EventContextImpl.proceed(EventContextImpl.java:88)
> 	at org.jboss.arquillian.test.impl.TestContextHandler.createSuiteContext(TestContextHandler.java:60)
> 	at sun.reflect.NativeMethodAccessorImpl.invoke0(Native Method)
> 	at sun.reflect.NativeMethodAccessorImpl.invoke(NativeMethodAccessorImpl.java:57)
> 	at sun.reflect.DelegatingMethodAccessorImpl.invoke(DelegatingMethodAccessorImpl.java:43)
> 	at java.lang.reflect.Method.invoke(Method.java:601)
> 	at org.jboss.arquillian.core.impl.ObserverImpl.invoke(ObserverImpl.java:94)
> 	at org.jboss.arquillian.core.impl.EventContextImpl.proceed(EventContextImpl.java:88)
> 	at org.jboss.arquillian.core.impl.ManagerImpl.fire(ManagerImpl.java:135)
> 	at org.jboss.arquillian.test.impl.EventTestRunnerAdaptor.test(EventTestRunnerAdaptor.java:111)
> 	at org.jboss.arquillian.junit.Arquillian$6.evaluate(Arquillian.java:263)
> 	at org.jboss.arquillian.junit.Arquillian$4.evaluate(Arquillian.java:226)
> 	at org.jboss.arquillian.junit.Arquillian.multiExecute(Arquillian.java:314)
> 	at org.jboss.arquillian.junit.Arquillian.access$100(Arquillian.java:46)
> 	at org.jboss.arquillian.junit.Arquillian$5.evaluate(Arquillian.java:240)
> 	at org.junit.runners.ParentRunner.runLeaf(ParentRunner.java:263)
> 	at org.junit.runners.BlockJUnit4ClassRunner.runChild(BlockJUnit4ClassRunner.java:68)
> 	at org.junit.runners.BlockJUnit4ClassRunner.runChild(BlockJUnit4ClassRunner.java:47)
> 	at org.junit.runners.ParentRunner$3.run(ParentRunner.java:231)
> 	at org.junit.runners.ParentRunner$1.schedule(ParentRunner.java:60)
> 	at org.junit.runners.ParentRunner.runChildren(ParentRunner.java:229)
> 	at org.junit.runners.ParentRunner.access$000(ParentRunner.java:50)
> 	at org.junit.runners.ParentRunner$2.evaluate(ParentRunner.java:222)
> 	at org.jboss.arquillian.junit.Arquillian$2.evaluate(Arquillian.java:185)
> 	at org.jboss.arquillian.junit.Arquillian.multiExecute(Arquillian.java:314)
> 	at org.jboss.arquillian.junit.Arquillian.access$100(Arquillian.java:46)
> 	at org.jboss.arquillian.junit.Arquillian$3.evaluate(Arquillian.java:199)
> 	at org.junit.runners.ParentRunner.run(ParentRunner.java:300)
> 	at org.jboss.arquillian.junit.Arquillian.run(Arquillian.java:147)
> 	at org.apache.maven.surefire.junit4.JUnit4Provider.execute(JUnit4Provider.java:252)
> 	at org.apache.maven.surefire.junit4.JUnit4Provider.executeTestSet(JUnit4Provider.java:141)
> 	at org.apache.maven.surefire.junit4.JUnit4Provider.invoke(JUnit4Provider.java:112)
> 	at sun.reflect.NativeMethodAccessorImpl.invoke0(Native Method)
> 	at sun.reflect.NativeMethodAccessorImpl.invoke(NativeMethodAccessorImpl.java:57)
> 	at sun.reflect.DelegatingMethodAccessorImpl.invoke(DelegatingMethodAccessorImpl.java:43)
> 	at java.lang.reflect.Method.invoke(Method.java:601)
> 	at org.apache.maven.surefire.util.ReflectionUtils.invokeMethodWithArray(ReflectionUtils.java:189)
> 	at org.apache.maven.surefire.booter.ProviderFactory$ProviderProxy.invoke(ProviderFactory.java:165)
> 	at org.apache.maven.surefire.booter.ProviderFactory.invokeProvider(ProviderFactory.java:85)
> 	at org.apache.maven.surefire.booter.ForkedBooter.runSuitesInProcess(ForkedBooter.java:115)
> 	at org.apache.maven.surefire.booter.ForkedBooter.main(ForkedBooter.java:75)
> Caused by: java.util.concurrent.TimeoutException: Managed server was not started within [60] s
> 	at org.jboss.as.arquillian.container.managed.ManagedDeployableContainer.startInternal(ManagedDeployableContainer.java:195)
> 	... 115 more
> testCrashAfterPrepare(org.jboss.narayana.rest.integration.test.integration.RecoveryIntegrationTestCase)  Time elapsed: 2,994.021 sec  <<< ERROR!
> java.lang.IllegalArgumentException: Deployment with name test could not be undeployed. Container jboss must be still running.
> 	at org.jboss.arquillian.container.test.impl.client.deployment.ClientDeployer.undeploy(ClientDeployer.java:128)
> 	at org.jboss.narayana.rest.integration.test.integration.AbstractIntegrationTestCase.stopContainer(AbstractIntegrationTestCase.java:83)
> 	at org.jboss.narayana.rest.integration.test.integration.RecoveryIntegrationTestCase.after(RecoveryIntegrationTestCase.java:52)
> 	at sun.reflect.NativeMethodAccessorImpl.invoke0(Native Method)
> 	at sun.reflect.NativeMethodAccessorImpl.invoke(NativeMethodAccessorImpl.java:57)
> 	at sun.reflect.DelegatingMethodAccessorImpl.invoke(DelegatingMethodAccessorImpl.java:43)
> 	at java.lang.reflect.Method.invoke(Method.java:601)
> 	at org.junit.runners.model.FrameworkMethod$1.runReflectiveCall(FrameworkMethod.java:45)
> 	at org.junit.internal.runners.model.ReflectiveCallable.run(ReflectiveCallable.java:15)
> 	at org.junit.runners.model.FrameworkMethod.invokeExplosively(FrameworkMethod.java:42)
> 	at org.junit.internal.runners.statements.RunAfters.evaluate(RunAfters.java:36)
> 	at org.jboss.arquillian.junit.Arquillian$StatementLifecycleExecutor.invoke(Arquillian.java:351)
> 	at org.jboss.arquillian.container.test.impl.execution.ClientBeforeAfterLifecycleEventExecuter.execute(ClientBeforeAfterLifecycleEventExecuter.java:99)
> 	at org.jboss.arquillian.container.test.impl.execution.ClientBeforeAfterLifecycleEventExecuter.on(ClientBeforeAfterLifecycleEventExecuter.java:80)
> 	at sun.reflect.NativeMethodAccessorImpl.invoke0(Native Method)
> 	at sun.reflect.NativeMethodAccessorImpl.invoke(NativeMethodAccessorImpl.java:57)
> 	at sun.reflect.DelegatingMethodAccessorImpl.invoke(DelegatingMethodAccessorImpl.java:43)
> 	at java.lang.reflect.Method.invoke(Method.java:601)
> 	at org.jboss.arquillian.core.impl.ObserverImpl.invoke(ObserverImpl.java:94)
> 	at org.jboss.arquillian.core.impl.EventContextImpl.invokeObservers(EventContextImpl.java:99)
> 	at org.jboss.arquillian.core.impl.EventContextImpl.proceed(EventContextImpl.java:81)
> 	at org.jboss.arquillian.container.test.impl.client.ContainerEventController.createContext(ContainerEventController.java:142)
> 	at org.jboss.arquillian.container.test.impl.client.ContainerEventController.createAfterContext(ContainerEventController.java:134)
> 	at sun.reflect.NativeMethodAccessorImpl.invoke0(Native Method)
> 	at sun.reflect.NativeMethodAccessorImpl.invoke(NativeMethodAccessorImpl.java:57)
> 	at sun.reflect.DelegatingMethodAccessorImpl.invoke(DelegatingMethodAccessorImpl.java:43)
> 	at java.lang.reflect.Method.invoke(Method.java:601)
> 	at org.jboss.arquillian.core.impl.ObserverImpl.invoke(ObserverImpl.java:94)
> 	at org.jboss.arquillian.core.impl.EventContextImpl.proceed(EventContextImpl.java:88)
> 	at org.jboss.arquillian.test.impl.TestContextHandler.createTestContext(TestContextHandler.java:89)
> 	at sun.reflect.NativeMethodAccessorImpl.invoke0(Native Method)
> 	at sun.reflect.NativeMethodAccessorImpl.invoke(NativeMethodAccessorImpl.java:57)
> 	at sun.reflect.DelegatingMethodAccessorImpl.invoke(DelegatingMethodAccessorImpl.java:43)
> 	at java.lang.reflect.Method.invoke(Method.java:601)
> 	at org.jboss.arquillian.core.impl.ObserverImpl.invoke(ObserverImpl.java:94)
> 	at org.jboss.arquillian.core.impl.EventContextImpl.proceed(EventContextImpl.java:88)
> 	at org.jboss.arquillian.test.impl.TestContextHandler.createClassContext(TestContextHandler.java:75)
> 	at sun.reflect.NativeMethodAccessorImpl.invoke0(Native Method)
> 	at sun.reflect.NativeMethodAccessorImpl.invoke(NativeMethodAccessorImpl.java:57)
> 	at sun.reflect.DelegatingMethodAccessorImpl.invoke(DelegatingMethodAccessorImpl.java:43)
> 	at java.lang.reflect.Method.invoke(Method.java:601)
> 	at org.jboss.arquillian.core.impl.ObserverImpl.invoke(ObserverImpl.java:94)
> 	at org.jboss.arquillian.core.impl.EventContextImpl.proceed(EventContextImpl.java:88)
> 	at org.jboss.arquillian.test.impl.TestContextHandler.createSuiteContext(TestContextHandler.java:60)
> 	at sun.reflect.NativeMethodAccessorImpl.invoke0(Native Method)
> 	at sun.reflect.NativeMethodAccessorImpl.invoke(NativeMethodAccessorImpl.java:57)
> 	at sun.reflect.DelegatingMethodAccessorImpl.invoke(DelegatingMethodAccessorImpl.java:43)
> 	at java.lang.reflect.Method.invoke(Method.java:601)
> 	at org.jboss.arquillian.core.impl.ObserverImpl.invoke(ObserverImpl.java:94)
> 	at org.jboss.arquillian.core.impl.EventContextImpl.proceed(EventContextImpl.java:88)
> 	at org.jboss.arquillian.core.impl.ManagerImpl.fire(ManagerImpl.java:135)
> 	at org.jboss.arquillian.core.impl.ManagerImpl.fire(ManagerImpl.java:115)
> 	at org.jboss.arquillian.test.impl.EventTestRunnerAdaptor.after(EventTestRunnerAdaptor.java:103)
> 	at org.jboss.arquillian.junit.Arquillian$5$1.evaluate(Arquillian.java:245)
> 	at org.jboss.arquillian.junit.Arquillian.multiExecute(Arquillian.java:314)
> 	at org.jboss.arquillian.junit.Arquillian.access$100(Arquillian.java:46)
> 	at org.jboss.arquillian.junit.Arquillian$5.evaluate(Arquillian.java:240)
> 	at org.junit.runners.ParentRunner.runLeaf(ParentRunner.java:263)
> 	at org.junit.runners.BlockJUnit4ClassRunner.runChild(BlockJUnit4ClassRunner.java:68)
> 	at org.junit.runners.BlockJUnit4ClassRunner.runChild(BlockJUnit4ClassRunner.java:47)
> 	at org.junit.runners.ParentRunner$3.run(ParentRunner.java:231)
> 	at org.junit.runners.ParentRunner$1.schedule(ParentRunner.java:60)
> 	at org.junit.runners.ParentRunner.runChildren(ParentRunner.java:229)
> 	at org.junit.runners.ParentRunner.access$000(ParentRunner.java:50)
> 	at org.junit.runners.ParentRunner$2.evaluate(ParentRunner.java:222)
> 	at org.jboss.arquillian.junit.Arquillian$2.evaluate(Arquillian.java:185)
> 	at org.jboss.arquillian.junit.Arquillian.multiExecute(Arquillian.java:314)
> 	at org.jboss.arquillian.junit.Arquillian.access$100(Arquillian.java:46)
> 	at org.jboss.arquillian.junit.Arquillian$3.evaluate(Arquillian.java:199)
> 	at org.junit.runners.ParentRunner.run(ParentRunner.java:300)
> 	at org.jboss.arquillian.junit.Arquillian.run(Arquillian.java:147)
> 	at org.apache.maven.surefire.junit4.JUnit4Provider.execute(JUnit4Provider.java:252)
> 	at org.apache.maven.surefire.junit4.JUnit4Provider.executeTestSet(JUnit4Provider.java:141)
> 	at org.apache.maven.surefire.junit4.JUnit4Provider.invoke(JUnit4Provider.java:112)
> 	at sun.reflect.NativeMethodAccessorImpl.invoke0(Native Method)
> 	at sun.reflect.NativeMethodAccessorImpl.invoke(NativeMethodAccessorImpl.java:57)
> 	at sun.reflect.DelegatingMethodAccessorImpl.invoke(DelegatingMethodAccessorImpl.java:43)
> 	at java.lang.reflect.Method.invoke(Method.java:601)
> 	at org.apache.maven.surefire.util.ReflectionUtils.invokeMethodWithArray(ReflectionUtils.java:189)
> 	at org.apache.maven.surefire.booter.ProviderFactory$ProviderProxy.invoke(ProviderFactory.java:165)
> 	at org.apache.maven.surefire.booter.ProviderFactory.invokeProvider(ProviderFactory.java:85)
> 	at org.apache.maven.surefire.booter.ForkedBooter.runSuitesInProcess(ForkedBooter.java:115)
> 	at org.apache.maven.surefire.booter.ForkedBooter.main(ForkedBooter.java:75)
> testCrashBeforeCommit(org.jboss.narayana.rest.integration.test.integration.RecoveryIntegrationTestCase)  Time elapsed: 2,994.231 sec  <<< ERROR!
> org.jboss.arquillian.container.spi.client.container.LifecycleException: Could not start container
> 	at org.jboss.as.arquillian.container.managed.ManagedDeployableContainer.startInternal(ManagedDeployableContainer.java:199)
> 	at org.jboss.as.arquillian.container.CommonDeployableContainer.start(CommonDeployableContainer.java:112)
> 	at org.jboss.arquillian.container.impl.ContainerImpl.start(ContainerImpl.java:199)
> 	at org.jboss.arquillian.container.impl.client.container.ContainerLifecycleController$8.perform(ContainerLifecycleController.java:163)
> 	at org.jboss.arquillian.container.impl.client.container.ContainerLifecycleController$8.perform(ContainerLifecycleController.java:157)
> 	at org.jboss.arquillian.container.impl.client.container.ContainerLifecycleController.forContainer(ContainerLifecycleController.java:255)
> 	at org.jboss.arquillian.container.impl.client.container.ContainerLifecycleController.startContainer(ContainerLifecycleController.java:156)
> 	at sun.reflect.NativeMethodAccessorImpl.invoke0(Native Method)
> 	at sun.reflect.NativeMethodAccessorImpl.invoke(NativeMethodAccessorImpl.java:57)
> 	at sun.reflect.DelegatingMethodAccessorImpl.invoke(DelegatingMethodAccessorImpl.java:43)
> 	at java.lang.reflect.Method.invoke(Method.java:601)
> 	at org.jboss.arquillian.core.impl.ObserverImpl.invoke(ObserverImpl.java:94)
> 	at org.jboss.arquillian.core.impl.EventContextImpl.invokeObservers(EventContextImpl.java:99)
> 	at org.jboss.arquillian.core.impl.EventContextImpl.proceed(EventContextImpl.java:81)
> 	at org.jboss.arquillian.container.impl.client.ContainerDeploymentContextHandler.createContainerContext(ContainerDeploymentContextHandler.java:57)
> 	at sun.reflect.NativeMethodAccessorImpl.invoke0(Native Method)
> 	at sun.reflect.NativeMethodAccessorImpl.invoke(NativeMethodAccessorImpl.java:57)
> 	at sun.reflect.DelegatingMethodAccessorImpl.invoke(DelegatingMethodAccessorImpl.java:43)
> 	at java.lang.reflect.Method.invoke(Method.java:601)
> 	at org.jboss.arquillian.core.impl.ObserverImpl.invoke(ObserverImpl.java:94)
> 	at org.jboss.arquillian.core.impl.EventContextImpl.proceed(EventContextImpl.java:88)
> 	at org.jboss.arquillian.core.impl.ManagerImpl.fire(ManagerImpl.java:135)
> 	at org.jboss.arquillian.core.impl.ManagerImpl.fire(ManagerImpl.java:115)
> 	at org.jboss.arquillian.core.impl.EventImpl.fire(EventImpl.java:67)
> 	at org.jboss.arquillian.container.test.impl.client.container.ClientContainerController.start(ClientContainerController.java:150)
> 	at org.jboss.narayana.rest.integration.test.integration.AbstractIntegrationTestCase.startContainer(AbstractIntegrationTestCase.java:65)
> 	at org.jboss.narayana.rest.integration.test.integration.RecoveryIntegrationTestCase.testCrashBeforeCommit(RecoveryIntegrationTestCase.java:91)
> 	at sun.reflect.NativeMethodAccessorImpl.invoke0(Native Method)
> 	at sun.reflect.NativeMethodAccessorImpl.invoke(NativeMethodAccessorImpl.java:57)
> 	at sun.reflect.DelegatingMethodAccessorImpl.invoke(DelegatingMethodAccessorImpl.java:43)
> 	at java.lang.reflect.Method.invoke(Method.java:601)
> 	at org.junit.runners.model.FrameworkMethod$1.runReflectiveCall(FrameworkMethod.java:45)
> 	at org.junit.internal.runners.model.ReflectiveCallable.run(ReflectiveCallable.java:15)
> 	at org.junit.runners.model.FrameworkMethod.invokeExplosively(FrameworkMethod.java:42)
> 	at org.jboss.arquillian.junit.Arquillian$6$1.invoke(Arquillian.java:270)
> 	at org.jboss.arquillian.container.test.impl.execution.LocalTestExecuter.execute(LocalTestExecuter.java:60)
> 	at sun.reflect.NativeMethodAccessorImpl.invoke0(Native Method)
> 	at sun.reflect.NativeMethodAccessorImpl.invoke(NativeMethodAccessorImpl.java:57)
> 	at sun.reflect.DelegatingMethodAccessorImpl.invoke(DelegatingMethodAccessorImpl.java:43)
> 	at java.lang.reflect.Method.invoke(Method.java:601)
> 	at org.jboss.arquillian.core.impl.ObserverImpl.invoke(ObserverImpl.java:94)
> 	at org.jboss.arquillian.core.impl.EventContextImpl.invokeObservers(EventContextImpl.java:99)
> 	at org.jboss.arquillian.core.impl.EventContextImpl.proceed(EventContextImpl.java:81)
> 	at org.jboss.arquillian.core.impl.ManagerImpl.fire(ManagerImpl.java:135)
> 	at org.jboss.arquillian.core.impl.ManagerImpl.fire(ManagerImpl.java:115)
> 	at org.jboss.arquillian.core.impl.EventImpl.fire(EventImpl.java:67)
> 	at org.jboss.arquillian.container.test.impl.execution.ClientTestExecuter.execute(ClientTestExecuter.java:53)
> 	at sun.reflect.NativeMethodAccessorImpl.invoke0(Native Method)
> 	at sun.reflect.NativeMethodAccessorImpl.invoke(NativeMethodAccessorImpl.java:57)
> 	at sun.reflect.DelegatingMethodAccessorImpl.invoke(DelegatingMethodAccessorImpl.java:43)
> 	at java.lang.reflect.Method.invoke(Method.java:601)
> 	at org.jboss.arquillian.core.impl.ObserverImpl.invoke(ObserverImpl.java:94)
> 	at org.jboss.arquillian.core.impl.EventContextImpl.invokeObservers(EventContextImpl.java:99)
> 	at org.jboss.arquillian.core.impl.EventContextImpl.proceed(EventContextImpl.java:81)
> 	at org.jboss.arquillian.container.test.impl.client.ContainerEventController.createContext(ContainerEventController.java:142)
> 	at org.jboss.arquillian.container.test.impl.client.ContainerEventController.createTestContext(ContainerEventController.java:129)
> 	at sun.reflect.NativeMethodAccessorImpl.invoke0(Native Method)
> 	at sun.reflect.NativeMethodAccessorImpl.invoke(NativeMethodAccessorImpl.java:57)
> 	at sun.reflect.DelegatingMethodAccessorImpl.invoke(DelegatingMethodAccessorImpl.java:43)
> 	at java.lang.reflect.Method.invoke(Method.java:601)
> 	at org.jboss.arquillian.core.impl.ObserverImpl.invoke(ObserverImpl.java:94)
> 	at org.jboss.arquillian.core.impl.EventContextImpl.proceed(EventContextImpl.java:88)
> 	at org.jboss.arquillian.test.impl.TestContextHandler.createTestContext(TestContextHandler.java:89)
> 	at sun.reflect.NativeMethodAccessorImpl.invoke0(Native Method)
> 	at sun.reflect.NativeMethodAccessorImpl.invoke(NativeMethodAccessorImpl.java:57)
> 	at sun.reflect.DelegatingMethodAccessorImpl.invoke(DelegatingMethodAccessorImpl.java:43)
> 	at java.lang.reflect.Method.invoke(Method.java:601)
> 	at org.jboss.arquillian.core.impl.ObserverImpl.invoke(ObserverImpl.java:94)
> 	at org.jboss.arquillian.core.impl.EventContextImpl.proceed(EventContextImpl.java:88)
> 	at org.jboss.arquillian.test.impl.TestContextHandler.createClassContext(TestContextHandler.java:75)
> 	at sun.reflect.NativeMethodAccessorImpl.invoke0(Native Method)
> 	at sun.reflect.NativeMethodAccessorImpl.invoke(NativeMethodAccessorImpl.java:57)
> 	at sun.reflect.DelegatingMethodAccessorImpl.invoke(DelegatingMethodAccessorImpl.java:43)
> 	at java.lang.reflect.Method.invoke(Method.java:601)
> 	at org.jboss.arquillian.core.impl.ObserverImpl.invoke(ObserverImpl.java:94)
> 	at org.jboss.arquillian.core.impl.EventContextImpl.proceed(EventContextImpl.java:88)
> 	at org.jboss.arquillian.test.impl.TestContextHandler.createSuiteContext(TestContextHandler.java:60)
> 	at sun.reflect.NativeMethodAccessorImpl.invoke0(Native Method)
> 	at sun.reflect.NativeMethodAccessorImpl.invoke(NativeMethodAccessorImpl.java:57)
> 	at sun.reflect.DelegatingMethodAccessorImpl.invoke(DelegatingMethodAccessorImpl.java:43)
> 	at java.lang.reflect.Method.invoke(Method.java:601)
> 	at org.jboss.arquillian.core.impl.ObserverImpl.invoke(ObserverImpl.java:94)
> 	at org.jboss.arquillian.core.impl.EventContextImpl.proceed(EventContextImpl.java:88)
> 	at org.jboss.arquillian.core.impl.ManagerImpl.fire(ManagerImpl.java:135)
> 	at org.jboss.arquillian.test.impl.EventTestRunnerAdaptor.test(EventTestRunnerAdaptor.java:111)
> 	at org.jboss.arquillian.junit.Arquillian$6.evaluate(Arquillian.java:263)
> 	at org.jboss.arquillian.junit.Arquillian$4.evaluate(Arquillian.java:226)
> 	at org.jboss.arquillian.junit.Arquillian.multiExecute(Arquillian.java:314)
> 	at org.jboss.arquillian.junit.Arquillian.access$100(Arquillian.java:46)
> 	at org.jboss.arquillian.junit.Arquillian$5.evaluate(Arquillian.java:240)
> 	at org.junit.runners.ParentRunner.runLeaf(ParentRunner.java:263)
> 	at org.junit.runners.BlockJUnit4ClassRunner.runChild(BlockJUnit4ClassRunner.java:68)
> 	at org.junit.runners.BlockJUnit4ClassRunner.runChild(BlockJUnit4ClassRunner.java:47)
> 	at org.junit.runners.ParentRunner$3.run(ParentRunner.java:231)
> 	at org.junit.runners.ParentRunner$1.schedule(ParentRunner.java:60)
> 	at org.junit.runners.ParentRunner.runChildren(ParentRunner.java:229)
> 	at org.junit.runners.ParentRunner.access$000(ParentRunner.java:50)
> 	at org.junit.runners.ParentRunner$2.evaluate(ParentRunner.java:222)
> 	at org.jboss.arquillian.junit.Arquillian$2.evaluate(Arquillian.java:185)
> 	at org.jboss.arquillian.junit.Arquillian.multiExecute(Arquillian.java:314)
> 	at org.jboss.arquillian.junit.Arquillian.access$100(Arquillian.java:46)
> 	at org.jboss.arquillian.junit.Arquillian$3.evaluate(Arquillian.java:199)
> 	at org.junit.runners.ParentRunner.run(ParentRunner.java:300)
> 	at org.jboss.arquillian.junit.Arquillian.run(Arquillian.java:147)
> 	at org.apache.maven.surefire.junit4.JUnit4Provider.execute(JUnit4Provider.java:252)
> 	at org.apache.maven.surefire.junit4.JUnit4Provider.executeTestSet(JUnit4Provider.java:141)
> 	at org.apache.maven.surefire.junit4.JUnit4Provider.invoke(JUnit4Provider.java:112)
> 	at sun.reflect.NativeMethodAccessorImpl.invoke0(Native Method)
> 	at sun.reflect.NativeMethodAccessorImpl.invoke(NativeMethodAccessorImpl.java:57)
> 	at sun.reflect.DelegatingMethodAccessorImpl.invoke(DelegatingMethodAccessorImpl.java:43)
> 	at java.lang.reflect.Method.invoke(Method.java:601)
> 	at org.apache.maven.surefire.util.ReflectionUtils.invokeMethodWithArray(ReflectionUtils.java:189)
> 	at org.apache.maven.surefire.booter.ProviderFactory$ProviderProxy.invoke(ProviderFactory.java:165)
> 	at org.apache.maven.surefire.booter.ProviderFactory.invokeProvider(ProviderFactory.java:85)
> 	at org.apache.maven.surefire.booter.ForkedBooter.runSuitesInProcess(ForkedBooter.java:115)
> 	at org.apache.maven.surefire.booter.ForkedBooter.main(ForkedBooter.java:75)
> Caused by: java.util.concurrent.TimeoutException: Managed server was not started within [60] s
> 	at org.jboss.as.arquillian.container.managed.ManagedDeployableContainer.startInternal(ManagedDeployableContainer.java:195)
> 	... 115 more
> testCrashBeforeCommit(org.jboss.narayana.rest.integration.test.integration.RecoveryIntegrationTestCase)  Time elapsed: 2,994.234 sec  <<< ERROR!
> java.lang.IllegalArgumentException: Deployment with name test could not be undeployed. Container jboss must be still running.
> 	at org.jboss.arquillian.container.test.impl.client.deployment.ClientDeployer.undeploy(ClientDeployer.java:128)
> 	at org.jboss.narayana.rest.integration.test.integration.AbstractIntegrationTestCase.stopContainer(AbstractIntegrationTestCase.java:83)
> 	at org.jboss.narayana.rest.integration.test.integration.RecoveryIntegrationTestCase.after(RecoveryIntegrationTestCase.java:52)
> 	at sun.reflect.NativeMethodAccessorImpl.invoke0(Native Method)
> 	at sun.reflect.NativeMethodAccessorImpl.invoke(NativeMethodAccessorImpl.java:57)
> 	at sun.reflect.DelegatingMethodAccessorImpl.invoke(DelegatingMethodAccessorImpl.java:43)
> 	at java.lang.reflect.Method.invoke(Method.java:601)
> 	at org.junit.runners.model.FrameworkMethod$1.runReflectiveCall(FrameworkMethod.java:45)
> 	at org.junit.internal.runners.model.ReflectiveCallable.run(ReflectiveCallable.java:15)
> 	at org.junit.runners.model.FrameworkMethod.invokeExplosively(FrameworkMethod.java:42)
> 	at org.junit.internal.runners.statements.RunAfters.evaluate(RunAfters.java:36)
> 	at org.jboss.arquillian.junit.Arquillian$StatementLifecycleExecutor.invoke(Arquillian.java:351)
> 	at org.jboss.arquillian.container.test.impl.execution.ClientBeforeAfterLifecycleEventExecuter.execute(ClientBeforeAfterLifecycleEventExecuter.java:99)
> 	at org.jboss.arquillian.container.test.impl.execution.ClientBeforeAfterLifecycleEventExecuter.on(ClientBeforeAfterLifecycleEventExecuter.java:80)
> 	at sun.reflect.NativeMethodAccessorImpl.invoke0(Native Method)
> 	at sun.reflect.NativeMethodAccessorImpl.invoke(NativeMethodAccessorImpl.java:57)
> 	at sun.reflect.DelegatingMethodAccessorImpl.invoke(DelegatingMethodAccessorImpl.java:43)
> 	at java.lang.reflect.Method.invoke(Method.java:601)
> 	at org.jboss.arquillian.core.impl.ObserverImpl.invoke(ObserverImpl.java:94)
> 	at org.jboss.arquillian.core.impl.EventContextImpl.invokeObservers(EventContextImpl.java:99)
> 	at org.jboss.arquillian.core.impl.EventContextImpl.proceed(EventContextImpl.java:81)
> 	at org.jboss.arquillian.container.test.impl.client.ContainerEventController.createContext(ContainerEventController.java:142)
> 	at org.jboss.arquillian.container.test.impl.client.ContainerEventController.createAfterContext(ContainerEventController.java:134)
> 	at sun.reflect.NativeMethodAccessorImpl.invoke0(Native Method)
> 	at sun.reflect.NativeMethodAccessorImpl.invoke(NativeMethodAccessorImpl.java:57)
> 	at sun.reflect.DelegatingMethodAccessorImpl.invoke(DelegatingMethodAccessorImpl.java:43)
> 	at java.lang.reflect.Method.invoke(Method.java:601)
> 	at org.jboss.arquillian.core.impl.ObserverImpl.invoke(ObserverImpl.java:94)
> 	at org.jboss.arquillian.core.impl.EventContextImpl.proceed(EventContextImpl.java:88)
> 	at org.jboss.arquillian.test.impl.TestContextHandler.createTestContext(TestContextHandler.java:89)
> 	at sun.reflect.NativeMethodAccessorImpl.invoke0(Native Method)
> 	at sun.reflect.NativeMethodAccessorImpl.invoke(NativeMethodAccessorImpl.java:57)
> 	at sun.reflect.DelegatingMethodAccessorImpl.invoke(DelegatingMethodAccessorImpl.java:43)
> 	at java.lang.reflect.Method.invoke(Method.java:601)
> 	at org.jboss.arquillian.core.impl.ObserverImpl.invoke(ObserverImpl.java:94)
> 	at org.jboss.arquillian.core.impl.EventContextImpl.proceed(EventContextImpl.java:88)
> 	at org.jboss.arquillian.test.impl.TestContextHandler.createClassContext(TestContextHandler.java:75)
> 	at sun.reflect.NativeMethodAccessorImpl.invoke0(Native Method)
> 	at sun.reflect.NativeMethodAccessorImpl.invoke(NativeMethodAccessorImpl.java:57)
> 	at sun.reflect.DelegatingMethodAccessorImpl.invoke(DelegatingMethodAccessorImpl.java:43)
> 	at java.lang.reflect.Method.invoke(Method.java:601)
> 	at org.jboss.arquillian.core.impl.ObserverImpl.invoke(ObserverImpl.java:94)
> 	at org.jboss.arquillian.core.impl.EventContextImpl.proceed(EventContextImpl.java:88)
> 	at org.jboss.arquillian.test.impl.TestContextHandler.createSuiteContext(TestContextHandler.java:60)
> 	at sun.reflect.NativeMethodAccessorImpl.invoke0(Native Method)
> 	at sun.reflect.NativeMethodAccessorImpl.invoke(NativeMethodAccessorImpl.java:57)
> 	at sun.reflect.DelegatingMethodAccessorImpl.invoke(DelegatingMethodAccessorImpl.java:43)
> 	at java.lang.reflect.Method.invoke(Method.java:601)
> 	at org.jboss.arquillian.core.impl.ObserverImpl.invoke(ObserverImpl.java:94)
> 	at org.jboss.arquillian.core.impl.EventContextImpl.proceed(EventContextImpl.java:88)
> 	at org.jboss.arquillian.core.impl.ManagerImpl.fire(ManagerImpl.java:135)
> 	at org.jboss.arquillian.core.impl.ManagerImpl.fire(ManagerImpl.java:115)
> 	at org.jboss.arquillian.test.impl.EventTestRunnerAdaptor.after(EventTestRunnerAdaptor.java:103)
> 	at org.jboss.arquillian.junit.Arquillian$5$1.evaluate(Arquillian.java:245)
> 	at org.jboss.arquillian.junit.Arquillian.multiExecute(Arquillian.java:314)
> 	at org.jboss.arquillian.junit.Arquillian.access$100(Arquillian.java:46)
> 	at org.jboss.arquillian.junit.Arquillian$5.evaluate(Arquillian.java:240)
> 	at org.junit.runners.ParentRunner.runLeaf(ParentRunner.java:263)
> 	at org.junit.runners.BlockJUnit4ClassRunner.runChild(BlockJUnit4ClassRunner.java:68)
> 	at org.junit.runners.BlockJUnit4ClassRunner.runChild(BlockJUnit4ClassRunner.java:47)
> 	at org.junit.runners.ParentRunner$3.run(ParentRunner.java:231)
> 	at org.junit.runners.ParentRunner$1.schedule(ParentRunner.java:60)
> 	at org.junit.runners.ParentRunner.runChildren(ParentRunner.java:229)
> 	at org.junit.runners.ParentRunner.access$000(ParentRunner.java:50)
> 	at org.junit.runners.ParentRunner$2.evaluate(ParentRunner.java:222)
> 	at org.jboss.arquillian.junit.Arquillian$2.evaluate(Arquillian.java:185)
> 	at org.jboss.arquillian.junit.Arquillian.multiExecute(Arquillian.java:314)
> 	at org.jboss.arquillian.junit.Arquillian.access$100(Arquillian.java:46)
> 	at org.jboss.arquillian.junit.Arquillian$3.evaluate(Arquillian.java:199)
> 	at org.junit.runners.ParentRunner.run(ParentRunner.java:300)
> 	at org.jboss.arquillian.junit.Arquillian.run(Arquillian.java:147)
> 	at org.apache.maven.surefire.junit4.JUnit4Provider.execute(JUnit4Provider.java:252)
> 	at org.apache.maven.surefire.junit4.JUnit4Provider.executeTestSet(JUnit4Provider.java:141)
> 	at org.apache.maven.surefire.junit4.JUnit4Provider.invoke(JUnit4Provider.java:112)
> 	at sun.reflect.NativeMethodAccessorImpl.invoke0(Native Method)
> 	at sun.reflect.NativeMethodAccessorImpl.invoke(NativeMethodAccessorImpl.java:57)
> 	at sun.reflect.DelegatingMethodAccessorImpl.invoke(DelegatingMethodAccessorImpl.java:43)
> 	at java.lang.reflect.Method.invoke(Method.java:601)
> 	at org.apache.maven.surefire.util.ReflectionUtils.invokeMethodWithArray(ReflectionUtils.java:189)
> 	at org.apache.maven.surefire.booter.ProviderFactory$ProviderProxy.invoke(ProviderFactory.java:165)
> 	at org.apache.maven.surefire.booter.ProviderFactory.invokeProvider(ProviderFactory.java:85)
> 	at org.apache.maven.surefire.booter.ForkedBooter.runSuitesInProcess(ForkedBooter.java:115)
> 	at org.apache.maven.surefire.booter.ForkedBooter.main(ForkedBooter.java:75)
> Results :
> Tests in error: 
>   testCrashAfterPrepare(org.jboss.narayana.rest.integration.test.integration.RecoveryIntegrationTestCase): Could not start container
>   testCrashAfterPrepare(org.jboss.narayana.rest.integration.test.integration.RecoveryIntegrationTestCase): Deployment with name test could not be undeployed. Container jboss must be still running.
>   testCrashBeforeCommit(org.jboss.narayana.rest.integration.test.integration.RecoveryIntegrationTestCase): Could not start container
>   testCrashBeforeCommit(org.jboss.narayana.rest.integration.test.integration.RecoveryIntegrationTestCase): Deployment with name test could not be undeployed. Container jboss must be still running.
> {code}

--
This message is automatically generated by JIRA.
If you think it was sent incorrectly, please contact your JIRA administrators
For more information on JIRA, see: http://www.atlassian.com/software/jira


More information about the jbossts-issues mailing list