[jbossts-issues] [JBoss JIRA] (JBTM-2170) Jacoco failed to create QA code coverage report

Gytis Trikleris (JIRA) issues at jboss.org
Mon Jun 23 10:24:25 EDT 2014


    [ https://issues.jboss.org/browse/JBTM-2170?page=com.atlassian.jira.plugin.system.issuetabpanels:comment-tabpanel&focusedCommentId=12978629#comment-12978629 ] 

Gytis Trikleris commented on JBTM-2170:
---------------------------------------

[~mmusgrov], yeah I get that. But weren't we building jacorb only by default before?

> Jacoco failed to create QA code coverage report
> -----------------------------------------------
>
>                 Key: JBTM-2170
>                 URL: https://issues.jboss.org/browse/JBTM-2170
>             Project: JBoss Transaction Manager
>          Issue Type: Bug
>      Security Level: Public(Everyone can see) 
>          Components: Testing
>            Reporter: Gytis Trikleris
>            Assignee: Gytis Trikleris
>             Fix For: 5.0.3
>
>
> http://172.17.131.2/view/Narayana+BlackTie/job/narayana-codeCoverage/118
> {code}
> BUILD SUCCESSFUL
> Total time: 510 minutes 46 seconds
> generating test coverage report
> Buildfile: /home/hudson/workspace/narayana-codeCoverage/qa/run-tests.xml
> jacoco-report:
> [jacoco:report] Loading execution data file /home/hudson/workspace/narayana-codeCoverage/qa/testoutput/jacoco-qa.exec
> BUILD FAILED
> /home/hudson/workspace/narayana-codeCoverage/qa/run-tests.xml:540: Error while creating report
> Total time: 8 seconds
> Buildfile: /home/hudson/workspace/narayana-codeCoverage/qa/run-tests.xml
> has-testoutput-output:
> testoutput.zip:
>      [echo] archiving testoutput to testoutput-jacorb.zip
>       [zip] Building zip: /home/hudson/workspace/narayana-codeCoverage/qa/testoutput-jacorb.zip
> BUILD SUCCESSFUL
> Total time: 9 seconds
> + rm -rf /home/hudson/.m2/repository/org/jboss/narayana
> + cd qa
> + ant -f run-tests.xml jacoco-report
> Buildfile: /home/hudson/workspace/narayana-codeCoverage/qa/run-tests.xml
> jacoco-report:
> [jacoco:report] Loading execution data file /home/hudson/workspace/narayana-codeCoverage/qa/testoutput/jacoco-qa.exec
> BUILD FAILED
> /home/hudson/workspace/narayana-codeCoverage/qa/run-tests.xml:540: Error while creating report
> Total time: 9 seconds
> Build step 'Execute shell' marked build as failure
> Archiving artifacts
> Sending e-mails to: gtrikler at redhat.com
> Finished: FAILURE
> {code}



--
This message was sent by Atlassian JIRA
(v6.2.6#6264)


More information about the jbossts-issues mailing list