[jbossts-issues] [JBoss JIRA] (JBTM-2586) XTS tests failures in WF testsuite

Tom Jenkinson (JIRA) issues at jboss.org
Tue Dec 15 09:18:00 EST 2015


     [ https://issues.jboss.org/browse/JBTM-2586?page=com.atlassian.jira.plugin.system.issuetabpanels:all-tabpanel ]

Tom Jenkinson updated JBTM-2586:
--------------------------------
    Priority: Blocker  (was: Major)


> XTS tests failures in WF testsuite
> ----------------------------------
>
>                 Key: JBTM-2586
>                 URL: https://issues.jboss.org/browse/JBTM-2586
>             Project: JBoss Transaction Manager
>          Issue Type: Bug
>          Components: XTS
>            Reporter: Gytis Trikleris
>            Assignee: Gytis Trikleris
>            Priority: Blocker
>             Fix For: 5.next
>
>
> {code}
> Running org.jboss.as.test.xts.wsat.client.ATTestCase
> Tests run: 9, Failures: 0, Errors: 2, Skipped: 0, Time elapsed: 11.74 sec <<< FAILURE! - in org.jboss.as.test.xts.wsat.client.ATTestCase
> testWSATApplicationExceptionCommit(org.jboss.as.test.xts.wsat.client.ATTestCase)  Time elapsed: 0.286 sec  <<< ERROR!
> org.jboss.arquillian.test.spi.ArquillianProxyException: javax.xml.ws.soap.SOAPFaultException : Error when enlisting participants [Proxied because : Original exception caused: class java.io.NotSerializableException: com.sun.xml.messaging.saaj.soap.ver1_1.SOAPPart1_1Impl]
> 	at org.apache.cxf.binding.soap.interceptor.Soap11FaultInInterceptor.unmarshalFault(Soap11FaultInInterceptor.java:86)
> 	at org.apache.cxf.binding.soap.interceptor.Soap11FaultInInterceptor.handleMessage(Soap11FaultInInterceptor.java:52)
> 	at org.apache.cxf.binding.soap.interceptor.Soap11FaultInInterceptor.handleMessage(Soap11FaultInInterceptor.java:41)
> 	at org.apache.cxf.phase.PhaseInterceptorChain.doIntercept(PhaseInterceptorChain.java:308)
> 	at org.apache.cxf.interceptor.AbstractFaultChainInitiatorObserver.onMessage(AbstractFaultChainInitiatorObserver.java:112)
> 	at org.apache.cxf.jaxws.handler.soap.SOAPHandlerInterceptor.handleMessage(SOAPHandlerInterceptor.java:140)
> 	at org.apache.cxf.jaxws.handler.soap.SOAPHandlerInterceptor.handleMessage(SOAPHandlerInterceptor.java:71)
> 	at org.apache.cxf.phase.PhaseInterceptorChain.doIntercept(PhaseInterceptorChain.java:308)
> 	at org.apache.cxf.endpoint.ClientImpl.onMessage(ClientImpl.java:798)
> 	at org.apache.cxf.transport.http.HTTPConduit$WrappedOutputStream.handleResponseInternal(HTTPConduit.java:1669)
> 	at org.apache.cxf.transport.http.HTTPConduit$WrappedOutputStream.handleResponse(HTTPConduit.java:1550)
> 	at org.apache.cxf.transport.http.HTTPConduit$WrappedOutputStream.close(HTTPConduit.java:1347)
> 	at org.apache.cxf.transport.AbstractConduit.close(AbstractConduit.java:56)
> 	at org.apache.cxf.transport.http.HTTPConduit.close(HTTPConduit.java:651)
> 	at org.apache.cxf.interceptor.MessageSenderInterceptor$MessageSenderEndingInterceptor.handleMessage(MessageSenderInterceptor.java:62)
> 	at org.apache.cxf.phase.PhaseInterceptorChain.doIntercept(PhaseInterceptorChain.java:308)
> 	at org.apache.cxf.endpoint.ClientImpl.doInvoke(ClientImpl.java:514)
> 	at org.apache.cxf.endpoint.ClientImpl.invoke(ClientImpl.java:423)
> 	at org.apache.cxf.endpoint.ClientImpl.invoke(ClientImpl.java:324)
> 	at org.apache.cxf.endpoint.ClientImpl.invoke(ClientImpl.java:277)
> 	at org.apache.cxf.frontend.ClientProxy.invokeSync(ClientProxy.java:96)
> 	at org.apache.cxf.jaxws.JaxWsClientProxy.invoke(JaxWsClientProxy.java:139)
> 	at com.sun.proxy.$Proxy176.invoke(Unknown Source)
> 	at org.jboss.as.test.xts.wsat.client.ATTestCase.testWSATApplicationExceptionCommit(ATTestCase.java:227)
> testWSATRollbackOnly(org.jboss.as.test.xts.wsat.client.ATTestCase)  Time elapsed: 0.12 sec  <<< ERROR!
> com.arjuna.wst.SystemException: org.apache.cxf.wsdl11.WSDLRuntimeException: Part parameters defined as element {http://docs.oasis-open.org/ws-tx/wscoor/2006/06}CreateCoordinationContext which is not in the schema.
> 	at com.arjuna.mwlabs.wst11.at.remote.UserTransactionImple.startTransaction(UserTransactionImple.java:308)
> 	at com.arjuna.mwlabs.wst11.at.remote.UserTransactionImple.begin(UserTransactionImple.java:80)
> 	at com.arjuna.mwlabs.wst11.at.remote.UserTransactionImple.begin(UserTransactionImple.java:70)
> 	at org.jboss.as.test.xts.wsat.client.ATTestCase.testWSATRollbackOnly(ATTestCase.java:172)
> Running org.jboss.as.test.xts.annotation.client.TransactionalTestCase
> Tests run: 2, Failures: 0, Errors: 1, Skipped: 0, Time elapsed: 0.725 sec <<< FAILURE! - in org.jboss.as.test.xts.annotation.client.TransactionalTestCase
> testActiveTransaction(org.jboss.as.test.xts.annotation.client.TransactionalTestCase)  Time elapsed: 0.018 sec  <<< ERROR!
> com.arjuna.wst.SystemException: org.apache.cxf.wsdl11.WSDLRuntimeException: Part parameters defined as element {http://docs.oasis-open.org/ws-tx/wscoor/2006/06}CreateCoordinationContext which is not in the schema.
> 	at com.arjuna.mwlabs.wst11.at.remote.UserTransactionImple.startTransaction(UserTransactionImple.java:308)
> 	at com.arjuna.mwlabs.wst11.at.remote.UserTransactionImple.begin(UserTransactionImple.java:80)
> 	at com.arjuna.mwlabs.wst11.at.remote.UserTransactionImple.begin(UserTransactionImple.java:70)
> 	at org.jboss.as.test.xts.annotation.client.TransactionalTestCase.testActiveTransaction(TransactionalTestCase.java:78)
> Running org.jboss.as.test.xts.annotation.client.CompensatableTestCase
> Tests run: 2, Failures: 0, Errors: 1, Skipped: 0, Time elapsed: 0.411 sec <<< FAILURE! - in org.jboss.as.test.xts.annotation.client.CompensatableTestCase
> testActiveTransaction(org.jboss.as.test.xts.annotation.client.CompensatableTestCase)  Time elapsed: 0.054 sec  <<< ERROR!
> com.arjuna.wst.SystemException: org.apache.cxf.wsdl11.WSDLRuntimeException: Part parameters defined as element {http://docs.oasis-open.org/ws-tx/wscoor/2006/06}CreateCoordinationContext which is not in the schema.
> 	at com.arjuna.mwlabs.wst11.ba.remote.UserBusinessActivityImple.startTransaction(UserBusinessActivityImple.java:374)
> 	at com.arjuna.mwlabs.wst11.ba.remote.UserBusinessActivityImple.begin(UserBusinessActivityImple.java:117)
> 	at com.arjuna.mwlabs.wst11.ba.remote.UserBusinessActivityImple.begin(UserBusinessActivityImple.java:107)
> 	at org.jboss.as.test.xts.annotation.client.CompensatableTestCase.testActiveTransaction(CompensatableTestCase.java:77)
> Running org.jboss.as.test.xts.annotation.compensationScoped.CompensationScopedTestCase
> Tests run: 1, Failures: 0, Errors: 0, Skipped: 0, Time elapsed: 0.876 sec - in org.jboss.as.test.xts.annotation.compensationScoped.CompensationScopedTestCase
> Running org.jboss.as.test.xts.wsba.participantcompletion.client.BAParticipantCompletionTestCase
> Tests run: 7, Failures: 0, Errors: 7, Skipped: 0, Time elapsed: 1.648 sec <<< FAILURE! - in org.jboss.as.test.xts.wsba.participantcompletion.client.BAParticipantCompletionTestCase
> testWSBAParticipantApplicationException(org.jboss.as.test.xts.wsba.participantcompletion.client.BAParticipantCompletionTestCase)  Time elapsed: 0.236 sec  <<< ERROR!
> com.arjuna.wst.SystemException: org.apache.cxf.wsdl11.WSDLRuntimeException: Part parameters defined as element {http://docs.oasis-open.org/ws-tx/wscoor/2006/06}CreateCoordinationContext which is not in the schema.
> 	at com.arjuna.mwlabs.wst11.ba.remote.UserBusinessActivityImple.startTransaction(UserBusinessActivityImple.java:374)
> 	at com.arjuna.mwlabs.wst11.ba.remote.UserBusinessActivityImple.begin(UserBusinessActivityImple.java:117)
> 	at com.arjuna.mwlabs.wst11.ba.remote.UserBusinessActivityImple.begin(UserBusinessActivityImple.java:107)
> 	at org.jboss.as.test.xts.wsba.participantcompletion.client.BAParticipantCompletionTestCase.testWSBAParticipantApplicationException(BAParticipantCompletionTestCase.java:218)
> testWSBAParticipantCannotComplete(org.jboss.as.test.xts.wsba.participantcompletion.client.BAParticipantCompletionTestCase)  Time elapsed: 0.104 sec  <<< ERROR!
> com.arjuna.wst.SystemException: org.apache.cxf.wsdl11.WSDLRuntimeException: Part parameters defined as element {http://docs.oasis-open.org/ws-tx/wscoor/2006/06}CreateCoordinationContext which is not in the schema.
> 	at com.arjuna.mwlabs.wst11.ba.remote.UserBusinessActivityImple.startTransaction(UserBusinessActivityImple.java:374)
> 	at com.arjuna.mwlabs.wst11.ba.remote.UserBusinessActivityImple.begin(UserBusinessActivityImple.java:117)
> 	at com.arjuna.mwlabs.wst11.ba.remote.UserBusinessActivityImple.begin(UserBusinessActivityImple.java:107)
> 	at org.jboss.as.test.xts.wsba.participantcompletion.client.BAParticipantCompletionTestCase.testWSBAParticipantCannotComplete(BAParticipantCompletionTestCase.java:177)
> testWSBAParticipantClientCancelNotComplete(org.jboss.as.test.xts.wsba.participantcompletion.client.BAParticipantCompletionTestCase)  Time elapsed: 0.095 sec  <<< ERROR!
> com.arjuna.wst.SystemException: org.apache.cxf.wsdl11.WSDLRuntimeException: Part parameters defined as element {http://docs.oasis-open.org/ws-tx/wscoor/2006/06}CreateCoordinationContext which is not in the schema.
> 	at com.arjuna.mwlabs.wst11.ba.remote.UserBusinessActivityImple.startTransaction(UserBusinessActivityImple.java:374)
> 	at com.arjuna.mwlabs.wst11.ba.remote.UserBusinessActivityImple.begin(UserBusinessActivityImple.java:117)
> 	at com.arjuna.mwlabs.wst11.ba.remote.UserBusinessActivityImple.begin(UserBusinessActivityImple.java:107)
> 	at org.jboss.as.test.xts.wsba.participantcompletion.client.BAParticipantCompletionTestCase.testWSBAParticipantClientCancelNotComplete(BAParticipantCompletionTestCase.java:161)
> testWSBAParticipantDoNotComplete(org.jboss.as.test.xts.wsba.participantcompletion.client.BAParticipantCompletionTestCase)  Time elapsed: 0.07 sec  <<< ERROR!
> com.arjuna.wst.SystemException: org.apache.cxf.wsdl11.WSDLRuntimeException: Part parameters defined as element {http://docs.oasis-open.org/ws-tx/wscoor/2006/06}CreateCoordinationContext which is not in the schema.
> 	at com.arjuna.mwlabs.wst11.ba.remote.UserBusinessActivityImple.startTransaction(UserBusinessActivityImple.java:374)
> 	at com.arjuna.mwlabs.wst11.ba.remote.UserBusinessActivityImple.begin(UserBusinessActivityImple.java:117)
> 	at com.arjuna.mwlabs.wst11.ba.remote.UserBusinessActivityImple.begin(UserBusinessActivityImple.java:107)
> 	at org.jboss.as.test.xts.wsba.participantcompletion.client.BAParticipantCompletionTestCase.testWSBAParticipantDoNotComplete(BAParticipantCompletionTestCase.java:141)
> testWSBAParticipantCompleteSimple(org.jboss.as.test.xts.wsba.participantcompletion.client.BAParticipantCompletionTestCase)  Time elapsed: 0.067 sec  <<< ERROR!
> com.arjuna.wst.SystemException: org.apache.cxf.wsdl11.WSDLRuntimeException: Part parameters defined as element {http://docs.oasis-open.org/ws-tx/wscoor/2006/06}CreateCoordinationContext which is not in the schema.
> 	at com.arjuna.mwlabs.wst11.ba.remote.UserBusinessActivityImple.startTransaction(UserBusinessActivityImple.java:374)
> 	at com.arjuna.mwlabs.wst11.ba.remote.UserBusinessActivityImple.begin(UserBusinessActivityImple.java:117)
> 	at com.arjuna.mwlabs.wst11.ba.remote.UserBusinessActivityImple.begin(UserBusinessActivityImple.java:107)
> 	at org.jboss.as.test.xts.wsba.participantcompletion.client.BAParticipantCompletionTestCase.testWSBAParticipantCompleteSimple(BAParticipantCompletionTestCase.java:125)
> testWSBAParticipantCompleteSingle(org.jboss.as.test.xts.wsba.participantcompletion.client.BAParticipantCompletionTestCase)  Time elapsed: 0.106 sec  <<< ERROR!
> com.arjuna.wst.SystemException: org.apache.cxf.wsdl11.WSDLRuntimeException: Part parameters defined as element {http://docs.oasis-open.org/ws-tx/wscoor/2006/06}CreateCoordinationContext which is not in the schema.
> 	at com.arjuna.mwlabs.wst11.ba.remote.UserBusinessActivityImple.startTransaction(UserBusinessActivityImple.java:374)
> 	at com.arjuna.mwlabs.wst11.ba.remote.UserBusinessActivityImple.begin(UserBusinessActivityImple.java:117)
> 	at com.arjuna.mwlabs.wst11.ba.remote.UserBusinessActivityImple.begin(UserBusinessActivityImple.java:107)
> 	at org.jboss.as.test.xts.wsba.participantcompletion.client.BAParticipantCompletionTestCase.testWSBAParticipantCompleteSingle(BAParticipantCompletionTestCase.java:114)
> testWSBAParticipantClientCancel(org.jboss.as.test.xts.wsba.participantcompletion.client.BAParticipantCompletionTestCase)  Time elapsed: 0.101 sec  <<< ERROR!
> com.arjuna.wst.SystemException: org.apache.cxf.wsdl11.WSDLRuntimeException: Part parameters defined as element {http://docs.oasis-open.org/ws-tx/wscoor/2006/06}CreateCoordinationContext which is not in the schema.
> 	at com.arjuna.mwlabs.wst11.ba.remote.UserBusinessActivityImple.startTransaction(UserBusinessActivityImple.java:374)
> 	at com.arjuna.mwlabs.wst11.ba.remote.UserBusinessActivityImple.begin(UserBusinessActivityImple.java:117)
> 	at com.arjuna.mwlabs.wst11.ba.remote.UserBusinessActivityImple.begin(UserBusinessActivityImple.java:107)
> 	at org.jboss.as.test.xts.wsba.participantcompletion.client.BAParticipantCompletionTestCase.testWSBAParticipantClientCancel(BAParticipantCompletionTestCase.java:202)
> Running org.jboss.as.test.xts.wsba.coordinatorcompletion.client.BACoordinatorCompletionTestCase
> Tests run: 6, Failures: 2, Errors: 4, Skipped: 0, Time elapsed: 0.585 sec <<< FAILURE! - in org.jboss.as.test.xts.wsba.coordinatorcompletion.client.BACoordinatorCompletionTestCase
> testWSBACoordinatorSimple(org.jboss.as.test.xts.wsba.coordinatorcompletion.client.BACoordinatorCompletionTestCase)  Time elapsed: 0.002 sec  <<< ERROR!
> com.arjuna.wst.SystemException: org.apache.cxf.wsdl11.WSDLRuntimeException: Part parameters defined as element {http://docs.oasis-open.org/ws-tx/wscoor/2006/06}CreateCoordinationContext which is not in the schema.
> 	at com.arjuna.mwlabs.wst11.ba.remote.UserBusinessActivityImple.startTransaction(UserBusinessActivityImple.java:374)
> 	at com.arjuna.mwlabs.wst11.ba.remote.UserBusinessActivityImple.begin(UserBusinessActivityImple.java:117)
> 	at com.arjuna.mwlabs.wst11.ba.remote.UserBusinessActivityImple.begin(UserBusinessActivityImple.java:107)
> 	at org.jboss.as.test.xts.wsba.coordinatorcompletion.client.BACoordinatorCompletionTestCase.testWSBACoordinatorSimple(BACoordinatorCompletionTestCase.java:106)
> testWSBACoordinatorSingle(org.jboss.as.test.xts.wsba.coordinatorcompletion.client.BACoordinatorCompletionTestCase)  Time elapsed: 0.002 sec  <<< ERROR!
> com.arjuna.wst.SystemException: org.apache.cxf.wsdl11.WSDLRuntimeException: Part parameters defined as element {http://docs.oasis-open.org/ws-tx/wscoor/2006/06}CreateCoordinationContext which is not in the schema.
> 	at com.arjuna.mwlabs.wst11.ba.remote.UserBusinessActivityImple.startTransaction(UserBusinessActivityImple.java:374)
> 	at com.arjuna.mwlabs.wst11.ba.remote.UserBusinessActivityImple.begin(UserBusinessActivityImple.java:117)
> 	at com.arjuna.mwlabs.wst11.ba.remote.UserBusinessActivityImple.begin(UserBusinessActivityImple.java:107)
> 	at org.jboss.as.test.xts.wsba.coordinatorcompletion.client.BACoordinatorCompletionTestCase.testWSBACoordinatorSingle(BACoordinatorCompletionTestCase.java:97)
> testWSBACoordinatorCannotComplete(org.jboss.as.test.xts.wsba.coordinatorcompletion.client.BACoordinatorCompletionTestCase)  Time elapsed: 0.002 sec  <<< FAILURE!
> java.lang.AssertionError: Another status order expected for the bacoordinator_completition_service1 expected:<[CANCEL]> but was:<null>
> 	at org.junit.Assert.fail(Assert.java:88)
> 	at org.junit.Assert.failNotEquals(Assert.java:834)
> 	at org.junit.Assert.assertEquals(Assert.java:118)
> 	at org.jboss.as.test.xts.base.BaseFunctionalTest.assertEventLog(BaseFunctionalTest.java:85)
> 	at org.jboss.as.test.xts.wsba.coordinatorcompletion.client.BACoordinatorCompletionTestCase.assertEventLogClient1(BACoordinatorCompletionTestCase.java:194)
> 	at org.jboss.as.test.xts.wsba.coordinatorcompletion.client.BACoordinatorCompletionTestCase.testWSBACoordinatorCannotComplete(BACoordinatorCompletionTestCase.java:134)
> testWSBACoordinatorApplicationException(org.jboss.as.test.xts.wsba.coordinatorcompletion.client.BACoordinatorCompletionTestCase)  Time elapsed: 0.359 sec  <<< ERROR!
> org.jboss.arquillian.test.spi.ArquillianProxyException: javax.xml.ws.soap.SOAPFaultException : Fault occurred while processing. [Proxied because : Original exception caused: class java.io.NotSerializableException: com.sun.xml.messaging.saaj.soap.ver1_1.SOAPPart1_1Impl]
> 	at org.apache.cxf.binding.soap.interceptor.Soap11FaultInInterceptor.unmarshalFault(Soap11FaultInInterceptor.java:86)
> 	at org.apache.cxf.binding.soap.interceptor.Soap11FaultInInterceptor.handleMessage(Soap11FaultInInterceptor.java:52)
> 	at org.apache.cxf.binding.soap.interceptor.Soap11FaultInInterceptor.handleMessage(Soap11FaultInInterceptor.java:41)
> 	at org.apache.cxf.phase.PhaseInterceptorChain.doIntercept(PhaseInterceptorChain.java:308)
> 	at org.apache.cxf.interceptor.AbstractFaultChainInitiatorObserver.onMessage(AbstractFaultChainInitiatorObserver.java:112)
> 	at org.apache.cxf.jaxws.handler.soap.SOAPHandlerInterceptor.handleMessage(SOAPHandlerInterceptor.java:140)
> 	at org.apache.cxf.jaxws.handler.soap.SOAPHandlerInterceptor.handleMessage(SOAPHandlerInterceptor.java:71)
> 	at org.apache.cxf.phase.PhaseInterceptorChain.doIntercept(PhaseInterceptorChain.java:308)
> 	at org.apache.cxf.endpoint.ClientImpl.onMessage(ClientImpl.java:798)
> 	at org.apache.cxf.transport.http.HTTPConduit$WrappedOutputStream.handleResponseInternal(HTTPConduit.java:1669)
> 	at org.apache.cxf.transport.http.HTTPConduit$WrappedOutputStream.handleResponse(HTTPConduit.java:1550)
> 	at org.apache.cxf.transport.http.HTTPConduit$WrappedOutputStream.close(HTTPConduit.java:1347)
> 	at org.apache.cxf.transport.AbstractConduit.close(AbstractConduit.java:56)
> 	at org.apache.cxf.transport.http.HTTPConduit.close(HTTPConduit.java:651)
> 	at org.apache.cxf.interceptor.MessageSenderInterceptor$MessageSenderEndingInterceptor.handleMessage(MessageSenderInterceptor.java:62)
> 	at org.apache.cxf.phase.PhaseInterceptorChain.doIntercept(PhaseInterceptorChain.java:308)
> 	at org.apache.cxf.endpoint.ClientImpl.doInvoke(ClientImpl.java:514)
> 	at org.apache.cxf.endpoint.ClientImpl.invoke(ClientImpl.java:423)
> 	at org.apache.cxf.endpoint.ClientImpl.invoke(ClientImpl.java:324)
> 	at org.apache.cxf.endpoint.ClientImpl.invoke(ClientImpl.java:277)
> 	at org.apache.cxf.frontend.ClientProxy.invokeSync(ClientProxy.java:96)
> 	at org.apache.cxf.jaxws.JaxWsClientProxy.invoke(JaxWsClientProxy.java:139)
> 	at com.sun.proxy.$Proxy255.saveData(Unknown Source)
> 	at org.jboss.as.test.xts.wsba.coordinatorcompletion.client.BACoordinatorCompletionTestCase.testWSBACoordinatorApplicationException(BACoordinatorCompletionTestCase.java:163)
> testWSBACoordinatorCompletionFailToComplete(org.jboss.as.test.xts.wsba.coordinatorcompletion.client.BACoordinatorCompletionTestCase)  Time elapsed: 0.097 sec  <<< FAILURE!
> java.lang.AssertionError: Another status order expected for the bacoordinator_completition_service1 expected:<[COMPLETE, CONFIRM_COMPLETED, COMPENSATE]> but was:<null>
> 	at org.junit.Assert.fail(Assert.java:88)
> 	at org.junit.Assert.failNotEquals(Assert.java:834)
> 	at org.junit.Assert.assertEquals(Assert.java:118)
> 	at org.jboss.as.test.xts.base.BaseFunctionalTest.assertEventLog(BaseFunctionalTest.java:85)
> 	at org.jboss.as.test.xts.wsba.coordinatorcompletion.client.BACoordinatorCompletionTestCase.assertEventLogClient1(BACoordinatorCompletionTestCase.java:194)
> 	at org.jboss.as.test.xts.wsba.coordinatorcompletion.client.BACoordinatorCompletionTestCase.testWSBACoordinatorCompletionFailToComplete(BACoordinatorCompletionTestCase.java:185)
> testWSBACoordinatorClientCancel(org.jboss.as.test.xts.wsba.coordinatorcompletion.client.BACoordinatorCompletionTestCase)  Time elapsed: 0.06 sec  <<< ERROR!
> com.arjuna.wst.SystemException: org.apache.cxf.wsdl11.WSDLRuntimeException: Part parameters defined as element {http://docs.oasis-open.org/ws-tx/wscoor/2006/06}CreateCoordinationContext which is not in the schema.
> 	at com.arjuna.mwlabs.wst11.ba.remote.UserBusinessActivityImple.startTransaction(UserBusinessActivityImple.java:374)
> 	at com.arjuna.mwlabs.wst11.ba.remote.UserBusinessActivityImple.begin(UserBusinessActivityImple.java:117)
> 	at com.arjuna.mwlabs.wst11.ba.remote.UserBusinessActivityImple.begin(UserBusinessActivityImple.java:107)
> 	at org.jboss.as.test.xts.wsba.coordinatorcompletion.client.BACoordinatorCompletionTestCase.testWSBACoordinatorClientCancel(BACoordinatorCompletionTestCase.java:142)
> Results :
> Failed tests: 
>   BACoordinatorCompletionTestCase.testWSBACoordinatorCannotComplete:134->assertEventLogClient1:194->BaseFunctionalTest.assertEventLog:85 Another status order expected for the bacoordinator_completition_service1 expected:<[CANCEL]> but was:<null>
>   BACoordinatorCompletionTestCase.testWSBACoordinatorCompletionFailToComplete:185->assertEventLogClient1:194->BaseFunctionalTest.assertEventLog:85 Another status order expected for the bacoordinator_completition_service1 expected:<[COMPLETE, CONFIRM_COMPLETED, COMPENSATE]> but was:<null>
> Tests in error: 
>   ATTestCase.testWSATApplicationExceptionCommit:227 » ArquillianProxy javax.xml....
>   ATTestCase.testWSATRollbackOnly:172 » System org.apache.cxf.wsdl11.WSDLRuntime...
>   TransactionalTestCase.testActiveTransaction:78 » System org.apache.cxf.wsdl11....
>   CompensatableTestCase.testActiveTransaction:77 » System org.apache.cxf.wsdl11....
>   BAParticipantCompletionTestCase.testWSBAParticipantApplicationException:218 » System
>   BAParticipantCompletionTestCase.testWSBAParticipantCannotComplete:177 » System
>   BAParticipantCompletionTestCase.testWSBAParticipantClientCancelNotComplete:161 » System
>   BAParticipantCompletionTestCase.testWSBAParticipantDoNotComplete:141 » System ...
>   BAParticipantCompletionTestCase.testWSBAParticipantCompleteSimple:125 » System
>   BAParticipantCompletionTestCase.testWSBAParticipantCompleteSingle:114 » System
>   BAParticipantCompletionTestCase.testWSBAParticipantClientCancel:202 » System o...
>   BACoordinatorCompletionTestCase.testWSBACoordinatorSimple:106 » System org.apa...
>   BACoordinatorCompletionTestCase.testWSBACoordinatorSingle:97 » System org.apac...
>   BACoordinatorCompletionTestCase.testWSBACoordinatorApplicationException:163 » ArquillianProxy
>   BACoordinatorCompletionTestCase.testWSBACoordinatorClientCancel:142 » System o...
> {code}



--
This message was sent by Atlassian JIRA
(v6.4.11#64026)



More information about the jbossts-issues mailing list