[jbossts-issues] [JBoss JIRA] (JBTM-2540) Can't build BlackTie subsystem since update to WFLY 10 CR4-SNAPSHOT

Amos Feng (JIRA) issues at jboss.org
Thu Oct 22 01:33:00 EDT 2015


    [ https://issues.jboss.org/browse/JBTM-2540?page=com.atlassian.jira.plugin.system.issuetabpanels:comment-tabpanel&focusedCommentId=13120771#comment-13120771 ] 

Amos Feng commented on JBTM-2540:
---------------------------------

Thanks Tom for looking into it and I think it would be some configuration changes.

> Can't build BlackTie subsystem since update to WFLY 10 CR4-SNAPSHOT
> -------------------------------------------------------------------
>
>                 Key: JBTM-2540
>                 URL: https://issues.jboss.org/browse/JBTM-2540
>             Project: JBoss Transaction Manager
>          Issue Type: Bug
>          Components: BlackTie, Build System
>    Affects Versions: 5.2.6.Final
>            Reporter: Tom Jenkinson
>            Assignee: Amos Feng
>            Priority: Blocker
>             Fix For: 5.next
>
>
> {code}
> [INFO] ------------------------------------------------------------------------                                                                                                                                                              
> [INFO] Reactor Summary:                                                                                                                                                                                                                      
> [INFO]                                                                                                                                                                                                                                       
> [INFO] WildFly: Blacktie Subsystem Parent ................ SUCCESS [0.932s]                                                                                                                                                                  
> [INFO] WildFly: Blacktie Subsystem ....................... SUCCESS [3.568s]                                                                                                                                                                  
> [INFO] WildFly: Blacktie Feature Pack .................... SUCCESS [0.725s]                                                                                                                                                                  
> [INFO] WildFly: Blacktie Subsystem Build ................. FAILURE [4.928s]                                                                                                                                                                  
> [INFO] ------------------------------------------------------------------------                                                                                                                                                              
> [INFO] BUILD FAILURE                                                                                                                                                                                                                         
> [INFO] ------------------------------------------------------------------------                                                                                                                                                              
> [INFO] Total time: 10.345s                                                                                                                                                                                                                   
> [INFO] Finished at: Wed Oct 21 16:40:05 BST 2015                                                                                                                                                                                             
> [INFO] Final Memory: 51M/234M                                                                                                                                                                                                                
> [INFO] ------------------------------------------------------------------------                                                                                                                                                              
> [ERROR] Failed to execute goal org.wildfly.build:wildfly-server-provisioning-maven-plugin:1.1.0.CR1:build (server-provisioning) on project wildfly-blacktie-build: Execution server-provisioning of goal org.wildfly.build:wildfly-server-pro
> visioning-maven-plugin:1.1.0.CR1:build failed: java.lang.RuntimeException: java.lang.NullPointerException -> [Help 1]                                                                                                                        
> {code}



--
This message was sent by Atlassian JIRA
(v6.4.11#64026)


More information about the jbossts-issues mailing list