[jbpm-dev] Build failed in Hudson: jbpm4-jboss » mysql,5.0.0.GA,java15_default,dev45 #45

jboss-qa-internal at redhat.com jboss-qa-internal at redhat.com
Wed Jun 17 13:17:57 EDT 2009


See http://hudson.qa.jboss.com/hudson/job/jbpm4-jboss/./DATABASE=mysql,JBOSS_VERSION=5.0.0.GA,jdk=java15_default,label=dev45/45/changes

Changes:

[tom.baeyens at jboss.com] JBPM-2306 updating dev guide

[tom.baeyens at jboss.com] JBPM-2275 async end combinations

[jbarrez] Added tests for JBPM-1214 : self-transition/loop back to State activity

[jbarrez] Initial import for concurrency tests (JBPM-1987)

[jbarrez] Importing work done for concurrent testing (JBPM-1987)

[tom.baeyens at jboss.com] added pointer on how to configure identity component

[tom.baeyens at jboss.com] JBPM-2322 enabled module test-db in the integration test suite

------------------------------------------
[...truncated 5688 lines...]
	at org.jboss.proxy.ejb.SecurityContextInterceptor.invoke(SecurityContextInterceptor.java:64)
	at org.jboss.proxy.SecurityInterceptor.invoke(SecurityInterceptor.java:68)
	at org.jboss.proxy.ejb.StatelessSessionInterceptor.invoke(StatelessSessionInterceptor.java:112)
	at org.jboss.proxy.ClientContainer.invoke(ClientContainer.java:101)
	at $Proxy2.execute(Unknown Source)
	at org.jbpm.enterprise.internal.ejb.EjbRemoteCommandService.execute(EjbRemoteCommandService.java:66)
	at org.jbpm.pvm.internal.svc.ExecutionServiceImpl.startProcessInstanceByKey(ExecutionServiceImpl.java:66)
	at org.jbpm.test.async.AsyncEndCombinationTest.testConcurrentScenario2(AsyncEndCombinationTest.java:78)
	at sun.reflect.NativeMethodAccessorImpl.invoke0(Native Method)
	at sun.reflect.NativeMethodAccessorImpl.invoke(NativeMethodAccessorImpl.java:39)
	at sun.reflect.DelegatingMethodAccessorImpl.invoke(DelegatingMethodAccessorImpl.java:25)
	at java.lang.reflect.Method.invoke(Method.java:585)
	at junit.framework.TestCase.runTest(TestCase.java:154)
	at org.jbpm.test.BaseJbpmTestCase.runTest(BaseJbpmTestCase.java:83)
	at junit.framework.TestCase.runBare(TestCase.java:127)
	at junit.framework.TestResult$1.protect(TestResult.java:106)
	at junit.framework.TestResult.runProtected(TestResult.java:124)
	at junit.framework.TestResult.run(TestResult.java:109)
	at junit.framework.TestCase.run(TestCase.java:118)
	at junit.framework.TestSuite.runTest(TestSuite.java:208)
	at junit.framework.TestSuite.run(TestSuite.java:203)
	at sun.reflect.GeneratedMethodAccessor24.invoke(Unknown Source)
	at sun.reflect.DelegatingMethodAccessorImpl.invoke(DelegatingMethodAccessorImpl.java:25)
	at java.lang.reflect.Method.invoke(Method.java:585)
	at org.apache.maven.surefire.junit.JUnitTestSet.execute(JUnitTestSet.java:213)
	at org.apache.maven.surefire.suite.AbstractDirectoryTestSuite.executeTestSet(AbstractDirectoryTestSuite.java:140)
	at org.apache.maven.surefire.suite.AbstractDirectoryTestSuite.execute(AbstractDirectoryTestSuite.java:127)
	at org.apache.maven.surefire.Surefire.run(Surefire.java:177)
	at sun.reflect.NativeMethodAccessorImpl.invoke0(Native Method)
	at sun.reflect.NativeMethodAccessorImpl.invoke(NativeMethodAccessorImpl.java:39)
	at sun.reflect.DelegatingMethodAccessorImpl.invoke(DelegatingMethodAccessorImpl.java:25)
	at java.lang.reflect.Method.invoke(Method.java:585)
	at org.apache.maven.surefire.booter.SurefireBooter.runSuitesInProcess(SurefireBooter.java:338)
	at org.apache.maven.surefire.booter.SurefireBooter.main(SurefireBooter.java:997)
Caused by: java.lang.IllegalStateException: BaseTransaction.rollback - [com.arjuna.ats.internal.jta.transaction.arjunacore.notx] [com.arjuna.ats.internal.jta.transaction.arjunacore.notx] no transaction!
	at com.arjuna.ats.internal.jta.transaction.arjunacore.BaseTransaction.rollback(BaseTransaction.java:158)
	at com.arjuna.ats.jbossatx.BaseTransactionManagerDelegate.rollback(BaseTransactionManagerDelegate.java:114)
	at org.jboss.ejb.EnterpriseContext$UserTransactionImpl.rollback(EnterpriseContext.java:659)
	at org.jboss.ejb.StatelessSessionEnterpriseContext$SessionContextImpl$1.rollback(StatelessSessionEnterpriseContext.java:279)
	at org.jbpm.pvm.internal.tx.jta.JtaTransaction.rollback(JtaTransaction.java:77)
	at org.jbpm.pvm.internal.tx.jta.JtaTransactionInterceptor.execute(JtaTransactionInterceptor.java:78)
	at org.jbpm.pvm.internal.svc.EnvironmentInterceptor.execute(EnvironmentInterceptor.java:54)
	at org.jbpm.enterprise.internal.ejb.CommandExecutorSLSB.execute(CommandExecutorSLSB.java:102)
	at sun.reflect.GeneratedMethodAccessor279.invoke(Unknown Source)
	at sun.reflect.DelegatingMethodAccessorImpl.invoke(DelegatingMethodAccessorImpl.java:25)
	at java.lang.reflect.Method.invoke(Method.java:585)
	at org.jboss.invocation.Invocation.performCall(Invocation.java:386)
	at org.jboss.ejb.StatelessSessionContainer$ContainerInterceptor.invoke(StatelessSessionContainer.java:228)
	at org.jboss.resource.connectionmanager.CachedConnectionInterceptor.invoke(CachedConnectionInterceptor.java:156)
	at org.jboss.ejb.plugins.CallValidationInterceptor.invoke(CallValidationInterceptor.java:63)
	at org.jboss.ejb.plugins.AbstractTxInterceptor.invokeNext(AbstractTxInterceptor.java:121)
	at org.jboss.ejb.plugins.AbstractTxInterceptorBMT.invokeNext(AbstractTxInterceptorBMT.java:173)
	at org.jboss.ejb.plugins.TxInterceptorBMT.invoke(TxInterceptorBMT.java:77)
	at org.jboss.ejb.plugins.StatelessSessionInstanceInterceptor.invoke(StatelessSessionInstanceInterceptor.java:173)
	at org.jboss.ejb.plugins.SecurityInterceptor.process(SecurityInterceptor.java:228)
	at org.jboss.ejb.plugins.SecurityInterceptor.invoke(SecurityInterceptor.java:211)
	at org.jboss.ejb.plugins.security.PreSecurityInterceptor.process(PreSecurityInterceptor.java:97)
	at org.jboss.ejb.plugins.security.PreSecurityInterceptor.invoke(PreSecurityInterceptor.java:81)
	at org.jboss.ejb.plugins.LogInterceptor.invoke(LogInterceptor.java:205)
	at org.jboss.ejb.plugins.ProxyFactoryFinderInterceptor.invoke(ProxyFactoryFinderInterceptor.java:138)
	at org.jboss.ejb.SessionContainer.internalInvoke(SessionContainer.java:650)
	at org.jboss.ejb.Container.invoke(Container.java:1029)
	at sun.reflect.GeneratedMethodAccessor269.invoke(Unknown Source)
	at sun.reflect.DelegatingMethodAccessorImpl.invoke(DelegatingMethodAccessorImpl.java:25)
	at java.lang.reflect.Method.invoke(Method.java:585)
	at org.jboss.mx.interceptor.ReflectedDispatcher.invoke(ReflectedDispatcher.java:157)
	at org.jboss.mx.server.Invocation.dispatch(Invocation.java:96)
	at org.jboss.mx.server.Invocation.invoke(Invocation.java:88)
	at org.jboss.mx.server.AbstractMBeanInvoker.invoke(AbstractMBeanInvoker.java:264)
	at org.jboss.mx.server.MBeanServerImpl.invoke(MBeanServerImpl.java:668)
	at org.jboss.invocation.unified.server.UnifiedInvoker.invoke(UnifiedInvoker.java:232)
	at org.jboss.remoting.ServerInvoker.invoke(ServerInvoker.java:908)
	at org.jboss.remoting.transport.socket.ServerThread.completeInvocation(ServerThread.java:742)
	at org.jboss.remoting.transport.socket.ServerThread.processInvocation(ServerThread.java:695)
	at org.jboss.remoting.transport.socket.ServerThread.dorun(ServerThread.java:549)
	at org.jboss.remoting.transport.socket.ServerThread.run(ServerThread.java:230)
### EXCEPTION ###########################################
13:17:32,000 SEV | [BaseJbpmTestCase] 
13:17:32,068 FIN | [BaseJbpmTestCase] === ending testConcurrentScenario2 =============================

13:17:32,077 FIN | [BaseJbpmTestCase] === starting testAsyncToEnd =============================
13:17:32,478 FIN | [BaseJbpmTestCase] === ending testAsyncToEnd =============================

Tests run: 3, Failures: 0, Errors: 2, Skipped: 0, Time elapsed: 1.031 sec <<< FAILURE!
Running org.jbpm.test.task.TaskVariablesTest
13:17:32,509 FIN | [BaseJbpmTestCase] === starting testTaskVariables =============================
13:17:32,763 FIN | [BaseJbpmTestCase] === ending testTaskVariables =============================

Tests run: 1, Failures: 0, Errors: 0, Skipped: 0, Time elapsed: 0.266 sec
13:17:32,771 FIN | [BaseJbpmTestCase] === starting testProcessInstanceHistory =============================
Running org.jbpm.test.history.ProcessInstanceHistoryTest
13:17:33,187 FIN | [BaseJbpmTestCase] === ending testProcessInstanceHistory =============================

Tests run: 1, Failures: 0, Errors: 0, Skipped: 0, Time elapsed: 0.43 sec
Running org.jbpm.test.deploy.ImageTest
13:17:33,208 FIN | [BaseJbpmTestCase] === starting testImage =============================
13:17:33,523 FIN | [BaseJbpmTestCase] === ending testImage =============================

Tests run: 1, Failures: 0, Errors: 0, Skipped: 0, Time elapsed: 0.324 sec
Running org.jbpm.test.task.TaskListTest
13:17:33,535 FIN | [BaseJbpmTestCase] === starting testPersonalTaskList =============================
13:17:34,015 FIN | [BaseJbpmTestCase] === ending testPersonalTaskList =============================

13:17:34,017 FIN | [BaseJbpmTestCase] === starting testPersonalTaskListDefaultSortOrder =============================
13:17:34,669 FIN | [BaseJbpmTestCase] === ending testPersonalTaskListDefaultSortOrder =============================

Tests run: 2, Failures: 0, Errors: 0, Skipped: 0, Time elapsed: 1.155 sec
13:17:34,689 FIN | [BaseJbpmTestCase] === starting testSystemVariables =============================
Running org.jbpm.test.execution.SystemVariablesTest
13:17:35,150 FIN | [BaseJbpmTestCase] === ending testSystemVariables =============================

Tests run: 1, Failures: 0, Errors: 0, Skipped: 0, Time elapsed: 0.472 sec
13:17:35,166 FIN | [BaseJbpmTestCase] === starting testSingleUser =============================
Running org.jbpm.test.identity.IdentityTest
13:17:35,337 FIN | [BaseJbpmTestCase] === ending testSingleUser =============================

13:17:35,337 FIN | [BaseJbpmTestCase] === starting testCreateGroup =============================
13:17:35,461 FIN | [BaseJbpmTestCase] === ending testCreateGroup =============================

13:17:35,462 FIN | [BaseJbpmTestCase] === starting testFindGroupsByUser =============================
13:17:35,715 FIN | [BaseJbpmTestCase] === ending testFindGroupsByUser =============================

13:17:35,716 FIN | [BaseJbpmTestCase] === starting testFindGroupByUserAndGroupType =============================
13:17:35,970 FIN | [BaseJbpmTestCase] === ending testFindGroupByUserAndGroupType =============================

13:17:35,971 FIN | [BaseJbpmTestCase] === starting testSingleGroup =============================
13:17:36,654 FIN | [BaseJbpmTestCase] === ending testSingleGroup =============================

13:17:36,655 FIN | [BaseJbpmTestCase] === starting testSingleUser2 =============================
13:17:36,817 FIN | [BaseJbpmTestCase] === ending testSingleUser2 =============================

Tests run: 6, Failures: 0, Errors: 0, Skipped: 0, Time elapsed: 1.658 sec
13:17:36,823 FIN | [BaseJbpmTestCase] === starting testAsyncEventListener =============================
Running org.jbpm.examples.async.eventlistener.AsyncEventListenerTest
13:17:37,461 FIN | [BaseJbpmTestCase] === ending testAsyncEventListener =============================

Tests run: 1, Failures: 0, Errors: 0, Skipped: 0, Time elapsed: 0.654 sec
Running org.jbpm.test.process.ProcessDefinitionQueryTest
13:17:37,482 FIN | [BaseJbpmTestCase] === starting testQueryProcessDefinitionsEmpty =============================
13:17:37,525 FIN | [BaseJbpmTestCase] === ending testQueryProcessDefinitionsEmpty =============================

13:17:37,527 FIN | [BaseJbpmTestCase] === starting testQueryProcessDefinitionsNameLike =============================
13:17:39,215 FIN | [BaseJbpmTestCase] === ending testQueryProcessDefinitionsNameLike =============================

13:17:39,216 FIN | [BaseJbpmTestCase] === starting testQueryProcessDefinitionsKeyLike =============================
13:17:40,429 FIN | [BaseJbpmTestCase] === ending testQueryProcessDefinitionsKeyLike =============================

Tests run: 3, Failures: 0, Errors: 0, Skipped: 0, Time elapsed: 2.954 sec
Running org.jbpm.test.execution.ExecutionQueryTest
13:17:40,436 FIN | [BaseJbpmTestCase] === starting testQueryForEndedExecutions =============================
13:17:41,169 FIN | [BaseJbpmTestCase] === ending testQueryForEndedExecutions =============================

Tests run: 1, Failures: 0, Errors: 0, Skipped: 0, Time elapsed: 0.739 sec
Running org.jbpm.test.history.ChoiceDistributionTest
13:17:41,177 FIN | [BaseJbpmTestCase] === starting testDecisionExpression =============================
13:17:42,090 FIN | [BaseJbpmTestCase] === ending testDecisionExpression =============================

Tests run: 1, Failures: 0, Errors: 0, Skipped: 0, Time elapsed: 0.919 sec
Running org.jbpm.test.execution.StartExecutionTest
13:17:42,101 FIN | [BaseJbpmTestCase] === starting testStartNewExecutionByKey =============================
13:17:42,393 FIN | [BaseJbpmTestCase] === ending testStartNewExecutionByKey =============================

13:17:42,393 FIN | [BaseJbpmTestCase] === starting testStartNewExecutionInLatestProcessDefinition =============================
13:17:42,884 FIN | [BaseJbpmTestCase] === ending testStartNewExecutionInLatestProcessDefinition =============================

13:17:42,885 FIN | [BaseJbpmTestCase] === starting testStartExecutionInLatestByNameWithVariables =============================
13:17:43,293 FIN | [BaseJbpmTestCase] === ending testStartExecutionInLatestByNameWithVariables =============================

13:17:43,294 FIN | [BaseJbpmTestCase] === starting testStartNewProcessInstanceWithAKey =============================
13:17:43,462 FIN | [BaseJbpmTestCase] === ending testStartNewProcessInstanceWithAKey =============================

13:17:43,465 FIN | [BaseJbpmTestCase] === starting testStartNewProcessInstanceWithVariables =============================
13:17:43,771 FIN | [BaseJbpmTestCase] === ending testStartNewProcessInstanceWithVariables =============================

13:17:43,772 FIN | [BaseJbpmTestCase] === starting testStartExecutionById =============================
13:17:44,004 FIN | [BaseJbpmTestCase] === ending testStartExecutionById =============================

13:17:44,004 FIN | [BaseJbpmTestCase] === starting testStartExecutionByIdWithVariables =============================
13:17:44,262 FIN | [BaseJbpmTestCase] === ending testStartExecutionByIdWithVariables =============================

Tests run: 7, Failures: 0, Errors: 0, Skipped: 0, Time elapsed: 2.17 sec
13:17:44,269 FIN | [BaseJbpmTestCase] === starting testSignalExecutionById =============================
Running org.jbpm.test.execution.SignalExecutionTest
13:17:44,589 FIN | [BaseJbpmTestCase] === ending testSignalExecutionById =============================

13:17:44,589 FIN | [BaseJbpmTestCase] === starting testSignalExecutionWithVariables =============================
13:17:44,901 FIN | [BaseJbpmTestCase] === ending testSignalExecutionWithVariables =============================

13:17:44,901 FIN | [BaseJbpmTestCase] === starting testDefaultSignalWithoutTransitions =============================
13:17:45,163 FIN | [BaseJbpmTestCase] === ending testDefaultSignalWithoutTransitions =============================

Tests run: 3, Failures: 0, Errors: 0, Skipped: 0, Time elapsed: 0.899 sec
13:17:45,170 FIN | [BaseJbpmTestCase] === starting testPlentyOfTime =============================
Running org.jbpm.examples.goup.multipleentries.MultipleEntriesTest
13:17:45,622 FIN | [BaseJbpmTestCase] === ending testPlentyOfTime =============================

13:17:45,622 FIN | [BaseJbpmTestCase] === starting testTimeIsRunningOut =============================
13:17:45,889 FIN | [BaseJbpmTestCase] === ending testTimeIsRunningOut =============================

Tests run: 2, Failures: 0, Errors: 0, Skipped: 0, Time elapsed: 0.726 sec
Running org.jbpm.test.execution.ExecutionEagerLoadingTest
13:17:45,897 FIN | [BaseJbpmTestCase] === starting testEagerLoading =============================
13:17:46,337 FIN | [BaseJbpmTestCase] === ending testEagerLoading =============================

Tests run: 1, Failures: 0, Errors: 0, Skipped: 0, Time elapsed: 0.452 sec
Running org.jbpm.test.task.TaskParticipationsTest
13:17:46,357 FIN | [BaseJbpmTestCase] === starting testTaskParticipants =============================
13:17:47,404 FIN | [BaseJbpmTestCase] === ending testTaskParticipants =============================

Tests run: 1, Failures: 0, Errors: 0, Skipped: 0, Time elapsed: 1.065 sec
Running org.jbpm.test.history.EndProcessInstanceTest
13:17:47,418 FIN | [BaseJbpmTestCase] === starting testCancelProcessInstance =============================
13:17:47,822 FIN | [BaseJbpmTestCase] === ending testCancelProcessInstance =============================

Tests run: 1, Failures: 0, Errors: 0, Skipped: 0, Time elapsed: 0.411 sec
Running org.jbpm.test.activities.ForkToTaskTest
13:17:47,832 FIN | [BaseJbpmTestCase] === starting testForkToTasks =============================
13:17:48,651 FIN | [BaseJbpmTestCase] === ending testForkToTasks =============================

Tests run: 1, Failures: 0, Errors: 0, Skipped: 0, Time elapsed: 0.828 sec

Results :

Tests in error: 
  testConcurrentEndScenario1(org.jbpm.test.execution.ConcurrentEndTest)
  testConcurrentEndScenario2(org.jbpm.test.execution.ConcurrentEndTest)
  testForkToJoinInOneTransaction(org.jbpm.test.activities.ForkJoinInSameTransactionTest)
  testForkToJoinAfterStateInOneTransaction(org.jbpm.test.activities.ForkJoinInSameTransactionTest)
  testForkToJoinWithActivitiesInOneTransaction(org.jbpm.test.activities.ForkJoinInSameTransactionTest)
  testForkToJoinInLoopInOneTransaction(org.jbpm.test.activities.ForkJoinInSameTransactionTest)
  testConcurrentEndScenario1(org.jbpm.test.async.AsyncEndCombinationTest)
  testConcurrentScenario2(org.jbpm.test.async.AsyncEndCombinationTest)

Tests run: 145, Failures: 0, Errors: 8, Skipped: 0

[INFO] ------------------------------------------------------------------------
[ERROR] BUILD FAILURE
[INFO] ------------------------------------------------------------------------
[INFO] There are test failures.

Please refer to http://hudson.qa.jboss.com/hudson/job/jbpm4-jboss/./DATABASE=mysql,JBOSS_VERSION=5.0.0.GA,jdk=java15_default,label=dev45/ws/jbpm4/modules/test-db/target/surefire-reports  for the individual test results.
[INFO] ------------------------------------------------------------------------
[INFO] For more information, run Maven with the -e switch
[INFO] ------------------------------------------------------------------------
[INFO] Total time: 2 minutes 51 seconds
[INFO] Finished at: Wed Jun 17 13:17:48 EDT 2009
[INFO] Final Memory: 47M/1016M
[INFO] ------------------------------------------------------------------------
Recording test results




More information about the jbpm-dev mailing list