[riftsaw-commits] Build failed in Hudson: RiftSaw-db2-2.1.x #5

jboss-qa-internal at redhat.com jboss-qa-internal at redhat.com
Thu Sep 30 20:26:32 EDT 2010


See <http://hudson.qa.jboss.com/hudson/job/RiftSaw-db2-2.1.x/5/>

------------------------------------------
[...truncated 494 lines...]
[WARNING] Cannot include project artifact: org.jboss.soa.bpel:distribution:pom:2.1.2-SNAPSHOT; it doesn't have an associated file or directory.
[WARNING] Cannot include project artifact: org.jboss.soa.bpel:distribution:pom:2.1.2-SNAPSHOT; it doesn't have an associated file or directory.
[INFO] riftsaw-2.1.2-SNAPSHOT/modules/bpel-console/jettison.jar already added, skipping
[INFO] Building zip: /qa/services/hudson/hudson_workspace/workspace/RiftSaw-db2-2.1.x/riftsaw-db2/distribution/target/riftsaw-2.1.2-SNAPSHOT.zip
[INFO] riftsaw-2.1.2-SNAPSHOT/modules/bpel-console/jettison.jar already added, skipping
[INFO] [assembly:single {execution: distribution-package-source}]
[INFO] Reading assembly descriptor: src/main/assembly/src.xml
[INFO] Building zip: /qa/services/hudson/hudson_workspace/workspace/RiftSaw-db2-2.1.x/riftsaw-db2/distribution/target/riftsaw-2.1.2-SNAPSHOT-src.zip
[INFO] Preparing source:jar
[WARNING] Removing: jar from forked lifecycle, to prevent recursive invocation.
[INFO] No goals needed for project - skipping
[INFO] [source:jar {execution: attach-sources}]
[INFO] [install:install]
[INFO] Installing /qa/services/hudson/hudson_workspace/workspace/RiftSaw-db2-2.1.x/riftsaw-db2/distribution/pom.xml to /home/hudson/.m2/repository/org/jboss/soa/bpel/distribution/2.1.2-SNAPSHOT/distribution-2.1.2-SNAPSHOT.pom
[INFO] Installing /qa/services/hudson/hudson_workspace/workspace/RiftSaw-db2-2.1.x/riftsaw-db2/distribution/target/riftsaw-2.1.2-SNAPSHOT.zip to /home/hudson/.m2/repository/org/jboss/soa/bpel/distribution/2.1.2-SNAPSHOT/distribution-2.1.2-SNAPSHOT.zip
[INFO] Installing /qa/services/hudson/hudson_workspace/workspace/RiftSaw-db2-2.1.x/riftsaw-db2/distribution/target/riftsaw-2.1.2-SNAPSHOT-src.zip to /home/hudson/.m2/repository/org/jboss/soa/bpel/distribution/2.1.2-SNAPSHOT/distribution-2.1.2-SNAPSHOT.zip
[INFO] 
[INFO] 
[INFO] ------------------------------------------------------------------------
[INFO] Reactor Summary:
[INFO] ------------------------------------------------------------------------
[INFO] RiftSaw ............................................... SUCCESS [10.826s]
[INFO] RiftSaw::Runtime ...................................... SUCCESS [0.112s]
[INFO] RiftSaw::Runtime::Deployer ............................ SUCCESS [16.241s]
[INFO] RiftSaw::Runtime::Engine .............................. SUCCESS [1:08.581s]
[INFO] RiftSaw::Runtime::UDDI ................................ SUCCESS [7.520s]
[INFO] RiftSaw::Runtime::Engine-Assembly ..................... SUCCESS [18.091s]
[INFO] RiftSaw::Runtime::JBossESB-BPEL ....................... SUCCESS [11.290s]
[INFO] RiftSaw::Runtime::JBossESB-BPEL-Assembly .............. SUCCESS [3.949s]
[INFO] RiftSaw::Console ...................................... SUCCESS [0.069s]
[INFO] RiftSaw::Console::Integration ......................... SUCCESS [7.512s]
[INFO] RiftSaw::Console::Identity ............................ SUCCESS [0.440s]
[INFO] RiftSaw::Docs ......................................... SUCCESS [0.093s]
[INFO] RiftSaw::Docs::gettingstartedguide .................... SUCCESS [1:15.136s]
[INFO] RiftSaw::Docs::userguide .............................. SUCCESS [1:17.960s]
[INFO] RiftSaw::Distribution ................................. SUCCESS [2:41.261s]
[INFO] ------------------------------------------------------------------------
[INFO] ------------------------------------------------------------------------
[INFO] BUILD SUCCESSFUL
[INFO] ------------------------------------------------------------------------
[INFO] Total time: 7 minutes 44 seconds
[INFO] Finished at: Thu Sep 30 20:11:29 EDT 2010
[INFO] Final Memory: 195M/753M
[INFO] ------------------------------------------------------------------------
Buildfile: build.xml
     [echo] ===============================
     [echo] database.......... db2
     [echo] riftsaw.version...... 2.1.2-SNAPSHOT
     [echo] riftsaw.home......... <http://hudson.qa.jboss.com/hudson/job/RiftSaw-db2-2.1.x/ws/riftsaw-2.1.2-SNAPSHOT>
     [echo] jboss.home.. <http://hudson.qa.jboss.com/hudson/job/RiftSaw-db2-2.1.x/ws/riftsaw-2.1.2-SNAPSHOT/jboss-5.1.0.GA>
     [echo] org.jboss.esb.home .. <http://hudson.qa.jboss.com/hudson/job/RiftSaw-db2-2.1.x/ws/riftsaw-2.1.2-SNAPSHOT/jbossesb-4.8>
     [echo] ===============================

stop-server:
     [echo] Stopping the server
     [echo] Server is at <http://hudson.qa.jboss.com/hudson/job/RiftSaw-db2-2.1.x/ws/riftsaw-2.1.2-SNAPSHOT/jboss-5.1.0.GA>
     [java] Exception in thread "main" java.lang.NoClassDefFoundError: org/jboss/Shutdown
     [java] Caused by: java.lang.ClassNotFoundException: org.jboss.Shutdown
     [java] 	at java.net.URLClassLoader$1.run(URLClassLoader.java:200)
     [java] 	at java.security.AccessController.doPrivileged(Native Method)
     [java] 	at java.net.URLClassLoader.findClass(URLClassLoader.java:188)
     [java] 	at java.lang.ClassLoader.loadClass(ClassLoader.java:307)
     [java] 	at sun.misc.Launcher$AppClassLoader.loadClass(Launcher.java:301)
     [java] 	at java.lang.ClassLoader.loadClass(ClassLoader.java:252)
     [java] 	at java.lang.ClassLoader.loadClassInternal(ClassLoader.java:320)
     [java] Could not find the main class: org.jboss.Shutdown.  Program will exit.
     [java] Java Result: 1
     [echo] Shutdown rc = 1
     [echo] Waiting for JNP to stop listening...

BUILD SUCCESSFUL
Total time: 2 minutes 1 second
Buildfile: build.xml
     [echo] ===============================
     [echo] database.......... db2
     [echo] riftsaw.version...... 2.1.2-SNAPSHOT
     [echo] riftsaw.home......... <http://hudson.qa.jboss.com/hudson/job/RiftSaw-db2-2.1.x/ws/riftsaw-2.1.2-SNAPSHOT>
     [echo] jboss.home.. <http://hudson.qa.jboss.com/hudson/job/RiftSaw-db2-2.1.x/ws/riftsaw-2.1.2-SNAPSHOT/jboss-5.1.0.GA>
     [echo] org.jboss.esb.home .. <http://hudson.qa.jboss.com/hudson/job/RiftSaw-db2-2.1.x/ws/riftsaw-2.1.2-SNAPSHOT/jbossesb-4.8>
     [echo] ===============================

clean:

BUILD SUCCESSFUL
Total time: 1 second
Buildfile: build.xml
     [echo] ===============================
     [echo] database.......... db2
     [echo] riftsaw.version...... 2.1.2-SNAPSHOT
     [echo] riftsaw.home......... <http://hudson.qa.jboss.com/hudson/job/RiftSaw-db2-2.1.x/ws/riftsaw-2.1.2-SNAPSHOT>
     [echo] jboss.home.. <http://hudson.qa.jboss.com/hudson/job/RiftSaw-db2-2.1.x/ws/riftsaw-2.1.2-SNAPSHOT/jboss-5.1.0.GA>
     [echo] org.jboss.esb.home .. <http://hudson.qa.jboss.com/hudson/job/RiftSaw-db2-2.1.x/ws/riftsaw-2.1.2-SNAPSHOT/jbossesb-4.8>
     [echo] ===============================

get.jboss:

get.jbossesb:

install.jbossesb:
    [unzip] Expanding: <http://hudson.qa.jboss.com/hudson/job/RiftSaw-db2-2.1.x/ws/downloads/jboss-5.1.0.GA-jdk6.zip> into <http://hudson.qa.jboss.com/hudson/job/RiftSaw-db2-2.1.x/ws/riftsaw-2.1.2-SNAPSHOT>

BUILD FAILED
/qa/services/hudson/hudson_workspace/workspace/RiftSaw-db2-2.1.x/riftsaw-db2/qa/build.xml:97: Error while expanding <http://hudson.qa.jboss.com/hudson/job/RiftSaw-db2-2.1.x/ws/downloads/jboss-5.1.0.GA-jdk6.zip>

Total time: 10 minutes 26 seconds
Buildfile: build.xml
     [echo] ===============================
     [echo] database.......... db2
     [echo] riftsaw.version...... 2.1.2-SNAPSHOT
     [echo] riftsaw.home......... <http://hudson.qa.jboss.com/hudson/job/RiftSaw-db2-2.1.x/ws/riftsaw-2.1.2-SNAPSHOT>
     [echo] jboss.home.. <http://hudson.qa.jboss.com/hudson/job/RiftSaw-db2-2.1.x/ws/riftsaw-2.1.2-SNAPSHOT/jboss-5.1.0.GA>
     [echo] org.jboss.esb.home .. <http://hudson.qa.jboss.com/hudson/job/RiftSaw-db2-2.1.x/ws/riftsaw-2.1.2-SNAPSHOT/jbossesb-4.8>
     [echo] ===============================

unpack-riftsaw:
    [unzip] Expanding: /qa/services/hudson/hudson_workspace/workspace/RiftSaw-db2-2.1.x/riftsaw-db2/distribution/target/riftsaw-2.1.2-SNAPSHOT.zip into /qa/services/hudson/hudson_workspace/workspace/RiftSaw-db2-2.1.x/riftsaw-db2/distribution/target
     [echo] ===============================
     [echo] database.......... db2
     [echo] riftsaw.version...... 2.1.2-SNAPSHOT
     [echo] riftsaw.home......... <http://hudson.qa.jboss.com/hudson/job/RiftSaw-db2-2.1.x/ws/riftsaw-2.1.2-SNAPSHOT>
     [echo] jboss.home.. <http://hudson.qa.jboss.com/hudson/job/RiftSaw-db2-2.1.x/ws/riftsaw-2.1.2-SNAPSHOT/jboss-5.1.0.GA>
     [echo] org.jboss.esb.home .. <http://hudson.qa.jboss.com/hudson/job/RiftSaw-db2-2.1.x/ws/riftsaw-2.1.2-SNAPSHOT/jbossesb-4.8>
     [echo] ===============================

replace.jdbc.files:
     [echo] Replacing the QA's Lab jdbc files
     [copy] Copying 7 files to /qa/services/hudson/hudson_workspace/workspace/RiftSaw-db2-2.1.x/riftsaw-db2/distribution/target/riftsaw-2.1.2-SNAPSHOT/db/jdbc

drop.riftsaw.schema:
     [echo] clean the riftsaw database schema...

log.properties:
     [echo] database....... db2
     [echo] jdbc driver.... com.ibm.db2.jcc.DB2Driver
     [echo] connection url....... jdbc:db2://vmg06.mw.lab.eng.bos.redhat.com:50000/jbossqa
     [echo] username.. riftsaw

copy.ojdbc:

drop.riftsaw.schema:

BUILD FAILED
/qa/services/hudson/hudson_workspace/workspace/RiftSaw-db2-2.1.x/riftsaw-db2/qa/build.xml:188: The following error occurred while executing this line:
/qa/services/hudson/hudson_workspace/workspace/RiftSaw-db2-2.1.x/riftsaw-db2/distribution/target/riftsaw-2.1.2-SNAPSHOT/db/build.xml:81: Class Not Found: JDBC driver com.ibm.db2.jcc.DB2Driver could not be loaded

Total time: 12 seconds
[INFO] Scanning for projects...
[INFO] ------------------------------------------------------------------------
[INFO] Building RiftSaw::Integration-Tests
[INFO]    task-segment: [clean, install]
[INFO] ------------------------------------------------------------------------
[INFO] [clean:clean]
[INFO] [site:attach-descriptor]
Downloading: https://repository.jboss.org/nexus/content/repositories/deprecated//woodstox/wstx-asl/3.2.6/wstx-asl-3.2.6.pom
Downloading: https://repository.jboss.org/nexus/content/groups/developer//woodstox/wstx-asl/3.2.6/wstx-asl-3.2.6.pom
Downloading: http://repo1.maven.org/maven2/woodstox/wstx-asl/3.2.6/wstx-asl-3.2.6.pom
[INFO] [antrun:run {execution: deploy-riftsaw}]
[INFO] Executing tasks

unpack-distribution:
    [mkdir] Created dir: /qa/services/hudson/hudson_workspace/workspace/RiftSaw-db2-2.1.x/riftsaw-db2/distribution/target/dist
    [unzip] Expanding: /qa/services/hudson/hudson_workspace/workspace/RiftSaw-db2-2.1.x/riftsaw-db2/distribution/target/riftsaw-2.1.2-SNAPSHOT.zip into /qa/services/hudson/hudson_workspace/workspace/RiftSaw-db2-2.1.x/riftsaw-db2/distribution/target/dist

copy.ojdbc:

copy.db2driver:

deploy-riftsaw:

replace.jdbc.files:
     [echo] Replacing the QA's Lab jdbc files
     [copy] Copying 7 files to /qa/services/hudson/hudson_workspace/workspace/RiftSaw-db2-2.1.x/riftsaw-db2/distribution/target/dist/riftsaw-2.1.2-SNAPSHOT/db/jdbc

deploy:

internal.install.riftsaw.ws.stack:
     [echo] Replacing the Web Service Stack to native-3.2.2.GA

get.ws.stack:
    [unzip] Expanding: <http://hudson.qa.jboss.com/hudson/job/RiftSaw-db2-2.1.x/ws/downloads/jbossws-native-3.2.2.GA.zip> into /qa/services/hudson/hudson_workspace/workspace/RiftSaw-db2-2.1.x/riftsaw-db2/distribution/target/dist/riftsaw-2.1.2-SNAPSHOT/install/ws-stack/dist
     [copy] Copying 1 file to /qa/services/hudson/hudson_workspace/workspace/RiftSaw-db2-2.1.x/riftsaw-db2/distribution/target/dist/riftsaw-2.1.2-SNAPSHOT/install/ws-stack/dist/jbossws-native-bin-dist

target-jboss510:

prepare:

init:
     [echo] integration.target=jboss510

undeploy-jboss510:
[INFO] ------------------------------------------------------------------------
[ERROR] BUILD ERROR
[INFO] ------------------------------------------------------------------------
[INFO] An Ant BuildException has occured: The following error occurred while executing this line:
/qa/services/hudson/hudson_workspace/workspace/RiftSaw-db2-2.1.x/riftsaw-db2/integration-tests/build.xml:62: The following error occurred while executing this line:
/qa/services/hudson/hudson_workspace/workspace/RiftSaw-db2-2.1.x/riftsaw-db2/distribution/target/dist/riftsaw-2.1.2-SNAPSHOT/install/build.xml:56: The following error occurred while executing this line:
/qa/services/hudson/hudson_workspace/workspace/RiftSaw-db2-2.1.x/riftsaw-db2/distribution/target/dist/riftsaw-2.1.2-SNAPSHOT/install/build.xml:212: The following error occurred while executing this line:
/qa/services/hudson/hudson_workspace/workspace/RiftSaw-db2-2.1.x/riftsaw-db2/distribution/target/dist/riftsaw-2.1.2-SNAPSHOT/install/ws-stack/dist/jbossws-native-bin-dist/build/build-deploy.xml:108: Not available: <http://hudson.qa.jboss.com/hudson/job/RiftSaw-db2-2.1.x/ws/riftsaw-2.1.2-SNAPSHOT/jboss-5.1.0.GA/client/jboss-client.jar>

[INFO] ------------------------------------------------------------------------
[INFO] For more information, run Maven with the -e switch
[INFO] ------------------------------------------------------------------------
[INFO] Total time: 1 minute 12 seconds
[INFO] Finished at: Thu Sep 30 20:25:30 EDT 2010
[INFO] Final Memory: 97M/647M
[INFO] ------------------------------------------------------------------------
Buildfile: build.xml
     [echo] ===============================
     [echo] database.......... db2
     [echo] riftsaw.version...... 2.1.2-SNAPSHOT
     [echo] riftsaw.home......... <http://hudson.qa.jboss.com/hudson/job/RiftSaw-db2-2.1.x/ws/riftsaw-2.1.2-SNAPSHOT>
     [echo] jboss.home.. <http://hudson.qa.jboss.com/hudson/job/RiftSaw-db2-2.1.x/ws/riftsaw-2.1.2-SNAPSHOT/jboss-5.1.0.GA>
     [echo] org.jboss.esb.home .. <http://hudson.qa.jboss.com/hudson/job/RiftSaw-db2-2.1.x/ws/riftsaw-2.1.2-SNAPSHOT/jbossesb-4.8>
     [echo] ===============================

unpack-riftsaw:
    [unzip] Expanding: /qa/services/hudson/hudson_workspace/workspace/RiftSaw-db2-2.1.x/riftsaw-db2/distribution/target/riftsaw-2.1.2-SNAPSHOT.zip into /qa/services/hudson/hudson_workspace/workspace/RiftSaw-db2-2.1.x/riftsaw-db2/distribution/target
     [echo] ===============================
     [echo] database.......... db2
     [echo] riftsaw.version...... 2.1.2-SNAPSHOT
     [echo] riftsaw.home......... <http://hudson.qa.jboss.com/hudson/job/RiftSaw-db2-2.1.x/ws/riftsaw-2.1.2-SNAPSHOT>
     [echo] jboss.home.. <http://hudson.qa.jboss.com/hudson/job/RiftSaw-db2-2.1.x/ws/riftsaw-2.1.2-SNAPSHOT/jboss-5.1.0.GA>
     [echo] org.jboss.esb.home .. <http://hudson.qa.jboss.com/hudson/job/RiftSaw-db2-2.1.x/ws/riftsaw-2.1.2-SNAPSHOT/jbossesb-4.8>
     [echo] ===============================

replace.jdbc.files:
     [echo] Replacing the QA's Lab jdbc files
     [copy] Copying 7 files to /qa/services/hudson/hudson_workspace/workspace/RiftSaw-db2-2.1.x/riftsaw-db2/distribution/target/riftsaw-2.1.2-SNAPSHOT/db/jdbc

drop.riftsaw.schema:
     [echo] clean the riftsaw database schema...

log.properties:
     [echo] database....... db2
     [echo] jdbc driver.... com.ibm.db2.jcc.DB2Driver
     [echo] connection url....... jdbc:db2://vmg06.mw.lab.eng.bos.redhat.com:50000/jbossqa
     [echo] username.. riftsaw

copy.ojdbc:

drop.riftsaw.schema:

BUILD FAILED
/qa/services/hudson/hudson_workspace/workspace/RiftSaw-db2-2.1.x/riftsaw-db2/qa/build.xml:188: The following error occurred while executing this line:
/qa/services/hudson/hudson_workspace/workspace/RiftSaw-db2-2.1.x/riftsaw-db2/distribution/target/riftsaw-2.1.2-SNAPSHOT/db/build.xml:81: Class Not Found: JDBC driver com.ibm.db2.jcc.DB2Driver could not be loaded

Total time: 10 seconds
Recording test results
Archiving artifacts



More information about the riftsaw-commits mailing list