[teiid-designer-dev] Build failed in Jenkins: jbosstools-teiid-designer-7.5_trunk #588

jboss-qa-internal at redhat.com jboss-qa-internal at redhat.com
Tue Aug 23 08:59:03 EDT 2011


See <http://hudson.qa.jboss.com/hudson/job/jbosstools-teiid-designer-7.5_trunk/588/changes>

Changes:

[blafond] TEIIDDES-936 Fixing errors from change in Teiid's UUID class

[psrna] * added teiid test feature to the site

------------------------------------------
[...truncated 21377 lines...]
[INFO] Reactor Summary:
[INFO] 
[INFO] net.jcip.annotations .............................. SUCCESS [39.129s]
[INFO] net.sf.saxon ...................................... SUCCESS [0.615s]
[INFO] org.apache.poi .................................... SUCCESS [0.210s]
[INFO] org.jaxen ......................................... SUCCESS [0.110s]
[INFO] org.mockito ....................................... SUCCESS [0.242s]
[INFO] org.powermock ..................................... SUCCESS [1.083s]
[INFO] org.teiid.datatools.connectivity.model ............ SUCCESS [1.447s]
[INFO] org.teiid.datatools.connectivity .................. SUCCESS [0.604s]
[INFO] org.teiid.datatools.connectivity.ui ............... SUCCESS [0.818s]
[INFO] teiid_embedded_query .............................. SUCCESS [0.915s]
[INFO] org.teiid.core.designer ........................... SUCCESS [0.791s]
[INFO] org.teiid.designer ................................ SUCCESS [0.076s]
[INFO] org.teiid.designer.metamodels.diagram ............. SUCCESS [0.636s]
[INFO] org.teiid.designer.metamodels.core ................ SUCCESS [1.143s]
[INFO] org.teiid.designer.metamodels.transformation ...... SUCCESS [1.575s]
[INFO] org.teiid.designer.modeshape ...................... SUCCESS [0.299s]
[INFO] org.teiid.designer.legacy ......................... SUCCESS [2.177s]
[INFO] org.teiid.designer.extension ...................... SUCCESS [0.322s]
[INFO] org.teiid.designer.core ........................... SUCCESS [4.228s]
[INFO] org.teiid.designer.compare ........................ SUCCESS [0.560s]
[INFO] org.teiid.designer.ui.common ...................... SUCCESS [1.171s]
[INFO] org.teiid.designer.jdbc ........................... SUCCESS [0.760s]
[INFO] org.teiid.designer.metamodels.relational .......... SUCCESS [1.134s]
[INFO] org.teiid.designer.jdbc.relational ................ SUCCESS [0.651s]
[INFO] org.teiid.designer.core.xslt ...................... SUCCESS [0.288s]
[INFO] org.teiid.designer.ddl ............................ SUCCESS [0.301s]
[INFO] org.teiid.designer.metamodels.xsd ................. SUCCESS [0.618s]
[INFO] org.teiid.designer.metamodels.xml ................. SUCCESS [0.733s]
[INFO] org.teiid.designer.metamodels.xmlservice .......... SUCCESS [0.582s]
[INFO] org.teiid.designer.mapping ........................ SUCCESS [0.454s]
[INFO] org.teiid.designer.xml ............................ SUCCESS [0.452s]
[INFO] org.teiid.designer.metamodels.webservice .......... SUCCESS [0.572s]
[INFO] org.teiid.designer.metamodels.function ............ SUCCESS [0.445s]
[INFO] org.teiid.designer.udf ............................ SUCCESS [0.224s]
[INFO] org.teiid.designer.transformation ................. SUCCESS [0.966s]
[INFO] org.teiid.designer.metamodels.wsdl ................ SUCCESS [0.899s]
[INFO] org.teiid.designer.webservice ..................... SUCCESS [1.227s]
[INFO] org.teiid.designer.ui ............................. SUCCESS [3.122s]
[INFO] org.teiid.designer.compare.ui ..................... SUCCESS [0.534s]
[INFO] org.teiid.designer.datatools ...................... SUCCESS [0.406s]
[INFO] org.teiid.designer.datatools.ui ................... SUCCESS [0.558s]
[INFO] org.teiid.designer.ddl.importer ................... SUCCESS [0.349s]
[INFO] org.teiid.designer.ddl.importer.ui ................ SUCCESS [0.433s]
[INFO] org.teiid.designer.diagram.ui ..................... SUCCESS [1.872s]
[INFO] org.teiid.designer.roles .......................... SUCCESS [0.191s]
[INFO] org.teiid.designer.vdb ............................ SUCCESS [0.556s]
[INFO] org.teiid.designer.dqp ............................ SUCCESS [0.771s]
[INFO] org.teiid.designer.roles.ui ....................... SUCCESS [0.423s]
[INFO] org.teiid.designer.vdb.ui ......................... SUCCESS [0.783s]
[INFO] org.teiid.designer.query.ui ....................... SUCCESS [0.631s]
[INFO] org.teiid.designer.tools.textimport.ui ............ SUCCESS [0.416s]
[INFO] org.teiid.designer.relational.ui .................. SUCCESS [0.541s]
[INFO] org.teiid.designer.transformation.ui .............. SUCCESS [4.262s]
[INFO] org.teiid.designer.jdbc.ui ........................ SUCCESS [0.616s]
[INFO] org.teiid.designer.sdt ............................ SUCCESS [0.281s]
[INFO] org.teiid.designer.dqp.ui ......................... SUCCESS [1.308s]
[INFO] org.teiid.designer.extension.ui ................... SUCCESS [0.115s]
[INFO] org.teiid.designer.help ........................... SUCCESS [0.113s]
[INFO] org.teiid.designer.xsd ............................ SUCCESS [0.264s]
[INFO] org.teiid.designer.mapping.ui ..................... SUCCESS [1.279s]
[INFO] org.teiid.designer.metamodels.builder ............. SUCCESS [0.347s]
[INFO] org.teiid.designer.metamodels.relationship ........ SUCCESS [0.533s]
[INFO] org.teiid.designer.metamodels.builder.execution ... SUCCESS [0.384s]
[INFO] org.teiid.designer.metamodels.dependency .......... SUCCESS [0.345s]
[INFO] org.teiid.designer.metamodels.uml2 ................ SUCCESS [0.516s]
[INFO] org.teiid.designer.metamodels.xsd.ui .............. SUCCESS [0.532s]
[INFO] org.teiid.designer.modelgenerator ................. SUCCESS [0.339s]
[INFO] org.wsdl4j ........................................ SUCCESS [0.092s]
[INFO] org.teiid.designer.modelgenerator.salesforce ...... SUCCESS [0.715s]
[INFO] org.teiid.designer.modelgenerator.salesforce.ui ... SUCCESS [0.562s]
[INFO] org.teiid.designer.modelgenerator.ui .............. SUCCESS [0.360s]
[INFO] org.teiid.designer.modelgenerator.uml2 ............ SUCCESS [0.358s]
[INFO] org.teiid.designer.schema.tools ................... SUCCESS [0.465s]
[INFO] org.teiid.designer.modelgenerator.xml ............. SUCCESS [1.036s]
[INFO] org.teiid.designer.modelgenerator.wsdl ............ SUCCESS [0.609s]
[INFO] org.teiid.designer.modelgenerator.wsdl.ui ......... SUCCESS [0.562s]
[INFO] org.teiid.designer.relationship ................... SUCCESS [0.291s]
[INFO] org.teiid.designer.relationship.ui ................ SUCCESS [1.600s]
[INFO] org.teiid.designer.udf.ui ......................... SUCCESS [0.359s]
[INFO] org.teiid.designer.xml.ui ......................... SUCCESS [0.731s]
[INFO] org.teiid.designer.webservice.ui .................. SUCCESS [1.002s]
[INFO] org.teiid.designer.xsd.ui ......................... SUCCESS [0.861s]
[INFO] plugins.all ....................................... SUCCESS [0.005s]
[INFO] org.teiid.designer.feature ........................ SUCCESS [0.215s]
[INFO] org.teiid.core.designer.test.framework ............ SUCCESS [0.331s]
[INFO] org.teiid.core.designer.test ...................... FAILURE [24.477s]
[INFO] org.teiid.designer.compare.test ................... FAILURE [14.000s]
[INFO] org.teiid.designer.core.test.framework ............ SUCCESS [0.659s]
[INFO] org.teiid.designer.core.xslt.test ................. FAILURE [13.875s]
[INFO] org.teiid.designer.jdbc.test.framework ............ SUCCESS [0.367s]
[INFO] org.teiid.designer.mapping.ui.test ................ FAILURE [15.900s]
[INFO] org.teiid.designer.metamodels.core.test ........... FAILURE [13.909s]
[INFO] org.teiid.designer.metamodels.relational.test ..... FAILURE [14.083s]
[INFO] org.teiid.designer.metamodels.relationship.test ... FAILURE [14.817s]
[INFO] org.teiid.designer.metamodels.transformation.test . FAILURE [13.746s]
[INFO] org.teiid.designer.metamodels.uml2.test ........... FAILURE [14.008s]
[INFO] org.teiid.designer.metamodels.wsdl.test ........... FAILURE [13.805s]
[INFO] org.teiid.designer.metamodels.xml.test ............ FAILURE [13.843s]
[INFO] org.teiid.designer.modelgenerator.salesforce.test . FAILURE [15.102s]
[INFO] org.teiid.designer.modelgenerator.test ............ FAILURE [14.074s]
[INFO] org.teiid.designer.modelgenerator.uml2.test ....... FAILURE [14.429s]
[INFO] org.teiid.designer.modelgenerator.wsdl.test ....... FAILURE [15.464s]
[INFO] org.teiid.designer.query.ui.test .................. FAILURE [14.967s]
[INFO] org.teiid.designer.relationship.test .............. FAILURE [14.185s]
[INFO] org.teiid.designer.schema.tools.test .............. FAILURE [14.158s]
[INFO] org.teiid.designer.sdt.test ....................... FAILURE [14.111s]
[INFO] org.teiid.designer.transformation.test ............ FAILURE [14.973s]
[INFO] org.teiid.designer.ui.common.test ................. FAILURE [14.144s]
[INFO] org.teiid.designer.ui.test ........................ FAILURE [14.511s]
[INFO] org.teiid.designer.webservice.test ................ FAILURE [14.318s]
[INFO] org.teiid.designer.webservice.ui.test ............. FAILURE [15.325s]
[INFO] org.teiid.designer.xml.ui.test .................... FAILURE [15.571s]
[INFO] org.teiid.designer.xsd.ui.test .................... FAILURE [14.785s]
[INFO] org.teiid.designer.ui.bot.ext ..................... SUCCESS [0.396s]
[INFO] org.teiid.designer.ui.bot.tests ................... SUCCESS [0.823s]
[INFO] org.teiid.designer.test.feature ................... SKIPPED
[INFO] org.teiid.designer.runtime.feature ................ SUCCESS [0.107s]
[INFO] org.teiid.datatools.connectivity.feature .......... SUCCESS [0.076s]
[INFO] features.all ...................................... SUCCESS [0.011s]
[INFO] tests.all ......................................... SUCCESS [0.005s]
[INFO] teiid.site ........................................ SKIPPED
[INFO] teiid ............................................. SUCCESS [0.005s]
[INFO] ------------------------------------------------------------------------
[INFO] BUILD FAILURE
[INFO] ------------------------------------------------------------------------
[INFO] Total time: 13:36.727s
[INFO] Finished at: Tue Aug 23 08:58:21 EDT 2011
[INFO] Final Memory: 127M/515M
[INFO] ------------------------------------------------------------------------
[ERROR] Failed to execute goal org.eclipse.tycho:tycho-surefire-plugin:0.12.0:test (default-test) on project org.teiid.core.designer.test: There are test failures.
[ERROR] 
[ERROR] Please refer to <http://hudson.qa.jboss.com/hudson/job/jbosstools-teiid-designer-7.5_trunk/ws/sources/tests/org.teiid.core.designer.test/target/surefire-reports> for the individual test results.
[ERROR] -> [Help 1]
[ERROR] Failed to execute goal org.eclipse.tycho:tycho-surefire-plugin:0.12.0:test (default-test) on project org.teiid.designer.compare.test: There are test failures.
[ERROR] 
[ERROR] Please refer to <http://hudson.qa.jboss.com/hudson/job/jbosstools-teiid-designer-7.5_trunk/ws/sources/tests/org.teiid.designer.compare.test/target/surefire-reports> for the individual test results.
[ERROR] -> [Help 1]
[ERROR] Failed to execute goal org.eclipse.tycho:tycho-surefire-plugin:0.12.0:test (default-test) on project org.teiid.designer.core.xslt.test: There are test failures.
[ERROR] 
[ERROR] Please refer to <http://hudson.qa.jboss.com/hudson/job/jbosstools-teiid-designer-7.5_trunk/ws/sources/tests/org.teiid.designer.core.xslt.test/target/surefire-reports> for the individual test results.
[ERROR] -> [Help 1]
[ERROR] Failed to execute goal org.eclipse.tycho:tycho-surefire-plugin:0.12.0:test (default-test) on project org.teiid.designer.mapping.ui.test: There are test failures.
[ERROR] 
[ERROR] Please refer to <http://hudson.qa.jboss.com/hudson/job/jbosstools-teiid-designer-7.5_trunk/ws/sources/tests/org.teiid.designer.mapping.ui.test/target/surefire-reports> for the individual test results.
[ERROR] -> [Help 1]
[ERROR] Failed to execute goal org.eclipse.tycho:tycho-surefire-plugin:0.12.0:test (default-test) on project org.teiid.designer.metamodels.core.test: There are test failures.
[ERROR] 
[ERROR] Please refer to <http://hudson.qa.jboss.com/hudson/job/jbosstools-teiid-designer-7.5_trunk/ws/sources/tests/org.teiid.designer.metamodels.core.test/target/surefire-reports> for the individual test results.
[ERROR] -> [Help 1]
[ERROR] Failed to execute goal org.eclipse.tycho:tycho-surefire-plugin:0.12.0:test (default-test) on project org.teiid.designer.metamodels.relational.test: There are test failures.
[ERROR] 
[ERROR] Please refer to <http://hudson.qa.jboss.com/hudson/job/jbosstools-teiid-designer-7.5_trunk/ws/sources/tests/org.teiid.designer.metamodels.relational.test/target/surefire-reports> for the individual test results.
[ERROR] -> [Help 1]
[ERROR] Failed to execute goal org.eclipse.tycho:tycho-surefire-plugin:0.12.0:test (default-test) on project org.teiid.designer.metamodels.relationship.test: There are test failures.
[ERROR] 
[ERROR] Please refer to <http://hudson.qa.jboss.com/hudson/job/jbosstools-teiid-designer-7.5_trunk/ws/sources/tests/org.teiid.designer.metamodels.relationship.test/target/surefire-reports> for the individual test results.
[ERROR] -> [Help 1]
[ERROR] Failed to execute goal org.eclipse.tycho:tycho-surefire-plugin:0.12.0:test (default-test) on project org.teiid.designer.metamodels.transformation.test: There are test failures.
[ERROR] 
[ERROR] Please refer to <http://hudson.qa.jboss.com/hudson/job/jbosstools-teiid-designer-7.5_trunk/ws/sources/tests/org.teiid.designer.metamodels.transformation.test/target/surefire-reports> for the individual test results.
[ERROR] -> [Help 1]
[ERROR] Failed to execute goal org.eclipse.tycho:tycho-surefire-plugin:0.12.0:test (default-test) on project org.teiid.designer.metamodels.uml2.test: There are test failures.
[ERROR] 
[ERROR] Please refer to <http://hudson.qa.jboss.com/hudson/job/jbosstools-teiid-designer-7.5_trunk/ws/sources/tests/org.teiid.designer.metamodels.uml2.test/target/surefire-reports> for the individual test results.
[ERROR] -> [Help 1]
[ERROR] Failed to execute goal org.eclipse.tycho:tycho-surefire-plugin:0.12.0:test (default-test) on project org.teiid.designer.metamodels.wsdl.test: There are test failures.
[ERROR] 
[ERROR] Please refer to <http://hudson.qa.jboss.com/hudson/job/jbosstools-teiid-designer-7.5_trunk/ws/sources/tests/org.teiid.designer.metamodels.wsdl.test/target/surefire-reports> for the individual test results.
[ERROR] -> [Help 1]
[ERROR] Failed to execute goal org.eclipse.tycho:tycho-surefire-plugin:0.12.0:test (default-test) on project org.teiid.designer.metamodels.xml.test: There are test failures.
[ERROR] 
[ERROR] Please refer to <http://hudson.qa.jboss.com/hudson/job/jbosstools-teiid-designer-7.5_trunk/ws/sources/tests/org.teiid.designer.metamodels.xml.test/target/surefire-reports> for the individual test results.
[ERROR] -> [Help 1]
[ERROR] Failed to execute goal org.eclipse.tycho:tycho-surefire-plugin:0.12.0:test (default-test) on project org.teiid.designer.modelgenerator.salesforce.test: There are test failures.
[ERROR] 
[ERROR] Please refer to <http://hudson.qa.jboss.com/hudson/job/jbosstools-teiid-designer-7.5_trunk/ws/sources/tests/org.teiid.designer.modelgenerator.salesforce.test/target/surefire-reports> for the individual test results.
[ERROR] -> [Help 1]
[ERROR] Failed to execute goal org.eclipse.tycho:tycho-surefire-plugin:0.12.0:test (default-test) on project org.teiid.designer.modelgenerator.test: There are test failures.
[ERROR] 
[ERROR] Please refer to <http://hudson.qa.jboss.com/hudson/job/jbosstools-teiid-designer-7.5_trunk/ws/sources/tests/org.teiid.designer.modelgenerator.test/target/surefire-reports> for the individual test results.
[ERROR] -> [Help 1]
[ERROR] Failed to execute goal org.eclipse.tycho:tycho-surefire-plugin:0.12.0:test (default-test) on project org.teiid.designer.modelgenerator.uml2.test: There are test failures.
[ERROR] 
[ERROR] Please refer to <http://hudson.qa.jboss.com/hudson/job/jbosstools-teiid-designer-7.5_trunk/ws/sources/tests/org.teiid.designer.modelgenerator.uml2.test/target/surefire-reports> for the individual test results.
[ERROR] -> [Help 1]
[ERROR] Failed to execute goal org.eclipse.tycho:tycho-surefire-plugin:0.12.0:test (default-test) on project org.teiid.designer.modelgenerator.wsdl.test: There are test failures.
[ERROR] 
[ERROR] Please refer to <http://hudson.qa.jboss.com/hudson/job/jbosstools-teiid-designer-7.5_trunk/ws/sources/tests/org.teiid.designer.modelgenerator.wsdl.test/target/surefire-reports> for the individual test results.
[ERROR] -> [Help 1]
[ERROR] Failed to execute goal org.eclipse.tycho:tycho-surefire-plugin:0.12.0:test (default-test) on project org.teiid.designer.query.ui.test: There are test failures.
[ERROR] 
[ERROR] Please refer to <http://hudson.qa.jboss.com/hudson/job/jbosstools-teiid-designer-7.5_trunk/ws/sources/tests/org.teiid.designer.query.ui.test/target/surefire-reports> for the individual test results.
[ERROR] -> [Help 1]
[ERROR] Failed to execute goal org.eclipse.tycho:tycho-surefire-plugin:0.12.0:test (default-test) on project org.teiid.designer.relationship.test: There are test failures.
[ERROR] 
[ERROR] Please refer to <http://hudson.qa.jboss.com/hudson/job/jbosstools-teiid-designer-7.5_trunk/ws/sources/tests/org.teiid.designer.relationship.test/target/surefire-reports> for the individual test results.
[ERROR] -> [Help 1]
[ERROR] Failed to execute goal org.eclipse.tycho:tycho-surefire-plugin:0.12.0:test (default-test) on project org.teiid.designer.schema.tools.test: There are test failures.
[ERROR] 
[ERROR] Please refer to <http://hudson.qa.jboss.com/hudson/job/jbosstools-teiid-designer-7.5_trunk/ws/sources/tests/org.teiid.designer.schema.tools.test/target/surefire-reports> for the individual test results.
[ERROR] -> [Help 1]
[ERROR] Failed to execute goal org.eclipse.tycho:tycho-surefire-plugin:0.12.0:test (default-test) on project org.teiid.designer.sdt.test: There are test failures.
[ERROR] 
[ERROR] Please refer to <http://hudson.qa.jboss.com/hudson/job/jbosstools-teiid-designer-7.5_trunk/ws/sources/tests/org.teiid.designer.sdt.test/target/surefire-reports> for the individual test results.
[ERROR] -> [Help 1]
[ERROR] Failed to execute goal org.eclipse.tycho:tycho-surefire-plugin:0.12.0:test (default-test) on project org.teiid.designer.transformation.test: There are test failures.
[ERROR] 
[ERROR] Please refer to <http://hudson.qa.jboss.com/hudson/job/jbosstools-teiid-designer-7.5_trunk/ws/sources/tests/org.teiid.designer.transformation.test/target/surefire-reports> for the individual test results.
[ERROR] -> [Help 1]
[ERROR] Failed to execute goal org.eclipse.tycho:tycho-surefire-plugin:0.12.0:test (default-test) on project org.teiid.designer.ui.common.test: There are test failures.
[ERROR] 
[ERROR] Please refer to <http://hudson.qa.jboss.com/hudson/job/jbosstools-teiid-designer-7.5_trunk/ws/sources/tests/org.teiid.designer.ui.common.test/target/surefire-reports> for the individual test results.
[ERROR] -> [Help 1]
[ERROR] Failed to execute goal org.eclipse.tycho:tycho-surefire-plugin:0.12.0:test (default-test) on project org.teiid.designer.ui.test: There are test failures.
[ERROR] 
[ERROR] Please refer to <http://hudson.qa.jboss.com/hudson/job/jbosstools-teiid-designer-7.5_trunk/ws/sources/tests/org.teiid.designer.ui.test/target/surefire-reports> for the individual test results.
[ERROR] -> [Help 1]
[ERROR] Failed to execute goal org.eclipse.tycho:tycho-surefire-plugin:0.12.0:test (default-test) on project org.teiid.designer.webservice.test: There are test failures.
[ERROR] 
[ERROR] Please refer to <http://hudson.qa.jboss.com/hudson/job/jbosstools-teiid-designer-7.5_trunk/ws/sources/tests/org.teiid.designer.webservice.test/target/surefire-reports> for the individual test results.
[ERROR] -> [Help 1]
[ERROR] Failed to execute goal org.eclipse.tycho:tycho-surefire-plugin:0.12.0:test (default-test) on project org.teiid.designer.webservice.ui.test: There are test failures.
[ERROR] 
[ERROR] Please refer to <http://hudson.qa.jboss.com/hudson/job/jbosstools-teiid-designer-7.5_trunk/ws/sources/tests/org.teiid.designer.webservice.ui.test/target/surefire-reports> for the individual test results.
[ERROR] -> [Help 1]
[ERROR] Failed to execute goal org.eclipse.tycho:tycho-surefire-plugin:0.12.0:test (default-test) on project org.teiid.designer.xml.ui.test: There are test failures.
[ERROR] 
[ERROR] Please refer to <http://hudson.qa.jboss.com/hudson/job/jbosstools-teiid-designer-7.5_trunk/ws/sources/tests/org.teiid.designer.xml.ui.test/target/surefire-reports> for the individual test results.
[ERROR] -> [Help 1]
[ERROR] Failed to execute goal org.eclipse.tycho:tycho-surefire-plugin:0.12.0:test (default-test) on project org.teiid.designer.xsd.ui.test: There are test failures.
[ERROR] 
[ERROR] Please refer to <http://hudson.qa.jboss.com/hudson/job/jbosstools-teiid-designer-7.5_trunk/ws/sources/tests/org.teiid.designer.xsd.ui.test/target/surefire-reports> for the individual test results.
[ERROR] -> [Help 1]
[ERROR] 
[ERROR] To see the full stack trace of the errors, re-run Maven with the -e switch.
[ERROR] Re-run Maven using the -X switch to enable full debug logging.
[ERROR] 
[ERROR] For more information about the errors and possible solutions, please read the following articles:
[ERROR] [Help 1] http://cwiki.apache.org/confluence/display/MAVEN/MojoFailureException
[ERROR] 
[ERROR] After correcting the problems, you can resume the build with the command
[ERROR]   mvn <goals> -rf :org.teiid.core.designer.test
Terminating xvnc.
$ vncserver -kill :64
Killing Xvnc process ID 22722
Recording test results
Archiving artifacts



More information about the teiid-designer-dev mailing list