[teiid-designer-dev] Build failed in Jenkins: jbosstools-teiid-designer_trunk #755

jboss-qa-internal at redhat.com jboss-qa-internal at redhat.com
Tue Nov 1 21:49:50 EDT 2011


See <http://hudson.qa.jboss.com/hudson/job/jbosstools-teiid-designer_trunk/755/changes>

Changes:

[elvisisking] TEIIDDES-1077 Create A Model Extension Definition (MED) Eclipse Editor. Lots of fixes to enablement issues in the editor dialog's. and editor.

[blafond] TEIIDDES-1059 Add parsing or Namespace URI's + Prefixis and inclusion of XMLNAMESPACES('uri' as prefix) segment in SQL

[blafond] TEIIDDES-1059 Added description to each CP details page

------------------------------------------
[...truncated 8526 lines...]
[INFO] org.apache.poi .................................... SUCCESS [1.609s]
[INFO] org.jaxen ......................................... SUCCESS [0.780s]
[INFO] org.mockito ....................................... SUCCESS [1.439s]
[INFO] org.powermock ..................................... SUCCESS [2.573s]
[INFO] org.teiid.datatools.connectivity.model ............ SUCCESS [5.209s]
[INFO] org.teiid.datatools.connectivity .................. SUCCESS [3.631s]
[INFO] org.teiid.datatools.connectivity.ui ............... SUCCESS [4.138s]
[INFO] teiid_embedded_query .............................. SUCCESS [3.190s]
[INFO] org.teiid.core.designer ........................... SUCCESS [4.672s]
[INFO] org.teiid.designer ................................ SUCCESS [0.473s]
[INFO] org.teiid.designer.extension ...................... SUCCESS [3.110s]
[INFO] org.teiid.designer.metamodels.core ................ SUCCESS [4.912s]
[INFO] org.teiid.designer.metamodels.transformation ...... SUCCESS [6.280s]
[INFO] org.teiid.designer.modeshape ...................... SUCCESS [1.048s]
[INFO] org.teiid.designer.legacy ......................... SUCCESS [10.598s]
[INFO] org.teiid.designer.metamodels.diagram ............. SUCCESS [2.053s]
[INFO] org.teiid.designer.core ........................... SUCCESS [17.456s]
[INFO] org.teiid.designer.compare ........................ SUCCESS [2.603s]
[INFO] org.teiid.designer.metamodels.xmlservice .......... SUCCESS [2.653s]
[INFO] org.teiid.designer.metamodels.relational .......... SUCCESS [5.150s]
[INFO] org.teiid.designer.metamodels.xsd ................. SUCCESS [2.201s]
[INFO] org.teiid.designer.metamodels.xml ................. SUCCESS [3.559s]
[INFO] org.teiid.designer.metamodels.webservice .......... SUCCESS [2.916s]
[INFO] org.teiid.designer.metamodels.function ............ SUCCESS [2.139s]
[INFO] org.teiid.designer.udf ............................ SUCCESS [1.222s]
[INFO] org.teiid.designer.mapping ........................ SUCCESS [1.998s]
[INFO] org.teiid.designer.xml ............................ SUCCESS [1.717s]
[INFO] org.teiid.designer.transformation ................. SUCCESS [4.040s]
[INFO] org.teiid.designer.core.xslt ...................... SUCCESS [1.052s]
[INFO] org.teiid.designer.jdbc ........................... SUCCESS [3.322s]
[INFO] org.teiid.designer.ui.common ...................... SUCCESS [4.965s]
[INFO] org.teiid.designer.jdbc.relational ................ SUCCESS [2.474s]
[INFO] org.teiid.designer.metamodels.wsdl ................ SUCCESS [3.981s]
[INFO] org.teiid.designer.webservice ..................... SUCCESS [4.279s]
[INFO] org.teiid.designer.ddl ............................ SUCCESS [1.588s]
[INFO] org.teiid.designer.ui ............................. SUCCESS [13.562s]
[INFO] org.teiid.designer.compare.ui ..................... SUCCESS [2.452s]
[INFO] org.teiid.designer.datatools ...................... SUCCESS [1.959s]
[INFO] org.teiid.designer.datatools.ui ................... SUCCESS [2.832s]
[INFO] org.teiid.designer.ddl.importer ................... SUCCESS [1.229s]
[INFO] org.teiid.designer.ddl.importer.ui ................ SUCCESS [1.968s]
[INFO] org.teiid.designer.diagram.ui ..................... SUCCESS [8.974s]
[INFO] org.teiid.designer.roles .......................... SUCCESS [0.930s]
[INFO] org.teiid.designer.vdb ............................ SUCCESS [1.809s]
[INFO] org.teiid.designer.dqp ............................ SUCCESS [2.812s]
[INFO] org.teiid.designer.query.ui ....................... SUCCESS [3.229s]
[INFO] org.teiid.designer.sdt ............................ SUCCESS [1.484s]
[INFO] org.teiid.designer.roles.ui ....................... SUCCESS [1.811s]
[INFO] org.teiid.designer.vdb.ui ......................... SUCCESS [3.079s]
[INFO] org.teiid.designer.tools.textimport.ui ............ SUCCESS [2.109s]
[INFO] org.teiid.designer.relational ..................... SUCCESS [1.711s]
[INFO] org.teiid.designer.relational.ui .................. SUCCESS [2.765s]
[INFO] org.teiid.designer.jdbc.ui ........................ SUCCESS [3.107s]
[INFO] org.teiid.designer.transformation.ui .............. SUCCESS [9.162s]
[INFO] org.teiid.designer.dqp.ui ......................... SUCCESS [5.320s]
[INFO] org.teiid.designer.extension.ui ................... SUCCESS [3.070s]
[INFO] org.teiid.designer.help ........................... SUCCESS [0.797s]
[INFO] org.teiid.designer.xsd ............................ SUCCESS [1.444s]
[INFO] org.teiid.designer.mapping.ui ..................... SUCCESS [5.370s]
[INFO] org.teiid.designer.metamodels.builder ............. SUCCESS [1.525s]
[INFO] org.teiid.designer.metamodels.relationship ........ SUCCESS [2.884s]
[INFO] org.teiid.designer.metamodels.builder.execution ... SUCCESS [1.659s]
[INFO] org.teiid.designer.metamodels.dependency .......... SUCCESS [1.329s]
[INFO] org.teiid.designer.metamodels.uml2 ................ SUCCESS [2.629s]
[INFO] org.teiid.designer.metamodels.xsd.ui .............. SUCCESS [2.426s]
[INFO] org.teiid.designer.modelgenerator ................. SUCCESS [1.560s]
[INFO] org.wsdl4j ........................................ SUCCESS [0.602s]
[INFO] org.teiid.designer.modelgenerator.salesforce ...... SUCCESS [2.295s]
[INFO] org.teiid.designer.modelgenerator.salesforce.ui ... SUCCESS [2.740s]
[INFO] org.teiid.designer.modelgenerator.ui .............. SUCCESS [1.451s]
[INFO] org.teiid.designer.modelgenerator.uml2 ............ SUCCESS [2.156s]
[INFO] org.teiid.designer.schema.tools ................... SUCCESS [2.128s]
[INFO] org.teiid.designer.modelgenerator.xml ............. SUCCESS [3.968s]
[INFO] org.teiid.designer.modelgenerator.wsdl ............ SUCCESS [2.903s]
[INFO] org.teiid.designer.modelgenerator.wsdl.ui ......... SUCCESS [3.999s]
[INFO] org.teiid.designer.relationship ................... SUCCESS [1.703s]
[INFO] org.teiid.designer.relationship.ui ................ SUCCESS [6.475s]
[INFO] org.teiid.designer.udf.ui ......................... SUCCESS [1.594s]
[INFO] org.teiid.designer.xml.ui ......................... SUCCESS [3.178s]
[INFO] org.teiid.designer.webservice.ui .................. SUCCESS [3.991s]
[INFO] org.teiid.designer.xsd.ui ......................... SUCCESS [3.717s]
[INFO] teiid.features .................................... SUCCESS [0.030s]
[INFO] org.teiid.designer.feature ........................ SUCCESS [1.690s]
[INFO] teiid.tests ....................................... SUCCESS [0.023s]
[INFO] org.teiid.designer.schema.tools.test .............. FAILURE [19.909s]
[INFO] org.teiid.core.designer.test.framework ............ SUCCESS [1.115s]
[INFO] org.teiid.designer.metamodels.wsdl.test ........... FAILURE [19.437s]
[INFO] org.teiid.designer.mapping.ui.test ................ FAILURE [22.394s]
[INFO] org.teiid.designer.core.test.framework ............ SUCCESS [2.188s]
[INFO] org.teiid.designer.ui.bot.ext ..................... SUCCESS [1.980s]
[INFO] org.teiid.designer.query.ui.test .................. FAILURE [18.930s]
[INFO] org.teiid.designer.xsd.ui.test .................... FAILURE [19.576s]
[INFO] org.teiid.designer.modelgenerator.test ............ FAILURE [18.451s]
[INFO] org.teiid.designer.modelgenerator.salesforce.test . FAILURE [18.610s]
[INFO] org.teiid.designer.ui.common.test ................. FAILURE [18.141s]
[INFO] org.teiid.designer.sdt.test ....................... FAILURE [18.133s]
[INFO] org.teiid.designer.modelgenerator.wsdl.test ....... FAILURE [23.528s]
[INFO] org.teiid.designer.ui.bot.tests ................... SUCCESS [2.752s]
[INFO] org.teiid.designer.extension.test ................. FAILURE [17.476s]
[INFO] org.teiid.designer.metamodels.xml.test ............ FAILURE [17.965s]
[INFO] org.teiid.designer.webservice.test ................ FAILURE [19.328s]
[INFO] org.teiid.designer.compare.test ................... FAILURE [17.488s]
[INFO] org.teiid.designer.xml.ui.test .................... FAILURE [21.187s]
[INFO] org.teiid.designer.ui.test ........................ FAILURE [19.663s]
[INFO] org.teiid.designer.metamodels.core.test ........... FAILURE [17.653s]
[INFO] org.teiid.designer.jdbc.test.framework ............ SUCCESS [1.221s]
[INFO] org.teiid.designer.transformation.test ............ FAILURE [18.929s]
[INFO] org.teiid.designer.core.xslt.test ................. FAILURE [18.190s]
[INFO] org.teiid.designer.webservice.ui.test ............. FAILURE [21.837s]
[INFO] org.teiid.designer.metamodels.relationship.test ... FAILURE [19.102s]
[INFO] org.teiid.designer.metamodels.uml2.test ........... FAILURE [18.251s]
[INFO] org.teiid.designer.metamodels.transformation.test . FAILURE [17.676s]
[INFO] org.teiid.designer.metamodels.relational.test ..... FAILURE [18.158s]
[INFO] org.teiid.core.designer.test ...................... FAILURE [17.875s]
[INFO] org.teiid.designer.relationship.test .............. FAILURE [18.658s]
[INFO] org.teiid.designer.test.feature ................... SKIPPED
[INFO] org.teiid.designer.runtime.feature ................ SUCCESS [1.335s]
[INFO] org.teiid.datatools.connectivity.feature .......... SUCCESS [0.510s]
[INFO] org.teiid.designer.modelgenerator.uml2.test ....... FAILURE [18.131s]
[INFO] teiid.site ........................................ SKIPPED
[INFO] ------------------------------------------------------------------------
[INFO] BUILD FAILURE
[INFO] ------------------------------------------------------------------------
[INFO] Total time: 25:09.139s
[INFO] Finished at: Tue Nov 01 21:47:42 EDT 2011
[INFO] Final Memory: 198M/506M
[INFO] ------------------------------------------------------------------------
[ERROR] Failed to execute goal org.eclipse.tycho:tycho-surefire-plugin:0.13.0:test (default-test) on project org.teiid.designer.schema.tools.test: There are test failures.
[ERROR] 
[ERROR] Please refer to <http://hudson.qa.jboss.com/hudson/job/jbosstools-teiid-designer_trunk/ws/sources/tests/org.teiid.designer.schema.tools.test/target/surefire-reports> for the individual test results.
[ERROR] -> [Help 1]
[ERROR] Failed to execute goal org.eclipse.tycho:tycho-surefire-plugin:0.13.0:test (default-test) on project org.teiid.designer.metamodels.wsdl.test: There are test failures.
[ERROR] 
[ERROR] Please refer to <http://hudson.qa.jboss.com/hudson/job/jbosstools-teiid-designer_trunk/ws/sources/tests/org.teiid.designer.metamodels.wsdl.test/target/surefire-reports> for the individual test results.
[ERROR] -> [Help 1]
[ERROR] Failed to execute goal org.eclipse.tycho:tycho-surefire-plugin:0.13.0:test (default-test) on project org.teiid.designer.mapping.ui.test: There are test failures.
[ERROR] 
[ERROR] Please refer to <http://hudson.qa.jboss.com/hudson/job/jbosstools-teiid-designer_trunk/ws/sources/tests/org.teiid.designer.mapping.ui.test/target/surefire-reports> for the individual test results.
[ERROR] -> [Help 1]
[ERROR] Failed to execute goal org.eclipse.tycho:tycho-surefire-plugin:0.13.0:test (default-test) on project org.teiid.designer.query.ui.test: There are test failures.
[ERROR] 
[ERROR] Please refer to <http://hudson.qa.jboss.com/hudson/job/jbosstools-teiid-designer_trunk/ws/sources/tests/org.teiid.designer.query.ui.test/target/surefire-reports> for the individual test results.
[ERROR] -> [Help 1]
[ERROR] Failed to execute goal org.eclipse.tycho:tycho-surefire-plugin:0.13.0:test (default-test) on project org.teiid.designer.xsd.ui.test: There are test failures.
[ERROR] 
[ERROR] Please refer to <http://hudson.qa.jboss.com/hudson/job/jbosstools-teiid-designer_trunk/ws/sources/tests/org.teiid.designer.xsd.ui.test/target/surefire-reports> for the individual test results.
[ERROR] -> [Help 1]
[ERROR] Failed to execute goal org.eclipse.tycho:tycho-surefire-plugin:0.13.0:test (default-test) on project org.teiid.designer.modelgenerator.test: There are test failures.
[ERROR] 
[ERROR] Please refer to <http://hudson.qa.jboss.com/hudson/job/jbosstools-teiid-designer_trunk/ws/sources/tests/org.teiid.designer.modelgenerator.test/target/surefire-reports> for the individual test results.
[ERROR] -> [Help 1]
[ERROR] Failed to execute goal org.eclipse.tycho:tycho-surefire-plugin:0.13.0:test (default-test) on project org.teiid.designer.modelgenerator.salesforce.test: There are test failures.
[ERROR] 
[ERROR] Please refer to <http://hudson.qa.jboss.com/hudson/job/jbosstools-teiid-designer_trunk/ws/sources/tests/org.teiid.designer.modelgenerator.salesforce.test/target/surefire-reports> for the individual test results.
[ERROR] -> [Help 1]
[ERROR] Failed to execute goal org.eclipse.tycho:tycho-surefire-plugin:0.13.0:test (default-test) on project org.teiid.designer.ui.common.test: There are test failures.
[ERROR] 
[ERROR] Please refer to <http://hudson.qa.jboss.com/hudson/job/jbosstools-teiid-designer_trunk/ws/sources/tests/org.teiid.designer.ui.common.test/target/surefire-reports> for the individual test results.
[ERROR] -> [Help 1]
[ERROR] Failed to execute goal org.eclipse.tycho:tycho-surefire-plugin:0.13.0:test (default-test) on project org.teiid.designer.sdt.test: There are test failures.
[ERROR] 
[ERROR] Please refer to <http://hudson.qa.jboss.com/hudson/job/jbosstools-teiid-designer_trunk/ws/sources/tests/org.teiid.designer.sdt.test/target/surefire-reports> for the individual test results.
[ERROR] -> [Help 1]
[ERROR] Failed to execute goal org.eclipse.tycho:tycho-surefire-plugin:0.13.0:test (default-test) on project org.teiid.designer.modelgenerator.wsdl.test: There are test failures.
[ERROR] 
[ERROR] Please refer to <http://hudson.qa.jboss.com/hudson/job/jbosstools-teiid-designer_trunk/ws/sources/tests/org.teiid.designer.modelgenerator.wsdl.test/target/surefire-reports> for the individual test results.
[ERROR] -> [Help 1]
[ERROR] Failed to execute goal org.eclipse.tycho:tycho-surefire-plugin:0.13.0:test (default-test) on project org.teiid.designer.extension.test: There are test failures.
[ERROR] 
[ERROR] Please refer to <http://hudson.qa.jboss.com/hudson/job/jbosstools-teiid-designer_trunk/ws/sources/tests/org.teiid.designer.extension.test/target/surefire-reports> for the individual test results.
[ERROR] -> [Help 1]
[ERROR] Failed to execute goal org.eclipse.tycho:tycho-surefire-plugin:0.13.0:test (default-test) on project org.teiid.designer.metamodels.xml.test: There are test failures.
[ERROR] 
[ERROR] Please refer to <http://hudson.qa.jboss.com/hudson/job/jbosstools-teiid-designer_trunk/ws/sources/tests/org.teiid.designer.metamodels.xml.test/target/surefire-reports> for the individual test results.
[ERROR] -> [Help 1]
[ERROR] Failed to execute goal org.eclipse.tycho:tycho-surefire-plugin:0.13.0:test (default-test) on project org.teiid.designer.webservice.test: There are test failures.
[ERROR] 
[ERROR] Please refer to <http://hudson.qa.jboss.com/hudson/job/jbosstools-teiid-designer_trunk/ws/sources/tests/org.teiid.designer.webservice.test/target/surefire-reports> for the individual test results.
[ERROR] -> [Help 1]
[ERROR] Failed to execute goal org.eclipse.tycho:tycho-surefire-plugin:0.13.0:test (default-test) on project org.teiid.designer.compare.test: There are test failures.
[ERROR] 
[ERROR] Please refer to <http://hudson.qa.jboss.com/hudson/job/jbosstools-teiid-designer_trunk/ws/sources/tests/org.teiid.designer.compare.test/target/surefire-reports> for the individual test results.
[ERROR] -> [Help 1]
[ERROR] Failed to execute goal org.eclipse.tycho:tycho-surefire-plugin:0.13.0:test (default-test) on project org.teiid.designer.xml.ui.test: There are test failures.
[ERROR] 
[ERROR] Please refer to <http://hudson.qa.jboss.com/hudson/job/jbosstools-teiid-designer_trunk/ws/sources/tests/org.teiid.designer.xml.ui.test/target/surefire-reports> for the individual test results.
[ERROR] -> [Help 1]
[ERROR] Failed to execute goal org.eclipse.tycho:tycho-surefire-plugin:0.13.0:test (default-test) on project org.teiid.designer.ui.test: There are test failures.
[ERROR] 
[ERROR] Please refer to <http://hudson.qa.jboss.com/hudson/job/jbosstools-teiid-designer_trunk/ws/sources/tests/org.teiid.designer.ui.test/target/surefire-reports> for the individual test results.
[ERROR] -> [Help 1]
[ERROR] Failed to execute goal org.eclipse.tycho:tycho-surefire-plugin:0.13.0:test (default-test) on project org.teiid.designer.metamodels.core.test: There are test failures.
[ERROR] 
[ERROR] Please refer to <http://hudson.qa.jboss.com/hudson/job/jbosstools-teiid-designer_trunk/ws/sources/tests/org.teiid.designer.metamodels.core.test/target/surefire-reports> for the individual test results.
[ERROR] -> [Help 1]
[ERROR] Failed to execute goal org.eclipse.tycho:tycho-surefire-plugin:0.13.0:test (default-test) on project org.teiid.designer.transformation.test: There are test failures.
[ERROR] 
[ERROR] Please refer to <http://hudson.qa.jboss.com/hudson/job/jbosstools-teiid-designer_trunk/ws/sources/tests/org.teiid.designer.transformation.test/target/surefire-reports> for the individual test results.
[ERROR] -> [Help 1]
[ERROR] Failed to execute goal org.eclipse.tycho:tycho-surefire-plugin:0.13.0:test (default-test) on project org.teiid.designer.core.xslt.test: There are test failures.
[ERROR] 
[ERROR] Please refer to <http://hudson.qa.jboss.com/hudson/job/jbosstools-teiid-designer_trunk/ws/sources/tests/org.teiid.designer.core.xslt.test/target/surefire-reports> for the individual test results.
[ERROR] -> [Help 1]
[ERROR] Failed to execute goal org.eclipse.tycho:tycho-surefire-plugin:0.13.0:test (default-test) on project org.teiid.designer.webservice.ui.test: There are test failures.
[ERROR] 
[ERROR] Please refer to <http://hudson.qa.jboss.com/hudson/job/jbosstools-teiid-designer_trunk/ws/sources/tests/org.teiid.designer.webservice.ui.test/target/surefire-reports> for the individual test results.
[ERROR] -> [Help 1]
[ERROR] Failed to execute goal org.eclipse.tycho:tycho-surefire-plugin:0.13.0:test (default-test) on project org.teiid.designer.metamodels.relationship.test: There are test failures.
[ERROR] 
[ERROR] Please refer to <http://hudson.qa.jboss.com/hudson/job/jbosstools-teiid-designer_trunk/ws/sources/tests/org.teiid.designer.metamodels.relationship.test/target/surefire-reports> for the individual test results.
[ERROR] -> [Help 1]
[ERROR] Failed to execute goal org.eclipse.tycho:tycho-surefire-plugin:0.13.0:test (default-test) on project org.teiid.designer.metamodels.uml2.test: There are test failures.
[ERROR] 
[ERROR] Please refer to <http://hudson.qa.jboss.com/hudson/job/jbosstools-teiid-designer_trunk/ws/sources/tests/org.teiid.designer.metamodels.uml2.test/target/surefire-reports> for the individual test results.
[ERROR] -> [Help 1]
[ERROR] Failed to execute goal org.eclipse.tycho:tycho-surefire-plugin:0.13.0:test (default-test) on project org.teiid.designer.metamodels.transformation.test: There are test failures.
[ERROR] 
[ERROR] Please refer to <http://hudson.qa.jboss.com/hudson/job/jbosstools-teiid-designer_trunk/ws/sources/tests/org.teiid.designer.metamodels.transformation.test/target/surefire-reports> for the individual test results.
[ERROR] -> [Help 1]
[ERROR] Failed to execute goal org.eclipse.tycho:tycho-surefire-plugin:0.13.0:test (default-test) on project org.teiid.designer.metamodels.relational.test: There are test failures.
[ERROR] 
[ERROR] Please refer to <http://hudson.qa.jboss.com/hudson/job/jbosstools-teiid-designer_trunk/ws/sources/tests/org.teiid.designer.metamodels.relational.test/target/surefire-reports> for the individual test results.
[ERROR] -> [Help 1]
[ERROR] Failed to execute goal org.eclipse.tycho:tycho-surefire-plugin:0.13.0:test (default-test) on project org.teiid.core.designer.test: There are test failures.
[ERROR] 
[ERROR] Please refer to <http://hudson.qa.jboss.com/hudson/job/jbosstools-teiid-designer_trunk/ws/sources/tests/org.teiid.core.designer.test/target/surefire-reports> for the individual test results.
[ERROR] -> [Help 1]
[ERROR] Failed to execute goal org.eclipse.tycho:tycho-surefire-plugin:0.13.0:test (default-test) on project org.teiid.designer.relationship.test: There are test failures.
[ERROR] 
[ERROR] Please refer to <http://hudson.qa.jboss.com/hudson/job/jbosstools-teiid-designer_trunk/ws/sources/tests/org.teiid.designer.relationship.test/target/surefire-reports> for the individual test results.
[ERROR] -> [Help 1]
[ERROR] Failed to execute goal org.eclipse.tycho:tycho-surefire-plugin:0.13.0:test (default-test) on project org.teiid.designer.modelgenerator.uml2.test: There are test failures.
[ERROR] 
[ERROR] Please refer to <http://hudson.qa.jboss.com/hudson/job/jbosstools-teiid-designer_trunk/ws/sources/tests/org.teiid.designer.modelgenerator.uml2.test/target/surefire-reports> for the individual test results.
[ERROR] -> [Help 1]
[ERROR] 
[ERROR] To see the full stack trace of the errors, re-run Maven with the -e switch.
[ERROR] Re-run Maven using the -X switch to enable full debug logging.
[ERROR] 
[ERROR] For more information about the errors and possible solutions, please read the following articles:
[ERROR] [Help 1] http://cwiki.apache.org/confluence/display/MAVEN/MojoFailureException
[ERROR] 
[ERROR] After correcting the problems, you can resume the build with the command
[ERROR]   mvn <goals> -rf :org.teiid.designer.schema.tools.test
Terminating xvnc.
$ vncserver -kill :91
Killing Xvnc process ID 8366
Archiving artifacts
Recording test results



More information about the teiid-designer-dev mailing list