[teiid-designer-dev] Build failed in Jenkins: jbosstools-teiid-designer_trunk #1133

jboss-qa-internal at redhat.com jboss-qa-internal at redhat.com
Mon Apr 16 07:07:11 EDT 2012


See <http://hudson.qa.jboss.com/hudson/job/jbosstools-teiid-designer_trunk/1133/>

------------------------------------------
[...truncated 6878 lines...]
[INFO] --- tycho-p2-plugin:0.14.1:feature-p2-metadata (default-feature-p2-metadata) @ org.teiid.designer.runtime.feature ---
[WARNING] <http://hudson.qa.jboss.com/hudson/job/jbosstools-teiid-designer_trunk/ws/sources/features/org.teiid.designer.runtime.feature/target/site> does not exist or is not a directory
[INFO] 
[INFO] --- maven-install-plugin:2.3.1:install (default-install) @ org.teiid.designer.runtime.feature ---
[INFO] Installing <http://hudson.qa.jboss.com/hudson/job/jbosstools-teiid-designer_trunk/1133/artifact/sources/features/org.teiid.designer.runtime.feature/target/org.teiid.designer.runtime.feature-7.7.0-SNAPSHOT.jar> to <http://hudson.qa.jboss.com/hudson/job/jbosstools-teiid-designer_trunk/1133/artifact/m2-repository/org/jboss/tools/org.teiid.designer.runtime.feature/7.7.0-SNAPSHOT/org.teiid.designer.runtime.feature-7.7.0-SNAPSHOT.jar>
[INFO] Installing <http://hudson.qa.jboss.com/hudson/job/jbosstools-teiid-designer_trunk/ws/sources/features/org.teiid.designer.runtime.feature/pom.xml> to <http://hudson.qa.jboss.com/hudson/job/jbosstools-teiid-designer_trunk/ws/m2-repository/org/jboss/tools/org.teiid.designer.runtime.feature/7.7.0-SNAPSHOT/org.teiid.designer.runtime.feature-7.7.0-SNAPSHOT.pom>
[INFO] Installing <http://hudson.qa.jboss.com/hudson/job/jbosstools-teiid-designer_trunk/ws/sources/features/org.teiid.designer.runtime.feature/target/p2content.xml> to <http://hudson.qa.jboss.com/hudson/job/jbosstools-teiid-designer_trunk/ws/m2-repository/org/jboss/tools/org.teiid.designer.runtime.feature/7.7.0-SNAPSHOT/org.teiid.designer.runtime.feature-7.7.0-SNAPSHOT-p2metadata.xml>
[INFO] Installing <http://hudson.qa.jboss.com/hudson/job/jbosstools-teiid-designer_trunk/ws/sources/features/org.teiid.designer.runtime.feature/target/p2artifacts.xml> to <http://hudson.qa.jboss.com/hudson/job/jbosstools-teiid-designer_trunk/ws/m2-repository/org/jboss/tools/org.teiid.designer.runtime.feature/7.7.0-SNAPSHOT/org.teiid.designer.runtime.feature-7.7.0-SNAPSHOT-p2artifacts.xml>
[INFO] 
[INFO] --- tycho-p2-plugin:0.14.1:update-local-index (default-update-local-index) @ org.teiid.designer.runtime.feature ---
[INFO]                                                                         
[INFO] ------------------------------------------------------------------------
[INFO] Building org.teiid.datatools.connectivity.feature 7.7.0-SNAPSHOT
[INFO] ------------------------------------------------------------------------
[INFO] 
[INFO] --- maven-clean-plugin:2.4.1:clean (default-clean) @ org.teiid.datatools.connectivity.feature ---
[INFO] Deleting <http://hudson.qa.jboss.com/hudson/job/jbosstools-teiid-designer_trunk/ws/sources/features/org.teiid.datatools.connectivity.feature/target>
[INFO] 
[INFO] --- tycho-packaging-plugin:0.14.1:build-qualifier (default-build-qualifier) @ org.teiid.datatools.connectivity.feature ---
[INFO] 
[INFO] --- tycho-packaging-plugin:0.14.1:validate-id (default-validate-id) @ org.teiid.datatools.connectivity.feature ---
[INFO] 
[INFO] --- tycho-packaging-plugin:0.14.1:validate-version (default-validate-version) @ org.teiid.datatools.connectivity.feature ---
[INFO] 
[INFO] --- jacoco-maven-plugin:0.5.7-SNAPSHOT:prepare-agent (default) @ org.teiid.datatools.connectivity.feature ---
[INFO] argLine set to -javaagent:<http://hudson.qa.jboss.com/hudson/job/jbosstools-teiid-designer_trunk/ws/m2-repository/org/jacoco/org.jacoco.agent/0.5.7-SNAPSHOT/org.jacoco.agent-0.5.7-SNAPSHOT-runtime.jar=destfile=/mnt/hudson_workspace/workspace/jbosstools-teiid-designer_trunk/sources/features/target/jacoco.exec,append=true,includes=org.jboss.tools.*>
[INFO] 
[INFO] --- tycho-source-plugin:0.14.1:plugin-source (plugin-source) @ org.teiid.datatools.connectivity.feature ---
[INFO] 
[INFO] --- tycho-packaging-plugin:0.14.1:package-feature (default-package-feature) @ org.teiid.datatools.connectivity.feature ---
[INFO] Building jar: <http://hudson.qa.jboss.com/hudson/job/jbosstools-teiid-designer_trunk/1133/artifact/sources/features/org.teiid.datatools.connectivity.feature/target/org.teiid.datatools.connectivity.feature-7.7.0-SNAPSHOT.jar>
[INFO] 
[INFO] --- tycho-p2-plugin:0.14.1:p2-metadata (default-p2-metadata) @ org.teiid.datatools.connectivity.feature ---
[INFO] 
[INFO] --- tycho-p2-plugin:0.14.1:feature-p2-metadata (default-feature-p2-metadata) @ org.teiid.datatools.connectivity.feature ---
[WARNING] <http://hudson.qa.jboss.com/hudson/job/jbosstools-teiid-designer_trunk/ws/sources/features/org.teiid.datatools.connectivity.feature/target/site> does not exist or is not a directory
[INFO] 
[INFO] --- maven-install-plugin:2.3.1:install (default-install) @ org.teiid.datatools.connectivity.feature ---
[INFO] Installing <http://hudson.qa.jboss.com/hudson/job/jbosstools-teiid-designer_trunk/1133/artifact/sources/features/org.teiid.datatools.connectivity.feature/target/org.teiid.datatools.connectivity.feature-7.7.0-SNAPSHOT.jar> to <http://hudson.qa.jboss.com/hudson/job/jbosstools-teiid-designer_trunk/1133/artifact/m2-repository/org/jboss/tools/org.teiid.datatools.connectivity.feature/7.7.0-SNAPSHOT/org.teiid.datatools.connectivity.feature-7.7.0-SNAPSHOT.jar>
[INFO] Installing <http://hudson.qa.jboss.com/hudson/job/jbosstools-teiid-designer_trunk/ws/sources/features/org.teiid.datatools.connectivity.feature/pom.xml> to <http://hudson.qa.jboss.com/hudson/job/jbosstools-teiid-designer_trunk/ws/m2-repository/org/jboss/tools/org.teiid.datatools.connectivity.feature/7.7.0-SNAPSHOT/org.teiid.datatools.connectivity.feature-7.7.0-SNAPSHOT.pom>
[INFO] Installing <http://hudson.qa.jboss.com/hudson/job/jbosstools-teiid-designer_trunk/ws/sources/features/org.teiid.datatools.connectivity.feature/target/p2content.xml> to <http://hudson.qa.jboss.com/hudson/job/jbosstools-teiid-designer_trunk/ws/m2-repository/org/jboss/tools/org.teiid.datatools.connectivity.feature/7.7.0-SNAPSHOT/org.teiid.datatools.connectivity.feature-7.7.0-SNAPSHOT-p2metadata.xml>
[INFO] Installing <http://hudson.qa.jboss.com/hudson/job/jbosstools-teiid-designer_trunk/ws/sources/features/org.teiid.datatools.connectivity.feature/target/p2artifacts.xml> to <http://hudson.qa.jboss.com/hudson/job/jbosstools-teiid-designer_trunk/ws/m2-repository/org/jboss/tools/org.teiid.datatools.connectivity.feature/7.7.0-SNAPSHOT/org.teiid.datatools.connectivity.feature-7.7.0-SNAPSHOT-p2artifacts.xml>
[INFO] 
[INFO] --- tycho-p2-plugin:0.14.1:update-local-index (default-update-local-index) @ org.teiid.datatools.connectivity.feature ---
[INFO]                                                                         
[INFO] ------------------------------------------------------------------------
[INFO] Building org.teiid.designer.modelgenerator.uml2.test 7.6.0-SNAPSHOT
[INFO] ------------------------------------------------------------------------
[INFO] 
[INFO] --- maven-clean-plugin:2.4.1:clean (default-clean) @ org.teiid.designer.modelgenerator.uml2.test ---
[INFO] Deleting <http://hudson.qa.jboss.com/hudson/job/jbosstools-teiid-designer_trunk/ws/sources/tests/org.teiid.designer.modelgenerator.uml2.test/target>
[INFO] 
[INFO] --- tycho-packaging-plugin:0.14.1:build-qualifier (default-build-qualifier) @ org.teiid.designer.modelgenerator.uml2.test ---
[INFO] 
[INFO] --- tycho-packaging-plugin:0.14.1:validate-id (default-validate-id) @ org.teiid.designer.modelgenerator.uml2.test ---
[INFO] 
[INFO] --- tycho-packaging-plugin:0.14.1:validate-version (default-validate-version) @ org.teiid.designer.modelgenerator.uml2.test ---
[INFO] 
[INFO] --- jacoco-maven-plugin:0.5.7-SNAPSHOT:prepare-agent (default) @ org.teiid.designer.modelgenerator.uml2.test ---
[INFO] tycho.testArgLine set to -javaagent:<http://hudson.qa.jboss.com/hudson/job/jbosstools-teiid-designer_trunk/ws/m2-repository/org/jacoco/org.jacoco.agent/0.5.7-SNAPSHOT/org.jacoco.agent-0.5.7-SNAPSHOT-runtime.jar=destfile=/mnt/hudson_workspace/workspace/jbosstools-teiid-designer_trunk/sources/tests/target/jacoco.exec,append=true,includes=org.jboss.tools.*>
[INFO] 
[INFO] --- maven-resources-plugin:2.4.1:resources (default-resources) @ org.teiid.designer.modelgenerator.uml2.test ---
[INFO] Using 'ISO-8859-1' encoding to copy filtered resources.
[INFO] skip non existing resourceDirectory <http://hudson.qa.jboss.com/hudson/job/jbosstools-teiid-designer_trunk/ws/sources/tests/org.teiid.designer.modelgenerator.uml2.test/src/main/resources>
[INFO] 
[INFO] --- tycho-compiler-plugin:0.14.1:compile (default-compile) @ org.teiid.designer.modelgenerator.uml2.test ---
[INFO] Compiling 7 source files to <http://hudson.qa.jboss.com/hudson/job/jbosstools-teiid-designer_trunk/ws/sources/tests/org.teiid.designer.modelgenerator.uml2.test/target/classes>
[INFO] 
[INFO] --- maven-resources-plugin:2.4.1:testResources (default-testResources) @ org.teiid.designer.modelgenerator.uml2.test ---
[INFO] Using 'ISO-8859-1' encoding to copy filtered resources.
[INFO] skip non existing resourceDirectory <http://hudson.qa.jboss.com/hudson/job/jbosstools-teiid-designer_trunk/ws/sources/tests/org.teiid.designer.modelgenerator.uml2.test/src/test/resources>
[INFO] 
[INFO] --- tycho-compiler-plugin:0.14.1:testCompile (default-testCompile) @ org.teiid.designer.modelgenerator.uml2.test ---
[INFO] Nothing to compile - all classes are up to date
[INFO] 
[INFO] --- tycho-source-plugin:0.14.1:plugin-source (plugin-source) @ org.teiid.designer.modelgenerator.uml2.test ---
[INFO] Building jar: <http://hudson.qa.jboss.com/hudson/job/jbosstools-teiid-designer_trunk/1133/artifact/sources/tests/org.teiid.designer.modelgenerator.uml2.test/target/org.teiid.designer.modelgenerator.uml2.test-7.6.0-SNAPSHOT-sources.jar>
[INFO] 
[INFO] --- tycho-packaging-plugin:0.14.1:package-plugin (default-package-plugin) @ org.teiid.designer.modelgenerator.uml2.test ---
[INFO] Building jar: <http://hudson.qa.jboss.com/hudson/job/jbosstools-teiid-designer_trunk/1133/artifact/sources/tests/org.teiid.designer.modelgenerator.uml2.test/target/org.teiid.designer.modelgenerator.uml2.test-7.6.0-SNAPSHOT.jar>
[INFO] 
[INFO] --- tycho-p2-plugin:0.14.1:p2-metadata (default-p2-metadata) @ org.teiid.designer.modelgenerator.uml2.test ---
[INFO] 
[INFO] --- tycho-surefire-plugin:0.14.1:test (default-test) @ org.teiid.designer.modelgenerator.uml2.test ---
[INFO] Skipping tests
[INFO] 
[INFO] --- maven-install-plugin:2.3.1:install (default-install) @ org.teiid.designer.modelgenerator.uml2.test ---
[INFO] Installing <http://hudson.qa.jboss.com/hudson/job/jbosstools-teiid-designer_trunk/1133/artifact/sources/tests/org.teiid.designer.modelgenerator.uml2.test/target/org.teiid.designer.modelgenerator.uml2.test-7.6.0-SNAPSHOT.jar> to <http://hudson.qa.jboss.com/hudson/job/jbosstools-teiid-designer_trunk/1133/artifact/m2-repository/org/jboss/tools/org.teiid.designer.modelgenerator.uml2.test/7.6.0-SNAPSHOT/org.teiid.designer.modelgenerator.uml2.test-7.6.0-SNAPSHOT.jar>
[INFO] Installing <http://hudson.qa.jboss.com/hudson/job/jbosstools-teiid-designer_trunk/ws/sources/tests/org.teiid.designer.modelgenerator.uml2.test/pom.xml> to <http://hudson.qa.jboss.com/hudson/job/jbosstools-teiid-designer_trunk/ws/m2-repository/org/jboss/tools/org.teiid.designer.modelgenerator.uml2.test/7.6.0-SNAPSHOT/org.teiid.designer.modelgenerator.uml2.test-7.6.0-SNAPSHOT.pom>
[INFO] Installing <http://hudson.qa.jboss.com/hudson/job/jbosstools-teiid-designer_trunk/1133/artifact/sources/tests/org.teiid.designer.modelgenerator.uml2.test/target/org.teiid.designer.modelgenerator.uml2.test-7.6.0-SNAPSHOT-sources.jar> to <http://hudson.qa.jboss.com/hudson/job/jbosstools-teiid-designer_trunk/1133/artifact/m2-repository/org/jboss/tools/org.teiid.designer.modelgenerator.uml2.test/7.6.0-SNAPSHOT/org.teiid.designer.modelgenerator.uml2.test-7.6.0-SNAPSHOT-sources.jar>
[INFO] Installing <http://hudson.qa.jboss.com/hudson/job/jbosstools-teiid-designer_trunk/ws/sources/tests/org.teiid.designer.modelgenerator.uml2.test/target/p2content.xml> to <http://hudson.qa.jboss.com/hudson/job/jbosstools-teiid-designer_trunk/ws/m2-repository/org/jboss/tools/org.teiid.designer.modelgenerator.uml2.test/7.6.0-SNAPSHOT/org.teiid.designer.modelgenerator.uml2.test-7.6.0-SNAPSHOT-p2metadata.xml>
[INFO] Installing <http://hudson.qa.jboss.com/hudson/job/jbosstools-teiid-designer_trunk/ws/sources/tests/org.teiid.designer.modelgenerator.uml2.test/target/p2artifacts.xml> to <http://hudson.qa.jboss.com/hudson/job/jbosstools-teiid-designer_trunk/ws/m2-repository/org/jboss/tools/org.teiid.designer.modelgenerator.uml2.test/7.6.0-SNAPSHOT/org.teiid.designer.modelgenerator.uml2.test-7.6.0-SNAPSHOT-p2artifacts.xml>
[INFO] 
[INFO] --- tycho-p2-plugin:0.14.1:update-local-index (default-update-local-index) @ org.teiid.designer.modelgenerator.uml2.test ---
[INFO]                                                                         
[INFO] ------------------------------------------------------------------------
[INFO] Skipping teiid.site
[INFO] This project has been banned from the build due to previous failures.
[INFO] ------------------------------------------------------------------------
[INFO] ------------------------------------------------------------------------
[INFO] Reactor Summary:
[INFO] 
[INFO] teiid.all ......................................... SUCCESS [5.591s]
[INFO] teiid.plugins ..................................... SUCCESS [0.039s]
[INFO] net.jcip.annotations .............................. SUCCESS [1.778s]
[INFO] net.sf.saxon ...................................... SUCCESS [2.962s]
[INFO] org.apache.poi .................................... SUCCESS [0.982s]
[INFO] org.jaxen ......................................... SUCCESS [0.743s]
[INFO] org.mockito ....................................... SUCCESS [1.386s]
[INFO] org.powermock ..................................... SUCCESS [2.410s]
[INFO] org.teiid.datatools.connectivity.model ............ SUCCESS [4.746s]
[INFO] org.teiid.datatools.connectivity .................. SUCCESS [4.491s]
[INFO] org.teiid.datatools.connectivity.ui ............... SUCCESS [5.063s]
[INFO] teiid_embedded_query .............................. SUCCESS [1.144s]
[INFO] org.teiid.core.designer ........................... SUCCESS [4.170s]
[INFO] org.teiid.designer ................................ SUCCESS [0.355s]
[INFO] org.teiid.designer.modeshape ...................... SUCCESS [0.950s]
[INFO] org.teiid.designer.legacy ......................... SUCCESS [9.288s]
[INFO] org.teiid.designer.metamodels.diagram ............. SUCCESS [1.825s]
[INFO] org.teiid.designer.metamodels.core ................ SUCCESS [3.482s]
[INFO] org.teiid.designer.metamodels.transformation ...... SUCCESS [4.071s]
[INFO] org.teiid.designer.extension ...................... SUCCESS [2.296s]
[INFO] org.teiid.designer.core ........................... SUCCESS [16.345s]
[INFO] org.teiid.designer.ui.common ...................... SUCCESS [6.258s]
[INFO] org.teiid.designer.compare ........................ SUCCESS [2.320s]
[INFO] org.teiid.designer.core.xslt ...................... SUCCESS [0.975s]
[INFO] org.teiid.designer.metamodels.relational .......... SUCCESS [4.887s]
[INFO] org.teiid.designer.ddl ............................ SUCCESS [1.475s]
[INFO] org.teiid.designer.jdbc ........................... SUCCESS [2.765s]
[INFO] org.teiid.designer.jdbc.relational ................ SUCCESS [3.449s]
[INFO] org.teiid.designer.metamodels.xsd ................. SUCCESS [2.127s]
[INFO] org.teiid.designer.metamodels.xml ................. SUCCESS [2.835s]
[INFO] org.teiid.designer.mapping ........................ SUCCESS [1.677s]
[INFO] org.teiid.designer.metamodels.function ............ SUCCESS [2.130s]
[INFO] org.teiid.designer.metamodels.webservice .......... SUCCESS [2.407s]
[INFO] org.teiid.designer.metamodels.wsdl ................ SUCCESS [3.783s]
[INFO] org.teiid.designer.metamodels.xmlservice .......... SUCCESS [2.198s]
[INFO] org.teiid.designer.relational ..................... SUCCESS [1.253s]
[INFO] org.teiid.designer.xml ............................ SUCCESS [1.519s]
[INFO] org.teiid.designer.udf ............................ SUCCESS [1.123s]
[INFO] org.teiid.designer.transformation ................. SUCCESS [3.472s]
[INFO] org.teiid.designer.webservice ..................... SUCCESS [3.206s]
[INFO] org.teiid.designer.ui ............................. SUCCESS [15.130s]
[INFO] org.teiid.designer.datatools ...................... SUCCESS [2.641s]
[INFO] org.teiid.designer.datatools.ui ................... SUCCESS [2.609s]
[INFO] org.teiid.designer.roles .......................... SUCCESS [1.694s]
[INFO] org.teiid.designer.vdb ............................ SUCCESS [2.073s]
[INFO] org.teiid.designer.dqp ............................ SUCCESS [3.328s]
[INFO] org.teiid.designer.compare.ui ..................... SUCCESS [2.273s]
[INFO] org.teiid.designer.diagram.ui ..................... SUCCESS [10.826s]
[INFO] org.teiid.designer.roles.ui ....................... SUCCESS [2.331s]
[INFO] org.teiid.designer.vdb.ui ......................... SUCCESS [3.143s]
[INFO] org.teiid.designer.query.ui ....................... SUCCESS [4.539s]
[INFO] org.teiid.designer.tools.textimport.ui ............ SUCCESS [2.665s]
[INFO] org.teiid.designer.relational.ui .................. SUCCESS [4.539s]
[INFO] org.teiid.designer.transformation.ui .............. SUCCESS [11.799s]
[INFO] org.teiid.designer.jdbc.ui ........................ SUCCESS [4.167s]
[INFO] org.teiid.designer.sdt ............................ SUCCESS [2.441s]
[INFO] org.teiid.designer.dqp.ui ......................... SUCCESS [7.142s]
[INFO] org.teiid.designer.advisor.ui ..................... SUCCESS [6.773s]
[INFO] org.teiid.designer.ddl.importer ................... SUCCESS [1.952s]
[INFO] org.teiid.designer.ddl.importer.ui ................ SUCCESS [2.510s]
[INFO] org.teiid.designer.extension.ui ................... SUCCESS [4.867s]
[INFO] org.teiid.designer.help ........................... SUCCESS [1.144s]
[INFO] org.teiid.designer.xsd ............................ SUCCESS [2.204s]
[INFO] org.teiid.designer.mapping.ui ..................... SUCCESS [8.674s]
[INFO] org.teiid.designer.metamodels.builder ............. SUCCESS [4.282s]
[INFO] org.teiid.designer.metamodels.relationship ........ SUCCESS [3.685s]
[INFO] org.teiid.designer.metamodels.builder.execution ... SUCCESS [1.856s]
[INFO] org.teiid.designer.metamodels.dependency .......... SUCCESS [1.541s]
[INFO] org.teiid.designer.metamodels.uml2 ................ SUCCESS [3.271s]
[INFO] org.teiid.designer.metamodels.xsd.ui .............. SUCCESS [2.858s]
[INFO] org.teiid.designer.modelgenerator ................. SUCCESS [1.483s]
[INFO] org.wsdl4j ........................................ SUCCESS [0.750s]
[INFO] org.teiid.designer.modelgenerator.salesforce ...... SUCCESS [3.128s]
[INFO] org.teiid.designer.modelgenerator.salesforce.ui ... SUCCESS [2.708s]
[INFO] org.teiid.designer.modelgenerator.ui .............. SUCCESS [1.599s]
[INFO] org.teiid.designer.modelgenerator.uml2 ............ SUCCESS [1.830s]
[INFO] org.teiid.designer.schema.tools ................... SUCCESS [2.363s]
[INFO] org.teiid.designer.modelgenerator.xml ............. SUCCESS [3.902s]
[INFO] org.teiid.designer.modelgenerator.wsdl ............ SUCCESS [3.167s]
[INFO] org.teiid.designer.xsd.ui ......................... SUCCESS [4.076s]
[INFO] org.teiid.designer.modelgenerator.wsdl.ui ......... SUCCESS [4.009s]
[INFO] org.teiid.designer.relationship ................... SUCCESS [1.688s]
[INFO] org.teiid.designer.relationship.ui ................ SUCCESS [7.955s]
[INFO] org.teiid.designer.udf.ui ......................... SUCCESS [1.940s]
[INFO] org.teiid.designer.xml.ui ......................... SUCCESS [3.613s]
[INFO] org.teiid.designer.webservice.ui .................. SUCCESS [4.678s]
[INFO] teiid.features .................................... SUCCESS [0.042s]
[INFO] org.teiid.designer.feature ........................ SUCCESS [1.316s]
[INFO] teiid.tests ....................................... SUCCESS [0.138s]
[INFO] org.teiid.core.designer.test.framework ............ SUCCESS [1.380s]
[INFO] org.teiid.core.designer.test ...................... SUCCESS [3.530s]
[INFO] org.teiid.designer.compare.test ................... SUCCESS [1.626s]
[INFO] org.teiid.designer.core.test.framework ............ SUCCESS [3.377s]
[INFO] org.teiid.designer.core.xslt.test ................. SUCCESS [1.607s]
[INFO] org.teiid.designer.extension.test ................. SUCCESS [1.768s]
[INFO] org.teiid.designer.jdbc.test.framework ............ SUCCESS [1.351s]
[INFO] org.teiid.designer.mapping.ui.test ................ SUCCESS [1.699s]
[INFO] org.teiid.designer.metamodels.core.test ........... SUCCESS [1.700s]
[INFO] org.teiid.designer.metamodels.relational.test ..... SUCCESS [2.553s]
[INFO] org.teiid.designer.metamodels.relationship.test ... SUCCESS [2.120s]
[INFO] org.teiid.designer.metamodels.transformation.test . SUCCESS [2.178s]
[INFO] org.teiid.designer.metamodels.uml2.test ........... SUCCESS [1.762s]
[INFO] org.teiid.designer.metamodels.wsdl.test ........... SUCCESS [2.170s]
[INFO] org.teiid.designer.metamodels.xml.test ............ SUCCESS [2.086s]
[INFO] org.teiid.designer.modelgenerator.salesforce.test . SUCCESS [4.642s]
[INFO] org.teiid.designer.modelgenerator.test ............ SUCCESS [1.457s]
[INFO] org.teiid.designer.modelgenerator.wsdl.test ....... SUCCESS [7.170s]
[INFO] org.teiid.designer.query.ui.test .................. SUCCESS [1.917s]
[INFO] org.teiid.designer.relationship.test .............. SUCCESS [1.802s]
[INFO] org.teiid.designer.schema.tools.test .............. SUCCESS [3.231s]
[INFO] org.teiid.designer.sdt.test ....................... SUCCESS [2.628s]
[INFO] org.teiid.designer.transformation.test ............ SUCCESS [3.420s]
[INFO] org.teiid.designer.ui.common.test ................. SUCCESS [3.028s]
[INFO] org.teiid.designer.ui.test ........................ SUCCESS [2.281s]
[INFO] org.teiid.designer.webservice.test ................ SUCCESS [2.621s]
[INFO] org.teiid.designer.webservice.ui.test ............. SUCCESS [2.599s]
[INFO] org.teiid.designer.xml.ui.test .................... SUCCESS [2.751s]
[INFO] org.teiid.designer.xsd.ui.test .................... SUCCESS [4.215s]
[INFO] org.teiid.designer.ui.bot.ext ..................... SUCCESS [3.344s]
[INFO] org.teiid.designer.ui.bot.tests ................... FAILURE [3.739s]
[INFO] org.teiid.designer.test.feature ................... SKIPPED
[INFO] org.teiid.designer.runtime.feature ................ SUCCESS [0.911s]
[INFO] org.teiid.datatools.connectivity.feature .......... SUCCESS [0.509s]
[INFO] org.teiid.designer.modelgenerator.uml2.test ....... SUCCESS [1.927s]
[INFO] teiid.site ........................................ SKIPPED
[INFO] ------------------------------------------------------------------------
[INFO] BUILD FAILURE
[INFO] ------------------------------------------------------------------------
[INFO] Total time: 9:30.683s
[INFO] Finished at: Mon Apr 16 07:05:21 EDT 2012
[INFO] Final Memory: 156M/639M
[INFO] ------------------------------------------------------------------------
[ERROR] Failed to execute goal org.apache.maven.plugins:maven-antrun-plugin:1.3:run (prepare-teiid) on project org.teiid.designer.ui.bot.tests: An Ant BuildException has occured: <http://hudson.qa.jboss.com/hudson/job/jbosstools-teiid-designer_trunk/ws/requirements/target/teiid-7.6.0.Final> not found. -> [Help 1]
[ERROR] 
[ERROR] To see the full stack trace of the errors, re-run Maven with the -e switch.
[ERROR] Re-run Maven using the -X switch to enable full debug logging.
[ERROR] 
[ERROR] For more information about the errors and possible solutions, please read the following articles:
[ERROR] [Help 1] http://cwiki.apache.org/confluence/display/MAVEN/MojoExecutionException
[ERROR] 
[ERROR] After correcting the problems, you can resume the build with the command
[ERROR]   mvn <goals> -rf :org.teiid.designer.ui.bot.tests
Terminating xvnc.
$ vncserver -kill :31
Killing Xvnc process ID 6284
Recording test results
Archiving artifacts



More information about the teiid-designer-dev mailing list