[teiid-designer-dev] Build failed in Jenkins: jbosstools-teiid-designer_trunk #1223

jboss-qa-internal at redhat.com jboss-qa-internal at redhat.com
Sun Apr 29 16:48:32 EDT 2012


See <http://hudson.qa.jboss.com/hudson/job/jbosstools-teiid-designer_trunk/1223/changes>

Changes:

[blafond] upgrade snapshots to 7.7 for build error

------------------------------------------
[...truncated 7576 lines...]
[INFO] ------------------------------------------------------------------------
[INFO] Building org.teiid.datatools.connectivity.feature 7.7.0-SNAPSHOT
[INFO] ------------------------------------------------------------------------
[INFO] 
[INFO] --- maven-clean-plugin:2.4.1:clean (default-clean) @ org.teiid.datatools.connectivity.feature ---
[INFO] Deleting <http://hudson.qa.jboss.com/hudson/job/jbosstools-teiid-designer_trunk/ws/sources/features/org.teiid.datatools.connectivity.feature/target>
[INFO] 
[INFO] --- tycho-packaging-plugin:0.14.1:build-qualifier (default-build-qualifier) @ org.teiid.datatools.connectivity.feature ---
[INFO] 
[INFO] --- tycho-packaging-plugin:0.14.1:validate-id (default-validate-id) @ org.teiid.datatools.connectivity.feature ---
[INFO] 
[INFO] --- tycho-packaging-plugin:0.14.1:validate-version (default-validate-version) @ org.teiid.datatools.connectivity.feature ---
[INFO] 
[INFO] --- jacoco-maven-plugin:0.5.7.201204190339:prepare-agent (default) @ org.teiid.datatools.connectivity.feature ---
[INFO] argLine set to -javaagent:<http://hudson.qa.jboss.com/hudson/job/jbosstools-teiid-designer_trunk/ws/m2-repository/org/jacoco/org.jacoco.agent/0.5.7.201204190339/org.jacoco.agent-0.5.7.201204190339-runtime.jar=destfile=/qa/hudson_ws/workspace/jbosstools-teiid-designer_trunk/sources/features/target/jacoco.exec,append=true,includes=org.jboss.tools.*>
[INFO] 
[INFO] --- tycho-source-plugin:0.14.1:plugin-source (plugin-source) @ org.teiid.datatools.connectivity.feature ---
[INFO] 
[INFO] --- tycho-packaging-plugin:0.14.1:package-feature (default-package-feature) @ org.teiid.datatools.connectivity.feature ---
[INFO] Building jar: <http://hudson.qa.jboss.com/hudson/job/jbosstools-teiid-designer_trunk/1223/artifact/sources/features/org.teiid.datatools.connectivity.feature/target/org.teiid.datatools.connectivity.feature-7.7.0-SNAPSHOT.jar>
[INFO] 
[INFO] --- tycho-p2-plugin:0.14.1:p2-metadata (default-p2-metadata) @ org.teiid.datatools.connectivity.feature ---
[INFO] 
[INFO] --- tycho-p2-plugin:0.14.1:feature-p2-metadata (default-feature-p2-metadata) @ org.teiid.datatools.connectivity.feature ---
[WARNING] <http://hudson.qa.jboss.com/hudson/job/jbosstools-teiid-designer_trunk/ws/sources/features/org.teiid.datatools.connectivity.feature/target/site> does not exist or is not a directory
[INFO] 
[INFO] --- maven-antrun-plugin:1.3:run (download-plugin-requirements) @ org.teiid.datatools.connectivity.feature ---
[INFO] Executing tasks
     [echo] No requrements.properties file
[INFO] Executed tasks
[INFO] 
[INFO] --- maven-install-plugin:2.3.1:install (default-install) @ org.teiid.datatools.connectivity.feature ---
[INFO] Installing <http://hudson.qa.jboss.com/hudson/job/jbosstools-teiid-designer_trunk/1223/artifact/sources/features/org.teiid.datatools.connectivity.feature/target/org.teiid.datatools.connectivity.feature-7.7.0-SNAPSHOT.jar> to <http://hudson.qa.jboss.com/hudson/job/jbosstools-teiid-designer_trunk/1223/artifact/m2-repository/org/jboss/tools/org.teiid.datatools.connectivity.feature/7.7.0-SNAPSHOT/org.teiid.datatools.connectivity.feature-7.7.0-SNAPSHOT.jar>
[INFO] Installing <http://hudson.qa.jboss.com/hudson/job/jbosstools-teiid-designer_trunk/ws/sources/features/org.teiid.datatools.connectivity.feature/pom.xml> to <http://hudson.qa.jboss.com/hudson/job/jbosstools-teiid-designer_trunk/ws/m2-repository/org/jboss/tools/org.teiid.datatools.connectivity.feature/7.7.0-SNAPSHOT/org.teiid.datatools.connectivity.feature-7.7.0-SNAPSHOT.pom>
[INFO] Installing <http://hudson.qa.jboss.com/hudson/job/jbosstools-teiid-designer_trunk/ws/sources/features/org.teiid.datatools.connectivity.feature/target/p2content.xml> to <http://hudson.qa.jboss.com/hudson/job/jbosstools-teiid-designer_trunk/ws/m2-repository/org/jboss/tools/org.teiid.datatools.connectivity.feature/7.7.0-SNAPSHOT/org.teiid.datatools.connectivity.feature-7.7.0-SNAPSHOT-p2metadata.xml>
[INFO] Installing <http://hudson.qa.jboss.com/hudson/job/jbosstools-teiid-designer_trunk/ws/sources/features/org.teiid.datatools.connectivity.feature/target/p2artifacts.xml> to <http://hudson.qa.jboss.com/hudson/job/jbosstools-teiid-designer_trunk/ws/m2-repository/org/jboss/tools/org.teiid.datatools.connectivity.feature/7.7.0-SNAPSHOT/org.teiid.datatools.connectivity.feature-7.7.0-SNAPSHOT-p2artifacts.xml>
[INFO] 
[INFO] --- tycho-p2-plugin:0.14.1:update-local-index (default-update-local-index) @ org.teiid.datatools.connectivity.feature ---
[INFO]                                                                         
[INFO] ------------------------------------------------------------------------
[INFO] Building org.teiid.designer.modelgenerator.uml2.test 7.6.0-SNAPSHOT
[INFO] ------------------------------------------------------------------------
[INFO] 
[INFO] --- maven-clean-plugin:2.4.1:clean (default-clean) @ org.teiid.designer.modelgenerator.uml2.test ---
[INFO] Deleting <http://hudson.qa.jboss.com/hudson/job/jbosstools-teiid-designer_trunk/ws/sources/tests/org.teiid.designer.modelgenerator.uml2.test/target>
[INFO] 
[INFO] --- tycho-packaging-plugin:0.14.1:build-qualifier (default-build-qualifier) @ org.teiid.designer.modelgenerator.uml2.test ---
[INFO] 
[INFO] --- tycho-packaging-plugin:0.14.1:validate-id (default-validate-id) @ org.teiid.designer.modelgenerator.uml2.test ---
[INFO] 
[INFO] --- tycho-packaging-plugin:0.14.1:validate-version (default-validate-version) @ org.teiid.designer.modelgenerator.uml2.test ---
[INFO] 
[INFO] --- jacoco-maven-plugin:0.5.7.201204190339:prepare-agent (default) @ org.teiid.designer.modelgenerator.uml2.test ---
[INFO] tycho.testArgLine set to -javaagent:<http://hudson.qa.jboss.com/hudson/job/jbosstools-teiid-designer_trunk/ws/m2-repository/org/jacoco/org.jacoco.agent/0.5.7.201204190339/org.jacoco.agent-0.5.7.201204190339-runtime.jar=destfile=/qa/hudson_ws/workspace/jbosstools-teiid-designer_trunk/sources/tests/target/jacoco.exec,append=true,includes=org.jboss.tools.*>
[INFO] 
[INFO] --- maven-resources-plugin:2.4.1:resources (default-resources) @ org.teiid.designer.modelgenerator.uml2.test ---
[INFO] Using 'ISO-8859-1' encoding to copy filtered resources.
[INFO] skip non existing resourceDirectory <http://hudson.qa.jboss.com/hudson/job/jbosstools-teiid-designer_trunk/ws/sources/tests/org.teiid.designer.modelgenerator.uml2.test/src/main/resources>
[INFO] 
[INFO] --- tycho-compiler-plugin:0.14.1:compile (default-compile) @ org.teiid.designer.modelgenerator.uml2.test ---
[INFO] Compiling 7 source files to <http://hudson.qa.jboss.com/hudson/job/jbosstools-teiid-designer_trunk/ws/sources/tests/org.teiid.designer.modelgenerator.uml2.test/target/classes>
[INFO] 
[INFO] --- maven-resources-plugin:2.4.1:testResources (default-testResources) @ org.teiid.designer.modelgenerator.uml2.test ---
[INFO] Using 'ISO-8859-1' encoding to copy filtered resources.
[INFO] skip non existing resourceDirectory <http://hudson.qa.jboss.com/hudson/job/jbosstools-teiid-designer_trunk/ws/sources/tests/org.teiid.designer.modelgenerator.uml2.test/src/test/resources>
[INFO] 
[INFO] --- tycho-compiler-plugin:0.14.1:testCompile (default-testCompile) @ org.teiid.designer.modelgenerator.uml2.test ---
[INFO] Nothing to compile - all classes are up to date
[INFO] 
[INFO] --- tycho-source-plugin:0.14.1:plugin-source (plugin-source) @ org.teiid.designer.modelgenerator.uml2.test ---
[INFO] Building jar: <http://hudson.qa.jboss.com/hudson/job/jbosstools-teiid-designer_trunk/1223/artifact/sources/tests/org.teiid.designer.modelgenerator.uml2.test/target/org.teiid.designer.modelgenerator.uml2.test-7.6.0-SNAPSHOT-sources.jar>
[INFO] 
[INFO] --- tycho-packaging-plugin:0.14.1:package-plugin (default-package-plugin) @ org.teiid.designer.modelgenerator.uml2.test ---
[INFO] Building jar: <http://hudson.qa.jboss.com/hudson/job/jbosstools-teiid-designer_trunk/1223/artifact/sources/tests/org.teiid.designer.modelgenerator.uml2.test/target/org.teiid.designer.modelgenerator.uml2.test-7.6.0-SNAPSHOT.jar>
[INFO] 
[INFO] --- tycho-p2-plugin:0.14.1:p2-metadata (default-p2-metadata) @ org.teiid.designer.modelgenerator.uml2.test ---
[INFO] 
[INFO] --- maven-antrun-plugin:1.3:run (download-plugin-requirements) @ org.teiid.designer.modelgenerator.uml2.test ---
[INFO] Executing tasks
     [echo] No requrements.properties file
[INFO] Executed tasks
[INFO] 
[INFO] --- tycho-surefire-plugin:0.14.1:test (default-test) @ org.teiid.designer.modelgenerator.uml2.test ---
[INFO] Skipping tests
[INFO] 
[INFO] --- maven-install-plugin:2.3.1:install (default-install) @ org.teiid.designer.modelgenerator.uml2.test ---
[INFO] Installing <http://hudson.qa.jboss.com/hudson/job/jbosstools-teiid-designer_trunk/1223/artifact/sources/tests/org.teiid.designer.modelgenerator.uml2.test/target/org.teiid.designer.modelgenerator.uml2.test-7.6.0-SNAPSHOT.jar> to <http://hudson.qa.jboss.com/hudson/job/jbosstools-teiid-designer_trunk/1223/artifact/m2-repository/org/jboss/tools/org.teiid.designer.modelgenerator.uml2.test/7.6.0-SNAPSHOT/org.teiid.designer.modelgenerator.uml2.test-7.6.0-SNAPSHOT.jar>
[INFO] Installing <http://hudson.qa.jboss.com/hudson/job/jbosstools-teiid-designer_trunk/ws/sources/tests/org.teiid.designer.modelgenerator.uml2.test/pom.xml> to <http://hudson.qa.jboss.com/hudson/job/jbosstools-teiid-designer_trunk/ws/m2-repository/org/jboss/tools/org.teiid.designer.modelgenerator.uml2.test/7.6.0-SNAPSHOT/org.teiid.designer.modelgenerator.uml2.test-7.6.0-SNAPSHOT.pom>
[INFO] Installing <http://hudson.qa.jboss.com/hudson/job/jbosstools-teiid-designer_trunk/1223/artifact/sources/tests/org.teiid.designer.modelgenerator.uml2.test/target/org.teiid.designer.modelgenerator.uml2.test-7.6.0-SNAPSHOT-sources.jar> to <http://hudson.qa.jboss.com/hudson/job/jbosstools-teiid-designer_trunk/1223/artifact/m2-repository/org/jboss/tools/org.teiid.designer.modelgenerator.uml2.test/7.6.0-SNAPSHOT/org.teiid.designer.modelgenerator.uml2.test-7.6.0-SNAPSHOT-sources.jar>
[INFO] Installing <http://hudson.qa.jboss.com/hudson/job/jbosstools-teiid-designer_trunk/ws/sources/tests/org.teiid.designer.modelgenerator.uml2.test/target/p2content.xml> to <http://hudson.qa.jboss.com/hudson/job/jbosstools-teiid-designer_trunk/ws/m2-repository/org/jboss/tools/org.teiid.designer.modelgenerator.uml2.test/7.6.0-SNAPSHOT/org.teiid.designer.modelgenerator.uml2.test-7.6.0-SNAPSHOT-p2metadata.xml>
[INFO] Installing <http://hudson.qa.jboss.com/hudson/job/jbosstools-teiid-designer_trunk/ws/sources/tests/org.teiid.designer.modelgenerator.uml2.test/target/p2artifacts.xml> to <http://hudson.qa.jboss.com/hudson/job/jbosstools-teiid-designer_trunk/ws/m2-repository/org/jboss/tools/org.teiid.designer.modelgenerator.uml2.test/7.6.0-SNAPSHOT/org.teiid.designer.modelgenerator.uml2.test-7.6.0-SNAPSHOT-p2artifacts.xml>
[INFO] 
[INFO] --- tycho-p2-plugin:0.14.1:update-local-index (default-update-local-index) @ org.teiid.designer.modelgenerator.uml2.test ---
[INFO]                                                                         
[INFO] ------------------------------------------------------------------------
[INFO] Skipping teiid.site
[INFO] This project has been banned from the build due to previous failures.
[INFO] ------------------------------------------------------------------------
[INFO] ------------------------------------------------------------------------
[INFO] Reactor Summary:
[INFO] 
[INFO] teiid.all ......................................... SUCCESS [0.706s]
[INFO] teiid.plugins ..................................... SUCCESS [0.016s]
[INFO] net.jcip.annotations .............................. SUCCESS [0.653s]
[INFO] net.sf.saxon ...................................... SUCCESS [1.267s]
[INFO] org.apache.poi .................................... SUCCESS [0.338s]
[INFO] org.jaxen ......................................... SUCCESS [0.208s]
[INFO] org.mockito ....................................... SUCCESS [0.403s]
[INFO] org.powermock ..................................... SUCCESS [0.635s]
[INFO] org.teiid.datatools.connectivity.model ............ SUCCESS [1.379s]
[INFO] org.teiid.datatools.connectivity .................. SUCCESS [0.808s]
[INFO] org.teiid.datatools.connectivity.ui ............... SUCCESS [1.320s]
[INFO] teiid_embedded_query .............................. SUCCESS [0.542s]
[INFO] org.teiid.core.designer ........................... SUCCESS [1.180s]
[INFO] org.teiid.designer ................................ SUCCESS [0.140s]
[INFO] org.teiid.designer.modeshape ...................... SUCCESS [0.320s]
[INFO] org.teiid.designer.legacy ......................... SUCCESS [3.482s]
[INFO] org.teiid.designer.metamodels.diagram ............. SUCCESS [0.673s]
[INFO] org.teiid.designer.metamodels.core ................ SUCCESS [1.035s]
[INFO] org.teiid.designer.metamodels.transformation ...... SUCCESS [1.504s]
[INFO] org.teiid.designer.extension ...................... SUCCESS [0.699s]
[INFO] org.teiid.designer.core ........................... SUCCESS [6.266s]
[INFO] org.teiid.designer.ui.common ...................... SUCCESS [1.862s]
[INFO] org.teiid.designer.compare ........................ SUCCESS [0.822s]
[INFO] org.teiid.designer.core.xslt ...................... SUCCESS [0.319s]
[INFO] org.teiid.designer.metamodels.relational .......... SUCCESS [1.800s]
[INFO] org.teiid.designer.ddl ............................ SUCCESS [0.496s]
[INFO] org.teiid.designer.jdbc ........................... SUCCESS [1.299s]
[INFO] org.teiid.designer.jdbc.relational ................ SUCCESS [0.799s]
[INFO] org.teiid.designer.metamodels.xsd ................. SUCCESS [0.725s]
[INFO] org.teiid.designer.metamodels.xml ................. SUCCESS [1.220s]
[INFO] org.teiid.designer.mapping ........................ SUCCESS [0.584s]
[INFO] org.teiid.designer.metamodels.function ............ SUCCESS [0.744s]
[INFO] org.teiid.designer.metamodels.webservice .......... SUCCESS [0.976s]
[INFO] org.teiid.designer.metamodels.wsdl ................ SUCCESS [1.331s]
[INFO] org.teiid.designer.metamodels.xmlservice .......... SUCCESS [0.904s]
[INFO] org.teiid.designer.relational ..................... SUCCESS [0.602s]
[INFO] org.teiid.designer.xml ............................ SUCCESS [0.573s]
[INFO] org.teiid.designer.udf ............................ SUCCESS [0.432s]
[INFO] org.teiid.designer.transformation ................. SUCCESS [1.537s]
[INFO] org.teiid.designer.webservice ..................... SUCCESS [1.418s]
[INFO] org.teiid.designer.ui ............................. SUCCESS [5.291s]
[INFO] org.teiid.designer.datatools ...................... SUCCESS [0.669s]
[INFO] org.teiid.designer.datatools.ui ................... SUCCESS [0.984s]
[INFO] org.teiid.designer.roles .......................... SUCCESS [0.266s]
[INFO] org.teiid.designer.vdb ............................ SUCCESS [0.538s]
[INFO] org.teiid.designer.dqp ............................ SUCCESS [0.878s]
[INFO] org.teiid.designer.compare.ui ..................... SUCCESS [0.816s]
[INFO] org.teiid.designer.diagram.ui ..................... SUCCESS [3.187s]
[INFO] org.teiid.designer.roles.ui ....................... SUCCESS [0.562s]
[INFO] org.teiid.designer.vdb.ui ......................... SUCCESS [1.045s]
[INFO] org.teiid.designer.query.ui ....................... SUCCESS [1.114s]
[INFO] org.teiid.designer.tools.textimport.ui ............ SUCCESS [0.665s]
[INFO] org.teiid.designer.relational.ui .................. SUCCESS [1.137s]
[INFO] org.teiid.designer.transformation.ui .............. SUCCESS [3.623s]
[INFO] org.teiid.designer.jdbc.ui ........................ SUCCESS [0.982s]
[INFO] org.teiid.designer.sdt ............................ SUCCESS [0.466s]
[INFO] org.teiid.designer.dqp.ui ......................... SUCCESS [2.142s]
[INFO] org.teiid.designer.advisor.ui ..................... SUCCESS [1.586s]
[INFO] org.teiid.designer.ddl.importer ................... SUCCESS [0.330s]
[INFO] org.teiid.designer.ddl.importer.ui ................ SUCCESS [0.549s]
[INFO] org.teiid.designer.extension.ui ................... SUCCESS [1.110s]
[INFO] org.teiid.designer.help ........................... SUCCESS [0.184s]
[INFO] org.teiid.designer.xsd ............................ SUCCESS [0.387s]
[INFO] org.teiid.designer.mapping.ui ..................... SUCCESS [1.934s]
[INFO] org.teiid.designer.metamodels.builder ............. SUCCESS [0.410s]
[INFO] org.teiid.designer.metamodels.relationship ........ SUCCESS [0.910s]
[INFO] org.teiid.designer.metamodels.builder.execution ... SUCCESS [0.477s]
[INFO] org.teiid.designer.metamodels.dependency .......... SUCCESS [0.392s]
[INFO] org.teiid.designer.metamodels.uml2 ................ SUCCESS [0.886s]
[INFO] org.teiid.designer.metamodels.xsd.ui .............. SUCCESS [0.829s]
[INFO] org.teiid.designer.modelgenerator ................. SUCCESS [0.415s]
[INFO] org.wsdl4j ........................................ SUCCESS [0.144s]
[INFO] org.teiid.designer.modelgenerator.salesforce ...... SUCCESS [0.752s]
[INFO] org.teiid.designer.modelgenerator.salesforce.ui ... SUCCESS [1.012s]
[INFO] org.teiid.designer.modelgenerator.ui .............. SUCCESS [0.418s]
[INFO] org.teiid.designer.modelgenerator.uml2 ............ SUCCESS [0.586s]
[INFO] org.teiid.designer.schema.tools ................... SUCCESS [0.663s]
[INFO] org.teiid.designer.modelgenerator.xml ............. SUCCESS [1.363s]
[INFO] org.teiid.designer.modelgenerator.wsdl ............ SUCCESS [0.942s]
[INFO] org.teiid.designer.xsd.ui ......................... SUCCESS [1.257s]
[INFO] org.teiid.designer.modelgenerator.wsdl.ui ......... SUCCESS [1.354s]
[INFO] org.teiid.designer.relationship ................... SUCCESS [0.484s]
[INFO] org.teiid.designer.relationship.ui ................ SUCCESS [2.475s]
[INFO] org.teiid.designer.udf.ui ......................... SUCCESS [0.576s]
[INFO] org.teiid.designer.xml.ui ......................... SUCCESS [1.046s]
[INFO] org.teiid.designer.webservice.ui .................. SUCCESS [1.357s]
[INFO] teiid.features .................................... SUCCESS [0.014s]
[INFO] org.teiid.designer.feature ........................ SUCCESS [1.212s]
[INFO] teiid.tests ....................................... SUCCESS [0.012s]
[INFO] org.teiid.core.designer.test.framework ............ SUCCESS [0.313s]
[INFO] org.teiid.core.designer.test ...................... SUCCESS [0.716s]
[INFO] org.teiid.designer.compare.test ................... SUCCESS [0.389s]
[INFO] org.teiid.designer.core.test.framework ............ SUCCESS [0.757s]
[INFO] org.teiid.designer.core.xslt.test ................. SUCCESS [0.412s]
[INFO] org.teiid.designer.extension.test ................. SUCCESS [0.418s]
[INFO] org.teiid.designer.jdbc.test.framework ............ SUCCESS [0.493s]
[INFO] org.teiid.designer.mapping.ui.test ................ SUCCESS [0.742s]
[INFO] org.teiid.designer.metamodels.core.test ........... SUCCESS [0.388s]
[INFO] org.teiid.designer.metamodels.relational.test ..... SUCCESS [0.631s]
[INFO] org.teiid.designer.metamodels.relationship.test ... SUCCESS [0.449s]
[INFO] org.teiid.designer.metamodels.transformation.test . SUCCESS [0.414s]
[INFO] org.teiid.designer.metamodels.uml2.test ........... SUCCESS [0.497s]
[INFO] org.teiid.designer.metamodels.wsdl.test ........... SUCCESS [0.446s]
[INFO] org.teiid.designer.metamodels.xml.test ............ SUCCESS [0.431s]
[INFO] org.teiid.designer.modelgenerator.salesforce.test . SUCCESS [0.516s]
[INFO] org.teiid.designer.modelgenerator.test ............ SUCCESS [0.430s]
[INFO] org.teiid.designer.modelgenerator.wsdl.test ....... SUCCESS [0.965s]
[INFO] org.teiid.designer.query.ui.test .................. SUCCESS [0.509s]
[INFO] org.teiid.designer.relationship.test .............. SUCCESS [0.542s]
[INFO] org.teiid.designer.schema.tools.test .............. SUCCESS [0.670s]
[INFO] org.teiid.designer.sdt.test ....................... SUCCESS [0.525s]
[INFO] org.teiid.designer.transformation.test ............ SUCCESS [0.654s]
[INFO] org.teiid.designer.ui.common.test ................. SUCCESS [0.558s]
[INFO] org.teiid.designer.ui.test ........................ SUCCESS [0.653s]
[INFO] org.teiid.designer.webservice.test ................ SUCCESS [0.662s]
[INFO] org.teiid.designer.webservice.ui.test ............. SUCCESS [0.636s]
[INFO] org.teiid.designer.xml.ui.test .................... SUCCESS [0.627s]
[INFO] org.teiid.designer.xsd.ui.test .................... SUCCESS [0.584s]
[INFO] org.teiid.designer.ui.bot.ext ..................... SUCCESS [0.724s]
[INFO] org.teiid.designer.ui.bot.tests ................... FAILURE [0.462s]
[INFO] org.teiid.designer.test.feature ................... SKIPPED
[INFO] org.teiid.designer.runtime.feature ................ SUCCESS [0.313s]
[INFO] org.teiid.datatools.connectivity.feature .......... SUCCESS [0.126s]
[INFO] org.teiid.designer.modelgenerator.uml2.test ....... SUCCESS [0.498s]
[INFO] teiid.site ........................................ SKIPPED
[INFO] ------------------------------------------------------------------------
[INFO] BUILD FAILURE
[INFO] ------------------------------------------------------------------------
[INFO] Total time: 3:15.165s
[INFO] Finished at: Sun Apr 29 16:47:49 EDT 2012
[INFO] Final Memory: 156M/678M
[INFO] ------------------------------------------------------------------------
[ERROR] Failed to execute goal org.apache.maven.plugins:maven-antrun-plugin:1.3:run (prepare-teiid) on project org.teiid.designer.ui.bot.tests: An Ant BuildException has occured: <http://hudson.qa.jboss.com/hudson/job/jbosstools-teiid-designer_trunk/ws/requirements/target/teiid-7.7.0.Final> not found. -> [Help 1]
[ERROR] 
[ERROR] To see the full stack trace of the errors, re-run Maven with the -e switch.
[ERROR] Re-run Maven using the -X switch to enable full debug logging.
[ERROR] 
[ERROR] For more information about the errors and possible solutions, please read the following articles:
[ERROR] [Help 1] http://cwiki.apache.org/confluence/display/MAVEN/MojoExecutionException
[ERROR] 
[ERROR] After correcting the problems, you can resume the build with the command
[ERROR]   mvn <goals> -rf :org.teiid.designer.ui.bot.tests
Build step 'Invoke top-level Maven targets' marked build as failure
Terminating xvnc.
$ vncserver -kill :41
Killing Xvnc process ID 24417
Recording test results
Archiving artifacts



More information about the teiid-designer-dev mailing list