[teiid-designer-dev] Build failed in Jenkins: jbosstools-teiid-designer-branch-testing #36 (phantomjinx/master)

ci-builds at redhat.com ci-builds at redhat.com
Mon Jul 16 17:56:10 EDT 2012


See <http://hudson.qa.jboss.com/hudson/job/jbosstools-teiid-designer-branch-testing/36/changes>

Changes:

[p.g.richardson] Fix bug in version upgrade script

[p.g.richardson] TEIIDDES-1450: Upgrade plugin version numbers

------------------------------------------
[...truncated 20776 lines...]
Unregistering Workspace
Unregistering Workspace
Unregistering Workspace
Unregistering Workspace
Unregistering Workspace
Unregistering Workspace
Unregistering Workspace
Unregistering Workspace
Unregistering Workspace
Tests run: 32, Failures: 0, Errors: 0, Skipped: 0, Time elapsed: 2.862 sec

Results :

Tests run: 32, Failures: 0, Errors: 0, Skipped: 0

Unregistering Modeler Container
Unregistering Default Metamodel Registry
[INFO] All tests passed!
[INFO] 
[INFO] --- maven-install-plugin:2.3.1:install (default-install) @ org.teiid.designer.vdb.test ---
[INFO] Installing <http://hudson.qa.jboss.com/hudson/job/jbosstools-teiid-designer-branch-testing/ws/sources/tests/org.teiid.designer.vdb.test/target/org.teiid.designer.vdb.test-8.0.0-SNAPSHOT.jar> to <http://hudson.qa.jboss.com/hudson/job/jbosstools-teiid-designer-branch-testing/ws/.repository/org/jboss/tools/org.teiid.designer.vdb.test/8.0.0-SNAPSHOT/org.teiid.designer.vdb.test-8.0.0-SNAPSHOT.jar>
[INFO] Installing <http://hudson.qa.jboss.com/hudson/job/jbosstools-teiid-designer-branch-testing/ws/sources/tests/org.teiid.designer.vdb.test/pom.xml> to <http://hudson.qa.jboss.com/hudson/job/jbosstools-teiid-designer-branch-testing/ws/.repository/org/jboss/tools/org.teiid.designer.vdb.test/8.0.0-SNAPSHOT/org.teiid.designer.vdb.test-8.0.0-SNAPSHOT.pom>
[INFO] Installing <http://hudson.qa.jboss.com/hudson/job/jbosstools-teiid-designer-branch-testing/ws/sources/tests/org.teiid.designer.vdb.test/target/org.teiid.designer.vdb.test-8.0.0-SNAPSHOT-sources.jar> to <http://hudson.qa.jboss.com/hudson/job/jbosstools-teiid-designer-branch-testing/ws/.repository/org/jboss/tools/org.teiid.designer.vdb.test/8.0.0-SNAPSHOT/org.teiid.designer.vdb.test-8.0.0-SNAPSHOT-sources.jar>
[INFO] Installing <http://hudson.qa.jboss.com/hudson/job/jbosstools-teiid-designer-branch-testing/ws/sources/tests/org.teiid.designer.vdb.test/target/p2content.xml> to <http://hudson.qa.jboss.com/hudson/job/jbosstools-teiid-designer-branch-testing/ws/.repository/org/jboss/tools/org.teiid.designer.vdb.test/8.0.0-SNAPSHOT/org.teiid.designer.vdb.test-8.0.0-SNAPSHOT-p2metadata.xml>
[INFO] Installing <http://hudson.qa.jboss.com/hudson/job/jbosstools-teiid-designer-branch-testing/ws/sources/tests/org.teiid.designer.vdb.test/target/p2artifacts.xml> to <http://hudson.qa.jboss.com/hudson/job/jbosstools-teiid-designer-branch-testing/ws/.repository/org/jboss/tools/org.teiid.designer.vdb.test/8.0.0-SNAPSHOT/org.teiid.designer.vdb.test-8.0.0-SNAPSHOT-p2artifacts.xml>
[INFO] 
[INFO] --- tycho-p2-plugin:0.15.0:update-local-index (default-update-local-index) @ org.teiid.designer.vdb.test ---
[INFO]                                                                         
[INFO] ------------------------------------------------------------------------
[INFO] Skipping org.teiid.designer.test.feature
[INFO] This project has been banned from the build due to previous failures.
[INFO] ------------------------------------------------------------------------
[INFO]                                                                         
[INFO] ------------------------------------------------------------------------
[INFO] Building org.teiid.designer.runtime.feature 8.0.0-SNAPSHOT
[INFO] ------------------------------------------------------------------------
[INFO] 
[INFO] --- maven-clean-plugin:2.4.1:clean (default-clean) @ org.teiid.designer.runtime.feature ---
[INFO] Deleting <http://hudson.qa.jboss.com/hudson/job/jbosstools-teiid-designer-branch-testing/ws/sources/features/org.teiid.designer.runtime.feature/target>
[INFO] 
[INFO] --- tycho-packaging-plugin:0.15.0:build-qualifier (default-build-qualifier) @ org.teiid.designer.runtime.feature ---
[INFO] 
[INFO] --- tycho-packaging-plugin:0.15.0:validate-id (default-validate-id) @ org.teiid.designer.runtime.feature ---
[INFO] 
[INFO] --- tycho-packaging-plugin:0.15.0:validate-version (default-validate-version) @ org.teiid.designer.runtime.feature ---
[INFO] 
[INFO] --- jacoco-maven-plugin:0.5.7.201204190339:prepare-agent (default) @ org.teiid.designer.runtime.feature ---
[INFO] argLine set to -javaagent:<http://hudson.qa.jboss.com/hudson/job/jbosstools-teiid-designer-branch-testing/ws/.repository/org/jacoco/org.jacoco.agent/0.5.7.201204190339/org.jacoco.agent-0.5.7.201204190339-runtime.jar=destfile=/qa/services/hudson/hudson_workspace/workspace/jbosstools-teiid-designer-branch-testing/sources/target/jacoco.exec,append=true,includes=org.jboss.tools.*>
[INFO] 
[INFO] --- tycho-source-plugin:0.15.0:plugin-source (plugin-source) @ org.teiid.designer.runtime.feature ---
[INFO] 
[INFO] --- tycho-packaging-plugin:0.15.0:package-feature (default-package-feature) @ org.teiid.designer.runtime.feature ---
[INFO] Building jar: <http://hudson.qa.jboss.com/hudson/job/jbosstools-teiid-designer-branch-testing/ws/sources/features/org.teiid.designer.runtime.feature/target/org.teiid.designer.runtime.feature-8.0.0-SNAPSHOT.jar>
[INFO] 
[INFO] --- tycho-p2-plugin:0.15.0:p2-metadata-default (default-p2-metadata-default) @ org.teiid.designer.runtime.feature ---
[INFO] 
[INFO] --- tycho-p2-plugin:0.15.0:feature-p2-metadata (default-feature-p2-metadata) @ org.teiid.designer.runtime.feature ---
[INFO] 
[INFO] --- maven-install-plugin:2.3.1:install (default-install) @ org.teiid.designer.runtime.feature ---
[INFO] Installing <http://hudson.qa.jboss.com/hudson/job/jbosstools-teiid-designer-branch-testing/ws/sources/features/org.teiid.designer.runtime.feature/target/org.teiid.designer.runtime.feature-8.0.0-SNAPSHOT.jar> to <http://hudson.qa.jboss.com/hudson/job/jbosstools-teiid-designer-branch-testing/ws/.repository/org/jboss/tools/org.teiid.designer.runtime.feature/8.0.0-SNAPSHOT/org.teiid.designer.runtime.feature-8.0.0-SNAPSHOT.jar>
[INFO] Installing <http://hudson.qa.jboss.com/hudson/job/jbosstools-teiid-designer-branch-testing/ws/sources/features/org.teiid.designer.runtime.feature/pom.xml> to <http://hudson.qa.jboss.com/hudson/job/jbosstools-teiid-designer-branch-testing/ws/.repository/org/jboss/tools/org.teiid.designer.runtime.feature/8.0.0-SNAPSHOT/org.teiid.designer.runtime.feature-8.0.0-SNAPSHOT.pom>
[INFO] Installing <http://hudson.qa.jboss.com/hudson/job/jbosstools-teiid-designer-branch-testing/ws/sources/features/org.teiid.designer.runtime.feature/target/p2content.xml> to <http://hudson.qa.jboss.com/hudson/job/jbosstools-teiid-designer-branch-testing/ws/.repository/org/jboss/tools/org.teiid.designer.runtime.feature/8.0.0-SNAPSHOT/org.teiid.designer.runtime.feature-8.0.0-SNAPSHOT-p2metadata.xml>
[INFO] Installing <http://hudson.qa.jboss.com/hudson/job/jbosstools-teiid-designer-branch-testing/ws/sources/features/org.teiid.designer.runtime.feature/target/p2artifacts.xml> to <http://hudson.qa.jboss.com/hudson/job/jbosstools-teiid-designer-branch-testing/ws/.repository/org/jboss/tools/org.teiid.designer.runtime.feature/8.0.0-SNAPSHOT/org.teiid.designer.runtime.feature-8.0.0-SNAPSHOT-p2artifacts.xml>
[INFO] 
[INFO] --- tycho-p2-plugin:0.15.0:update-local-index (default-update-local-index) @ org.teiid.designer.runtime.feature ---
[INFO]                                                                         
[INFO] ------------------------------------------------------------------------
[INFO] Building org.teiid.datatools.connectivity.feature 8.0.0-SNAPSHOT
[INFO] ------------------------------------------------------------------------
[INFO] 
[INFO] --- maven-clean-plugin:2.4.1:clean (default-clean) @ org.teiid.datatools.connectivity.feature ---
[INFO] Deleting <http://hudson.qa.jboss.com/hudson/job/jbosstools-teiid-designer-branch-testing/ws/sources/features/org.teiid.datatools.connectivity.feature/target>
[INFO] 
[INFO] --- tycho-packaging-plugin:0.15.0:build-qualifier (default-build-qualifier) @ org.teiid.datatools.connectivity.feature ---
[INFO] 
[INFO] --- tycho-packaging-plugin:0.15.0:validate-id (default-validate-id) @ org.teiid.datatools.connectivity.feature ---
[INFO] 
[INFO] --- tycho-packaging-plugin:0.15.0:validate-version (default-validate-version) @ org.teiid.datatools.connectivity.feature ---
[INFO] 
[INFO] --- jacoco-maven-plugin:0.5.7.201204190339:prepare-agent (default) @ org.teiid.datatools.connectivity.feature ---
[INFO] argLine set to -javaagent:<http://hudson.qa.jboss.com/hudson/job/jbosstools-teiid-designer-branch-testing/ws/.repository/org/jacoco/org.jacoco.agent/0.5.7.201204190339/org.jacoco.agent-0.5.7.201204190339-runtime.jar=destfile=/qa/services/hudson/hudson_workspace/workspace/jbosstools-teiid-designer-branch-testing/sources/target/jacoco.exec,append=true,includes=org.jboss.tools.*>
[INFO] 
[INFO] --- tycho-source-plugin:0.15.0:plugin-source (plugin-source) @ org.teiid.datatools.connectivity.feature ---
[INFO] 
[INFO] --- tycho-packaging-plugin:0.15.0:package-feature (default-package-feature) @ org.teiid.datatools.connectivity.feature ---
[INFO] Building jar: <http://hudson.qa.jboss.com/hudson/job/jbosstools-teiid-designer-branch-testing/ws/sources/features/org.teiid.datatools.connectivity.feature/target/org.teiid.datatools.connectivity.feature-8.0.0-SNAPSHOT.jar>
[INFO] 
[INFO] --- tycho-p2-plugin:0.15.0:p2-metadata-default (default-p2-metadata-default) @ org.teiid.datatools.connectivity.feature ---
[INFO] 
[INFO] --- tycho-p2-plugin:0.15.0:feature-p2-metadata (default-feature-p2-metadata) @ org.teiid.datatools.connectivity.feature ---
[INFO] 
[INFO] --- maven-install-plugin:2.3.1:install (default-install) @ org.teiid.datatools.connectivity.feature ---
[INFO] Installing <http://hudson.qa.jboss.com/hudson/job/jbosstools-teiid-designer-branch-testing/ws/sources/features/org.teiid.datatools.connectivity.feature/target/org.teiid.datatools.connectivity.feature-8.0.0-SNAPSHOT.jar> to <http://hudson.qa.jboss.com/hudson/job/jbosstools-teiid-designer-branch-testing/ws/.repository/org/jboss/tools/org.teiid.datatools.connectivity.feature/8.0.0-SNAPSHOT/org.teiid.datatools.connectivity.feature-8.0.0-SNAPSHOT.jar>
[INFO] Installing <http://hudson.qa.jboss.com/hudson/job/jbosstools-teiid-designer-branch-testing/ws/sources/features/org.teiid.datatools.connectivity.feature/pom.xml> to <http://hudson.qa.jboss.com/hudson/job/jbosstools-teiid-designer-branch-testing/ws/.repository/org/jboss/tools/org.teiid.datatools.connectivity.feature/8.0.0-SNAPSHOT/org.teiid.datatools.connectivity.feature-8.0.0-SNAPSHOT.pom>
[INFO] Installing <http://hudson.qa.jboss.com/hudson/job/jbosstools-teiid-designer-branch-testing/ws/sources/features/org.teiid.datatools.connectivity.feature/target/p2content.xml> to <http://hudson.qa.jboss.com/hudson/job/jbosstools-teiid-designer-branch-testing/ws/.repository/org/jboss/tools/org.teiid.datatools.connectivity.feature/8.0.0-SNAPSHOT/org.teiid.datatools.connectivity.feature-8.0.0-SNAPSHOT-p2metadata.xml>
[INFO] Installing <http://hudson.qa.jboss.com/hudson/job/jbosstools-teiid-designer-branch-testing/ws/sources/features/org.teiid.datatools.connectivity.feature/target/p2artifacts.xml> to <http://hudson.qa.jboss.com/hudson/job/jbosstools-teiid-designer-branch-testing/ws/.repository/org/jboss/tools/org.teiid.datatools.connectivity.feature/8.0.0-SNAPSHOT/org.teiid.datatools.connectivity.feature-8.0.0-SNAPSHOT-p2artifacts.xml>
[INFO] 
[INFO] --- tycho-p2-plugin:0.15.0:update-local-index (default-update-local-index) @ org.teiid.datatools.connectivity.feature ---
[INFO]                                                                         
[INFO] ------------------------------------------------------------------------
[INFO] Skipping teiid.site
[INFO] This project has been banned from the build due to previous failures.
[INFO] ------------------------------------------------------------------------
[INFO] ------------------------------------------------------------------------
[INFO] Reactor Summary:
[INFO] 
[INFO] teiid.all ......................................... SUCCESS [3.036s]
[INFO] teiid.plugins ..................................... SUCCESS [0.018s]
[INFO] net.jcip.annotations .............................. SUCCESS [1.306s]
[INFO] net.sf.saxon ...................................... SUCCESS [1.495s]
[INFO] org.apache.poi .................................... SUCCESS [0.452s]
[INFO] org.jaxen ......................................... SUCCESS [0.277s]
[INFO] org.mockito ....................................... SUCCESS [0.582s]
[INFO] org.teiid.datatools.connectivity.model ............ SUCCESS [1.822s]
[INFO] org.teiid.datatools.connectivity .................. SUCCESS [1.020s]
[INFO] org.teiid.datatools.connectivity.ui ............... SUCCESS [1.683s]
[INFO] teiid_embedded_query .............................. SUCCESS [0.643s]
[INFO] org.teiid.core.designer ........................... SUCCESS [1.610s]
[INFO] org.teiid.designer ................................ SUCCESS [0.274s]
[INFO] org.teiid.designer.modeshape ...................... SUCCESS [0.458s]
[INFO] org.teiid.designer.legacy ......................... SUCCESS [3.912s]
[INFO] org.teiid.designer.metamodels.diagram ............. SUCCESS [0.920s]
[INFO] org.teiid.designer.metamodels.core ................ SUCCESS [1.346s]
[INFO] org.teiid.designer.metamodels.transformation ...... SUCCESS [1.786s]
[INFO] org.teiid.designer.extension ...................... SUCCESS [0.869s]
[INFO] org.teiid.designer.core ........................... SUCCESS [7.262s]
[INFO] org.teiid.designer.ui.common ...................... SUCCESS [2.924s]
[INFO] org.teiid.designer.compare ........................ SUCCESS [1.058s]
[INFO] org.teiid.designer.core.xslt ...................... SUCCESS [0.500s]
[INFO] org.teiid.designer.metamodels.relational .......... SUCCESS [2.184s]
[INFO] org.teiid.designer.ddl ............................ SUCCESS [0.718s]
[INFO] org.teiid.designer.jdbc ........................... SUCCESS [1.588s]
[INFO] org.teiid.designer.jdbc.relational ................ SUCCESS [1.104s]
[INFO] org.teiid.designer.metamodels.xsd ................. SUCCESS [1.041s]
[INFO] org.teiid.designer.metamodels.xml ................. SUCCESS [1.519s]
[INFO] org.teiid.designer.mapping ........................ SUCCESS [0.712s]
[INFO] org.teiid.designer.metamodels.function ............ SUCCESS [1.002s]
[INFO] org.teiid.designer.metamodels.webservice .......... SUCCESS [1.295s]
[INFO] org.teiid.designer.metamodels.wsdl ................ SUCCESS [1.656s]
[INFO] org.teiid.designer.relational ..................... SUCCESS [0.715s]
[INFO] org.teiid.designer.xml ............................ SUCCESS [0.710s]
[INFO] org.teiid.designer.udf ............................ SUCCESS [0.511s]
[INFO] org.teiid.designer.transformation ................. SUCCESS [2.010s]
[INFO] org.teiid.designer.webservice ..................... SUCCESS [1.697s]
[INFO] org.teiid.designer.ui ............................. SUCCESS [6.725s]
[INFO] org.teiid.designer.datatools ...................... SUCCESS [1.023s]
[INFO] org.teiid.designer.datatools.ui ................... SUCCESS [1.393s]
[INFO] org.teiid.designer.roles .......................... SUCCESS [0.402s]
[INFO] org.teiid.designer.vdb ............................ SUCCESS [0.749s]
[INFO] org.teiid.designer.dqp ............................ SUCCESS [1.298s]
[INFO] org.teiid.designer.compare.ui ..................... SUCCESS [1.046s]
[INFO] org.teiid.designer.diagram.ui ..................... SUCCESS [4.340s]
[INFO] org.teiid.designer.roles.ui ....................... SUCCESS [0.736s]
[INFO] org.teiid.designer.vdb.ui ......................... SUCCESS [1.475s]
[INFO] org.teiid.designer.query.ui ....................... SUCCESS [1.438s]
[INFO] org.teiid.designer.tools.textimport.ui ............ SUCCESS [0.819s]
[INFO] org.teiid.designer.relational.ui .................. SUCCESS [1.557s]
[INFO] org.teiid.designer.transformation.ui .............. SUCCESS [5.134s]
[INFO] org.teiid.designer.jdbc.ui ........................ SUCCESS [1.252s]
[INFO] org.teiid.designer.sdt ............................ SUCCESS [0.575s]
[INFO] org.teiid.designer.dqp.ui ......................... SUCCESS [2.551s]
[INFO] org.teiid.designer.advisor.ui ..................... SUCCESS [2.198s]
[INFO] org.teiid.designer.ddl.importer ................... SUCCESS [0.496s]
[INFO] org.teiid.designer.ddl.importer.ui ................ SUCCESS [0.951s]
[INFO] org.teiid.designer.extension.ui ................... SUCCESS [1.725s]
[INFO] org.teiid.designer.help ........................... SUCCESS [0.305s]
[INFO] org.teiid.designer.xsd ............................ SUCCESS [0.604s]
[INFO] org.teiid.designer.mapping.ui ..................... SUCCESS [2.512s]
[INFO] org.teiid.designer.metamodels.builder ............. SUCCESS [0.620s]
[INFO] org.teiid.designer.metamodels.builder.execution ... SUCCESS [0.683s]
[INFO] org.teiid.designer.metamodels.dependency .......... SUCCESS [0.651s]
[INFO] org.teiid.designer.metamodels.xsd.ui .............. SUCCESS [1.146s]
[INFO] org.teiid.designer.modelgenerator ................. SUCCESS [0.650s]
[INFO] org.wsdl4j ........................................ SUCCESS [0.268s]
[INFO] org.teiid.designer.modelgenerator.salesforce ...... SUCCESS [1.032s]
[INFO] org.teiid.designer.modelgenerator.salesforce.ui ... SUCCESS [1.032s]
[INFO] org.teiid.designer.modelgenerator.ui .............. SUCCESS [0.570s]
[INFO] org.teiid.designer.schema.tools ................... SUCCESS [0.994s]
[INFO] org.teiid.designer.modelgenerator.xml ............. SUCCESS [2.032s]
[INFO] org.teiid.designer.modelgenerator.wsdl ............ SUCCESS [1.643s]
[INFO] org.teiid.designer.xsd.ui ......................... SUCCESS [2.259s]
[INFO] org.teiid.designer.modelgenerator.wsdl.ui ......... SUCCESS [1.896s]
[INFO] org.teiid.designer.udf.ui ......................... SUCCESS [0.844s]
[INFO] org.teiid.designer.xml.ui ......................... SUCCESS [1.634s]
[INFO] org.teiid.designer.webservice.ui .................. SUCCESS [2.191s]
[INFO] teiid.features .................................... SUCCESS [0.041s]
[INFO] org.teiid.designer.feature ........................ SUCCESS [0.567s]
[INFO] teiid.tests ....................................... SUCCESS [0.047s]
[INFO] org.teiid.core.designer.test.framework ............ SUCCESS [0.592s]
[INFO] org.teiid.core.designer.test ...................... SUCCESS [21.447s]
[INFO] org.teiid.designer.compare.test ................... SUCCESS [14.241s]
[INFO] org.teiid.designer.core.test.framework ............ SUCCESS [1.423s]
[INFO] org.teiid.designer.core.test ...................... SUCCESS [54.020s]
[INFO] org.teiid.designer.core.xslt.test ................. SUCCESS [12.484s]
[INFO] org.teiid.designer.ddl.importer.test .............. SUCCESS [13.557s]
[INFO] org.teiid.designer.dqp.test ....................... SUCCESS [17.236s]
[INFO] org.teiid.designer.extension.test ................. SUCCESS [15.917s]
[INFO] org.teiid.designer.jdbc.test.framework ............ SUCCESS [0.710s]
[INFO] org.teiid.designer.jdbc.relational.test ........... SUCCESS [14.321s]
[INFO] org.teiid.designer.jdbc.test ...................... SUCCESS [16.242s]
[INFO] org.teiid.designer.mapping.ui.test ................ SUCCESS [21.231s]
[INFO] org.teiid.designer.metamodels.core.test ........... SUCCESS [14.906s]
[INFO] org.teiid.designer.metamodels.relational.test ..... FAILURE [10.309s]
[INFO] org.teiid.designer.metamodels.transformation.test . SUCCESS [13.602s]
[INFO] org.teiid.designer.metamodels.wsdl.test ........... SUCCESS [17.315s]
[INFO] org.teiid.designer.metamodels.xml.test ............ SUCCESS [14.936s]
[INFO] org.teiid.designer.modelgenerator.salesforce.test . SUCCESS [16.962s]
[INFO] org.teiid.designer.modelgenerator.test ............ SUCCESS [16.840s]
[INFO] org.teiid.designer.modelgenerator.wsdl.test ....... SUCCESS [19.123s]
[INFO] org.teiid.designer.query.ui.test .................. SUCCESS [15.810s]
[INFO] org.teiid.designer.schema.tools.test .............. SUCCESS [15.020s]
[INFO] org.teiid.designer.sdt.test ....................... SUCCESS [13.787s]
[INFO] org.teiid.designer.test ........................... SUCCESS [0.778s]
[INFO] org.teiid.designer.transformation.test ............ SUCCESS [17.559s]
[INFO] org.teiid.designer.ui.common.test ................. SUCCESS [24.559s]
[INFO] org.teiid.designer.ui.test ........................ SUCCESS [16.786s]
[INFO] org.teiid.designer.webservice.test ................ SUCCESS [16.954s]
[INFO] org.teiid.designer.webservice.ui.test ............. SUCCESS [17.949s]
[INFO] org.teiid.designer.xml.ui.test .................... SUCCESS [13.784s]
[INFO] org.teiid.designer.xsd.ui.test .................... SUCCESS [17.767s]
[INFO] org.teiid.designer.ui.bot.test .................... SUCCESS [37.734s]
[INFO] org.teiid.designer.vdb.test ....................... SUCCESS [19.249s]
[INFO] org.teiid.designer.test.feature ................... SKIPPED
[INFO] org.teiid.designer.runtime.feature ................ SUCCESS [0.816s]
[INFO] org.teiid.datatools.connectivity.feature .......... SUCCESS [0.244s]
[INFO] teiid.site ........................................ SKIPPED
[INFO] ------------------------------------------------------------------------
[INFO] BUILD FAILURE
[INFO] ------------------------------------------------------------------------
[INFO] Total time: 13:10.940s
[INFO] Finished at: Mon Jul 16 17:56:06 EDT 2012
[INFO] Final Memory: 162M/507M
[INFO] ------------------------------------------------------------------------
[ERROR] Failed to execute goal org.eclipse.tycho:tycho-surefire-plugin:0.15.0:test (default-test) on project org.teiid.designer.metamodels.relational.test: An unexpected error occured (return code 13). See log for details. -> [Help 1]
[ERROR] 
[ERROR] To see the full stack trace of the errors, re-run Maven with the -e switch.
[ERROR] Re-run Maven using the -X switch to enable full debug logging.
[ERROR] 
[ERROR] For more information about the errors and possible solutions, please read the following articles:
[ERROR] [Help 1] http://cwiki.apache.org/confluence/display/MAVEN/MojoFailureException
[ERROR] 
[ERROR] After correcting the problems, you can resume the build with the command
[ERROR]   mvn <goals> -rf :org.teiid.designer.metamodels.relational.test
Build step 'Invoke top-level Maven targets' marked build as failure
Terminating xvnc.
$ vncserver -kill :216
Killing Xvnc process ID 9382
Archiving artifacts
Recording test results



More information about the teiid-designer-dev mailing list