[teiid-designer-dev] Build failed in Jenkins: jbosstools-teiid-designer_trunk #2145 (master)

ci-builds at redhat.com ci-builds at redhat.com
Mon Jan 21 14:41:28 EST 2013


See <http://jenkins.mw.lab.eng.bos.redhat.com/hudson/job/jbosstools-teiid-designer_trunk/2145/changes>

Changes:

[blafond] TEIIDDES-1564

------------------------------------------
[...truncated 456 lines...]
Downloading: http://repository.jboss.org/maven2/org/eclipse/tycho/tycho-source-plugin/0.16.0/tycho-source-plugin-0.16.0.pom
Downloading: http://snapshots.jboss.org/maven2/org/eclipse/tycho/tycho-source-plugin/0.16.0/tycho-source-plugin-0.16.0.pom
Downloading: https://repository.jboss.org/nexus/content/groups/developer/org/eclipse/tycho/tycho-source-plugin/0.16.0/tycho-source-plugin-0.16.0.pom
Downloaded: https://repository.jboss.org/nexus/content/groups/developer/org/eclipse/tycho/tycho-source-plugin/0.16.0/tycho-source-plugin-0.16.0.pom (3 KB at 12.1 KB/sec)
Downloading: http://repository.jboss.org/maven2/org/eclipse/tycho/tycho-source-plugin/0.16.0/tycho-source-plugin-0.16.0.jar
Downloading: http://snapshots.jboss.org/maven2/org/eclipse/tycho/tycho-source-plugin/0.16.0/tycho-source-plugin-0.16.0.jar
Downloading: https://repository.jboss.org/nexus/content/groups/developer/org/eclipse/tycho/tycho-source-plugin/0.16.0/tycho-source-plugin-0.16.0.jar
Downloaded: https://repository.jboss.org/nexus/content/groups/developer/org/eclipse/tycho/tycho-source-plugin/0.16.0/tycho-source-plugin-0.16.0.jar (18 KB at 61.5 KB/sec)
Downloading: http://repository.jboss.org/maven2/org/apache/maven/plugins/maven-source-plugin/2.1/maven-source-plugin-2.1.pom
Downloaded: http://repository.jboss.org/maven2/org/apache/maven/plugins/maven-source-plugin/2.1/maven-source-plugin-2.1.pom (5 KB at 15.2 KB/sec)
Downloading: http://repository.jboss.org/maven2/org/apache/maven/plugins/maven-plugins/13/maven-plugins-13.pom
[WARNING] Checksum validation failed, expected dfbacfc6302d31460cee3a60f1805cb51fff8fe9 but is bb4f5f7151104ffe6f4d303276c030c69aca669c for http://repository.jboss.org/maven2/org/apache/maven/plugins/maven-plugins/13/maven-plugins-13.pom
[WARNING] Checksum validation failed, expected dfbacfc6302d31460cee3a60f1805cb51fff8fe9 but is bb4f5f7151104ffe6f4d303276c030c69aca669c for http://repository.jboss.org/maven2/org/apache/maven/plugins/maven-plugins/13/maven-plugins-13.pom
Downloaded: http://repository.jboss.org/maven2/org/apache/maven/plugins/maven-plugins/13/maven-plugins-13.pom (12 KB at 23.4 KB/sec)
Downloading: http://repository.jboss.org/maven2/org/apache/maven/maven-parent/11/maven-parent-11.pom
Downloading: http://snapshots.jboss.org/maven2/org/apache/maven/maven-parent/11/maven-parent-11.pom
Downloading: https://repository.jboss.org/nexus/content/groups/developer/org/apache/maven/maven-parent/11/maven-parent-11.pom
Downloaded: https://repository.jboss.org/nexus/content/groups/developer/org/apache/maven/maven-parent/11/maven-parent-11.pom (32 KB at 113.4 KB/sec)
Downloading: http://repository.jboss.org/maven2/org/apache/apache/5/apache-5.pom
Downloading: http://snapshots.jboss.org/maven2/org/apache/apache/5/apache-5.pom
Downloading: https://repository.jboss.org/nexus/content/groups/developer/org/apache/apache/5/apache-5.pom
Downloaded: https://repository.jboss.org/nexus/content/groups/developer/org/apache/apache/5/apache-5.pom (5 KB at 21.1 KB/sec)
Downloading: http://repository.jboss.org/maven2/org/apache/maven/maven-archiver/2.5/maven-archiver-2.5.pom
Downloading: http://snapshots.jboss.org/maven2/org/apache/maven/maven-archiver/2.5/maven-archiver-2.5.pom
Downloading: https://repository.jboss.org/nexus/content/groups/developer/org/apache/maven/maven-archiver/2.5/maven-archiver-2.5.pom
Downloaded: https://repository.jboss.org/nexus/content/groups/developer/org/apache/maven/maven-archiver/2.5/maven-archiver-2.5.pom (5 KB at 21.4 KB/sec)
Downloading: http://repository.jboss.org/maven2/org/apache/maven/shared/maven-shared-components/17/maven-shared-components-17.pom
Downloading: http://snapshots.jboss.org/maven2/org/apache/maven/shared/maven-shared-components/17/maven-shared-components-17.pom
Downloading: https://repository.jboss.org/nexus/content/groups/developer/org/apache/maven/shared/maven-shared-components/17/maven-shared-components-17.pom
Downloaded: https://repository.jboss.org/nexus/content/groups/developer/org/apache/maven/shared/maven-shared-components/17/maven-shared-components-17.pom (9 KB at 31.4 KB/sec)
Downloading: http://repository.jboss.org/maven2/org/apache/maven/maven-parent/21/maven-parent-21.pom
Downloading: http://snapshots.jboss.org/maven2/org/apache/maven/maven-parent/21/maven-parent-21.pom
Downloading: https://repository.jboss.org/nexus/content/groups/developer/org/apache/maven/maven-parent/21/maven-parent-21.pom
Downloaded: https://repository.jboss.org/nexus/content/groups/developer/org/apache/maven/maven-parent/21/maven-parent-21.pom (26 KB at 71.3 KB/sec)
Downloading: http://repository.jboss.org/maven2/org/apache/apache/10/apache-10.pom
Downloading: http://snapshots.jboss.org/maven2/org/apache/apache/10/apache-10.pom
Downloading: https://repository.jboss.org/nexus/content/groups/developer/org/apache/apache/10/apache-10.pom
Downloaded: https://repository.jboss.org/nexus/content/groups/developer/org/apache/apache/10/apache-10.pom (15 KB at 47.2 KB/sec)
Downloading: http://repository.jboss.org/maven2/org/codehaus/plexus/plexus-interpolation/1.15/plexus-interpolation-1.15.pom
Downloading: http://snapshots.jboss.org/maven2/org/codehaus/plexus/plexus-interpolation/1.15/plexus-interpolation-1.15.pom
Downloading: https://repository.jboss.org/nexus/content/groups/developer/org/codehaus/plexus/plexus-interpolation/1.15/plexus-interpolation-1.15.pom
Downloaded: https://repository.jboss.org/nexus/content/groups/developer/org/codehaus/plexus/plexus-interpolation/1.15/plexus-interpolation-1.15.pom (1018 B at 5.1 KB/sec)
Downloading: http://repository.jboss.org/maven2/org/codehaus/plexus/plexus/3.0.1/plexus-3.0.1.pom
Downloading: http://snapshots.jboss.org/maven2/org/codehaus/plexus/plexus/3.0.1/plexus-3.0.1.pom
Downloading: https://repository.jboss.org/nexus/content/groups/developer/org/codehaus/plexus/plexus/3.0.1/plexus-3.0.1.pom
Downloaded: https://repository.jboss.org/nexus/content/groups/developer/org/codehaus/plexus/plexus/3.0.1/plexus-3.0.1.pom (19 KB at 45.4 KB/sec)
Downloading: http://repository.jboss.org/maven2/org/apache/maven/plugins/maven-source-plugin/2.1/maven-source-plugin-2.1.jar
Downloading: http://repository.jboss.org/maven2/org/apache/maven/maven-archiver/2.5/maven-archiver-2.5.jar
Downloaded: http://repository.jboss.org/maven2/org/apache/maven/plugins/maven-source-plugin/2.1/maven-source-plugin-2.1.jar (24 KB at 57.2 KB/sec)
Downloading: http://snapshots.jboss.org/maven2/org/apache/maven/maven-archiver/2.5/maven-archiver-2.5.jar
Downloading: https://repository.jboss.org/nexus/content/groups/developer/org/apache/maven/maven-archiver/2.5/maven-archiver-2.5.jar
Downloaded: https://repository.jboss.org/nexus/content/groups/developer/org/apache/maven/maven-archiver/2.5/maven-archiver-2.5.jar (22 KB at 70.1 KB/sec)
Downloading: http://repository.jboss.org/maven2/org/apache/maven/plugins/maven-resources-plugin/2.4.1/maven-resources-plugin-2.4.1.pom
Downloading: http://snapshots.jboss.org/maven2/org/apache/maven/plugins/maven-resources-plugin/2.4.1/maven-resources-plugin-2.4.1.pom
Downloading: https://repository.jboss.org/nexus/content/groups/developer/org/apache/maven/plugins/maven-resources-plugin/2.4.1/maven-resources-plugin-2.4.1.pom
Downloaded: https://repository.jboss.org/nexus/content/groups/developer/org/apache/maven/plugins/maven-resources-plugin/2.4.1/maven-resources-plugin-2.4.1.pom (6 KB at 25.1 KB/sec)
Downloading: http://repository.jboss.org/maven2/org/apache/maven/plugins/maven-plugins/14/maven-plugins-14.pom
Downloading: http://snapshots.jboss.org/maven2/org/apache/maven/plugins/maven-plugins/14/maven-plugins-14.pom
Downloading: https://repository.jboss.org/nexus/content/groups/developer/org/apache/maven/plugins/maven-plugins/14/maven-plugins-14.pom
Downloaded: https://repository.jboss.org/nexus/content/groups/developer/org/apache/maven/plugins/maven-plugins/14/maven-plugins-14.pom (13 KB at 40.8 KB/sec)
Downloading: http://repository.jboss.org/maven2/org/apache/maven/maven-parent/13/maven-parent-13.pom
Downloading: http://snapshots.jboss.org/maven2/org/apache/maven/maven-parent/13/maven-parent-13.pom
Downloading: https://repository.jboss.org/nexus/content/groups/developer/org/apache/maven/maven-parent/13/maven-parent-13.pom
Downloaded: https://repository.jboss.org/nexus/content/groups/developer/org/apache/maven/maven-parent/13/maven-parent-13.pom (23 KB at 65.0 KB/sec)
Downloading: http://repository.jboss.org/maven2/org/apache/maven/plugins/maven-resources-plugin/2.4.1/maven-resources-plugin-2.4.1.jar
Downloading: http://snapshots.jboss.org/maven2/org/apache/maven/plugins/maven-resources-plugin/2.4.1/maven-resources-plugin-2.4.1.jar
Downloading: https://repository.jboss.org/nexus/content/groups/developer/org/apache/maven/plugins/maven-resources-plugin/2.4.1/maven-resources-plugin-2.4.1.jar
Downloaded: https://repository.jboss.org/nexus/content/groups/developer/org/apache/maven/plugins/maven-resources-plugin/2.4.1/maven-resources-plugin-2.4.1.jar (24 KB at 80.9 KB/sec)
Downloading: http://repository.jboss.org/maven2/org/jacoco/jacoco-maven-plugin/0.5.7.201204190339/jacoco-maven-plugin-0.5.7.201204190339.pom
Downloading: http://snapshots.jboss.org/maven2/org/jacoco/jacoco-maven-plugin/0.5.7.201204190339/jacoco-maven-plugin-0.5.7.201204190339.pom
Downloading: https://repository.jboss.org/nexus/content/groups/developer/org/jacoco/jacoco-maven-plugin/0.5.7.201204190339/jacoco-maven-plugin-0.5.7.201204190339.pom
Downloaded: https://repository.jboss.org/nexus/content/groups/developer/org/jacoco/jacoco-maven-plugin/0.5.7.201204190339/jacoco-maven-plugin-0.5.7.201204190339.pom (4 KB at 15.2 KB/sec)
Downloading: http://repository.jboss.org/maven2/org/jacoco/org.jacoco.build/0.5.7.201204190339/org.jacoco.build-0.5.7.201204190339.pom
Downloading: http://snapshots.jboss.org/maven2/org/jacoco/org.jacoco.build/0.5.7.201204190339/org.jacoco.build-0.5.7.201204190339.pom
Downloading: https://repository.jboss.org/nexus/content/groups/developer/org/jacoco/org.jacoco.build/0.5.7.201204190339/org.jacoco.build-0.5.7.201204190339.pom
Downloaded: https://repository.jboss.org/nexus/content/groups/developer/org/jacoco/org.jacoco.build/0.5.7.201204190339/org.jacoco.build-0.5.7.201204190339.pom (27 KB at 72.3 KB/sec)
Downloading: http://repository.jboss.org/maven2/org/jacoco/jacoco-maven-plugin/0.5.7.201204190339/jacoco-maven-plugin-0.5.7.201204190339.jar
Downloading: http://snapshots.jboss.org/maven2/org/jacoco/jacoco-maven-plugin/0.5.7.201204190339/jacoco-maven-plugin-0.5.7.201204190339.jar
Downloading: https://repository.jboss.org/nexus/content/groups/developer/org/jacoco/jacoco-maven-plugin/0.5.7.201204190339/jacoco-maven-plugin-0.5.7.201204190339.jar
Downloaded: https://repository.jboss.org/nexus/content/groups/developer/org/jacoco/jacoco-maven-plugin/0.5.7.201204190339/jacoco-maven-plugin-0.5.7.201204190339.jar (24 KB at 84.0 KB/sec)
Downloading: http://repository.jboss.org/maven2/org/codehaus/mojo/javacc-maven-plugin/2.4/javacc-maven-plugin-2.4.pom
Downloaded: http://repository.jboss.org/maven2/org/codehaus/mojo/javacc-maven-plugin/2.4/javacc-maven-plugin-2.4.pom (10 KB at 29.2 KB/sec)
Downloading: http://repository.jboss.org/maven2/org/codehaus/mojo/mojo/16/mojo-16.pom
Downloaded: http://repository.jboss.org/maven2/org/codehaus/mojo/mojo/16/mojo-16.pom (9 KB at 52.9 KB/sec)
Downloading: http://repository.jboss.org/maven2/org/codehaus/mojo/javacc-maven-plugin/2.4/javacc-maven-plugin-2.4.jar
Downloaded: http://repository.jboss.org/maven2/org/codehaus/mojo/javacc-maven-plugin/2.4/javacc-maven-plugin-2.4.jar (56 KB at 134.5 KB/sec)
Downloading: http://repository.jboss.org/maven2/org/apache/maven/plugins/maven-clean-plugin/2.4.1/maven-clean-plugin-2.4.1.pom
Downloading: http://snapshots.jboss.org/maven2/org/apache/maven/plugins/maven-clean-plugin/2.4.1/maven-clean-plugin-2.4.1.pom
Downloading: https://repository.jboss.org/nexus/content/groups/developer/org/apache/maven/plugins/maven-clean-plugin/2.4.1/maven-clean-plugin-2.4.1.pom
Downloaded: https://repository.jboss.org/nexus/content/groups/developer/org/apache/maven/plugins/maven-clean-plugin/2.4.1/maven-clean-plugin-2.4.1.pom (5 KB at 13.2 KB/sec)
Downloading: http://repository.jboss.org/maven2/org/apache/maven/plugins/maven-plugins/18/maven-plugins-18.pom
Downloading: http://snapshots.jboss.org/maven2/org/apache/maven/plugins/maven-plugins/18/maven-plugins-18.pom
Downloading: https://repository.jboss.org/nexus/content/groups/developer/org/apache/maven/plugins/maven-plugins/18/maven-plugins-18.pom
Downloaded: https://repository.jboss.org/nexus/content/groups/developer/org/apache/maven/plugins/maven-plugins/18/maven-plugins-18.pom (13 KB at 43.3 KB/sec)
Downloading: http://repository.jboss.org/maven2/org/apache/maven/maven-parent/16/maven-parent-16.pom
Downloading: http://snapshots.jboss.org/maven2/org/apache/maven/maven-parent/16/maven-parent-16.pom
Downloading: https://repository.jboss.org/nexus/content/groups/developer/org/apache/maven/maven-parent/16/maven-parent-16.pom
Downloaded: https://repository.jboss.org/nexus/content/groups/developer/org/apache/maven/maven-parent/16/maven-parent-16.pom (23 KB at 82.0 KB/sec)
Downloading: http://repository.jboss.org/maven2/org/apache/apache/7/apache-7.pom
Downloading: http://snapshots.jboss.org/maven2/org/apache/apache/7/apache-7.pom
Downloading: https://repository.jboss.org/nexus/content/groups/developer/org/apache/apache/7/apache-7.pom
Downloaded: https://repository.jboss.org/nexus/content/groups/developer/org/apache/apache/7/apache-7.pom (15 KB at 51.1 KB/sec)
Downloading: http://repository.jboss.org/maven2/org/apache/maven/plugins/maven-clean-plugin/2.4.1/maven-clean-plugin-2.4.1.jar
Downloading: http://snapshots.jboss.org/maven2/org/apache/maven/plugins/maven-clean-plugin/2.4.1/maven-clean-plugin-2.4.1.jar
Downloading: https://repository.jboss.org/nexus/content/groups/developer/org/apache/maven/plugins/maven-clean-plugin/2.4.1/maven-clean-plugin-2.4.1.jar
Downloaded: https://repository.jboss.org/nexus/content/groups/developer/org/apache/maven/plugins/maven-clean-plugin/2.4.1/maven-clean-plugin-2.4.1.jar (23 KB at 81.3 KB/sec)
Downloading: http://repository.jboss.org/maven2/org/apache/maven/plugins/maven-install-plugin/2.3.1/maven-install-plugin-2.3.1.pom
Downloading: http://snapshots.jboss.org/maven2/org/apache/maven/plugins/maven-install-plugin/2.3.1/maven-install-plugin-2.3.1.pom
Downloading: https://repository.jboss.org/nexus/content/groups/developer/org/apache/maven/plugins/maven-install-plugin/2.3.1/maven-install-plugin-2.3.1.pom
Downloaded: https://repository.jboss.org/nexus/content/groups/developer/org/apache/maven/plugins/maven-install-plugin/2.3.1/maven-install-plugin-2.3.1.pom (5 KB at 23.5 KB/sec)
Downloading: http://repository.jboss.org/maven2/org/apache/maven/plugins/maven-install-plugin/2.3.1/maven-install-plugin-2.3.1.jar
Downloading: http://snapshots.jboss.org/maven2/org/apache/maven/plugins/maven-install-plugin/2.3.1/maven-install-plugin-2.3.1.jar
Downloading: https://repository.jboss.org/nexus/content/groups/developer/org/apache/maven/plugins/maven-install-plugin/2.3.1/maven-install-plugin-2.3.1.jar
Downloaded: https://repository.jboss.org/nexus/content/groups/developer/org/apache/maven/plugins/maven-install-plugin/2.3.1/maven-install-plugin-2.3.1.jar (23 KB at 81.7 KB/sec)
Downloading: http://repository.jboss.org/maven2/org/eclipse/tycho/tycho-p2-plugin/0.16.0/tycho-p2-plugin-0.16.0.pom
Downloading: http://snapshots.jboss.org/maven2/org/eclipse/tycho/tycho-p2-plugin/0.16.0/tycho-p2-plugin-0.16.0.pom
Downloading: https://repository.jboss.org/nexus/content/groups/developer/org/eclipse/tycho/tycho-p2-plugin/0.16.0/tycho-p2-plugin-0.16.0.pom
Downloaded: https://repository.jboss.org/nexus/content/groups/developer/org/eclipse/tycho/tycho-p2-plugin/0.16.0/tycho-p2-plugin-0.16.0.pom (3 KB at 10.6 KB/sec)
Downloading: http://repository.jboss.org/maven2/org/eclipse/tycho/tycho-p2-plugin/0.16.0/tycho-p2-plugin-0.16.0.jar
Downloading: http://snapshots.jboss.org/maven2/org/eclipse/tycho/tycho-p2-plugin/0.16.0/tycho-p2-plugin-0.16.0.jar
Downloading: https://repository.jboss.org/nexus/content/groups/developer/org/eclipse/tycho/tycho-p2-plugin/0.16.0/tycho-p2-plugin-0.16.0.jar
Downloaded: https://repository.jboss.org/nexus/content/groups/developer/org/eclipse/tycho/tycho-p2-plugin/0.16.0/tycho-p2-plugin-0.16.0.jar (24 KB at 65.2 KB/sec)
Downloading: http://repository.jboss.org/maven2/org/eclipse/tycho/sisu-equinox-launching/0.16.0/sisu-equinox-launching-0.16.0.pom
Downloading: http://snapshots.jboss.org/maven2/org/eclipse/tycho/sisu-equinox-launching/0.16.0/sisu-equinox-launching-0.16.0.pom
Downloading: https://repository.jboss.org/nexus/content/groups/developer/org/eclipse/tycho/sisu-equinox-launching/0.16.0/sisu-equinox-launching-0.16.0.pom
Downloaded: https://repository.jboss.org/nexus/content/groups/developer/org/eclipse/tycho/sisu-equinox-launching/0.16.0/sisu-equinox-launching-0.16.0.pom (3 KB at 11.4 KB/sec)
Downloading: http://repository.jboss.org/maven2/org/eclipse/tycho/tycho-artifactcomparator/0.16.0/tycho-artifactcomparator-0.16.0.pom
Downloading: http://snapshots.jboss.org/maven2/org/eclipse/tycho/tycho-artifactcomparator/0.16.0/tycho-artifactcomparator-0.16.0.pom
Downloading: https://repository.jboss.org/nexus/content/groups/developer/org/eclipse/tycho/tycho-artifactcomparator/0.16.0/tycho-artifactcomparator-0.16.0.pom
Downloaded: https://repository.jboss.org/nexus/content/groups/developer/org/eclipse/tycho/tycho-artifactcomparator/0.16.0/tycho-artifactcomparator-0.16.0.pom (2 KB at 8.8 KB/sec)
Downloading: http://repository.jboss.org/maven2/org/ow2/asm/asm-debug-all/4.0/asm-debug-all-4.0.pom
Downloading: http://snapshots.jboss.org/maven2/org/ow2/asm/asm-debug-all/4.0/asm-debug-all-4.0.pom
Downloading: https://repository.jboss.org/nexus/content/groups/developer/org/ow2/asm/asm-debug-all/4.0/asm-debug-all-4.0.pom
Downloaded: https://repository.jboss.org/nexus/content/groups/developer/org/ow2/asm/asm-debug-all/4.0/asm-debug-all-4.0.pom (2 KB at 9.7 KB/sec)
Downloading: http://repository.jboss.org/maven2/org/ow2/asm/asm-parent/4.0/asm-parent-4.0.pom
Downloading: http://snapshots.jboss.org/maven2/org/ow2/asm/asm-parent/4.0/asm-parent-4.0.pom
Downloading: https://repository.jboss.org/nexus/content/groups/developer/org/ow2/asm/asm-parent/4.0/asm-parent-4.0.pom
Downloaded: https://repository.jboss.org/nexus/content/groups/developer/org/ow2/asm/asm-parent/4.0/asm-parent-4.0.pom (6 KB at 19.3 KB/sec)
Downloading: http://repository.jboss.org/maven2/org/ow2/ow2/1.3/ow2-1.3.pom
Downloading: http://snapshots.jboss.org/maven2/org/ow2/ow2/1.3/ow2-1.3.pom
Downloading: https://repository.jboss.org/nexus/content/groups/developer/org/ow2/ow2/1.3/ow2-1.3.pom
Downloaded: https://repository.jboss.org/nexus/content/groups/developer/org/ow2/ow2/1.3/ow2-1.3.pom (10 KB at 33.9 KB/sec)
Downloading: http://repository.jboss.org/maven2/org/eclipse/tycho/sisu-equinox-launching/0.16.0/sisu-equinox-launching-0.16.0.jar
Downloading: http://repository.jboss.org/maven2/org/eclipse/tycho/tycho-artifactcomparator/0.16.0/tycho-artifactcomparator-0.16.0.jar
Downloading: http://repository.jboss.org/maven2/org/ow2/asm/asm-debug-all/4.0/asm-debug-all-4.0.jar
Downloading: http://snapshots.jboss.org/maven2/org/eclipse/tycho/sisu-equinox-launching/0.16.0/sisu-equinox-launching-0.16.0.jar
Downloading: http://snapshots.jboss.org/maven2/org/eclipse/tycho/tycho-artifactcomparator/0.16.0/tycho-artifactcomparator-0.16.0.jar
Downloading: http://snapshots.jboss.org/maven2/org/ow2/asm/asm-debug-all/4.0/asm-debug-all-4.0.jar
Downloading: https://repository.jboss.org/nexus/content/groups/developer/org/eclipse/tycho/sisu-equinox-launching/0.16.0/sisu-equinox-launching-0.16.0.jar
Downloading: https://repository.jboss.org/nexus/content/groups/developer/org/eclipse/tycho/tycho-artifactcomparator/0.16.0/tycho-artifactcomparator-0.16.0.jar
Downloading: https://repository.jboss.org/nexus/content/groups/developer/org/ow2/asm/asm-debug-all/4.0/asm-debug-all-4.0.jar
Downloaded: https://repository.jboss.org/nexus/content/groups/developer/org/eclipse/tycho/sisu-equinox-launching/0.16.0/sisu-equinox-launching-0.16.0.jar (28 KB at 77.5 KB/sec)
Downloaded: https://repository.jboss.org/nexus/content/groups/developer/org/eclipse/tycho/tycho-artifactcomparator/0.16.0/tycho-artifactcomparator-0.16.0.jar (19 KB at 32.5 KB/sec)
Downloaded: https://repository.jboss.org/nexus/content/groups/developer/org/ow2/asm/asm-debug-all/4.0/asm-debug-all-4.0.jar (314 KB at 292.9 KB/sec)
Downloading: http://repository.jboss.org/maven2/org/apache/maven/plugins/maven-deploy-plugin/2.5/maven-deploy-plugin-2.5.pom
Downloading: http://snapshots.jboss.org/maven2/org/apache/maven/plugins/maven-deploy-plugin/2.5/maven-deploy-plugin-2.5.pom
Downloading: https://repository.jboss.org/nexus/content/groups/developer/org/apache/maven/plugins/maven-deploy-plugin/2.5/maven-deploy-plugin-2.5.pom
Downloaded: https://repository.jboss.org/nexus/content/groups/developer/org/apache/maven/plugins/maven-deploy-plugin/2.5/maven-deploy-plugin-2.5.pom (6 KB at 27.5 KB/sec)
Downloading: http://repository.jboss.org/maven2/org/apache/maven/plugins/maven-plugins/16/maven-plugins-16.pom
Downloading: http://snapshots.jboss.org/maven2/org/apache/maven/plugins/maven-plugins/16/maven-plugins-16.pom
Downloading: https://repository.jboss.org/nexus/content/groups/developer/org/apache/maven/plugins/maven-plugins/16/maven-plugins-16.pom
Downloaded: https://repository.jboss.org/nexus/content/groups/developer/org/apache/maven/plugins/maven-plugins/16/maven-plugins-16.pom (13 KB at 60.5 KB/sec)
Downloading: http://repository.jboss.org/maven2/org/apache/maven/plugins/maven-deploy-plugin/2.5/maven-deploy-plugin-2.5.jar
Downloading: http://snapshots.jboss.org/maven2/org/apache/maven/plugins/maven-deploy-plugin/2.5/maven-deploy-plugin-2.5.jar
Downloading: https://repository.jboss.org/nexus/content/groups/developer/org/apache/maven/plugins/maven-deploy-plugin/2.5/maven-deploy-plugin-2.5.jar
Downloaded: https://repository.jboss.org/nexus/content/groups/developer/org/apache/maven/plugins/maven-deploy-plugin/2.5/maven-deploy-plugin-2.5.jar (23 KB at 82.3 KB/sec)
Downloading: http://repository.jboss.org/maven2/org/apache/maven/plugins/maven-site-plugin/3.0/maven-site-plugin-3.0.pom
Downloading: http://snapshots.jboss.org/maven2/org/apache/maven/plugins/maven-site-plugin/3.0/maven-site-plugin-3.0.pom
Downloading: https://repository.jboss.org/nexus/content/groups/developer/org/apache/maven/plugins/maven-site-plugin/3.0/maven-site-plugin-3.0.pom
Downloaded: https://repository.jboss.org/nexus/content/groups/developer/org/apache/maven/plugins/maven-site-plugin/3.0/maven-site-plugin-3.0.pom (20 KB at 56.5 KB/sec)
Downloading: http://repository.jboss.org/maven2/org/apache/maven/plugins/maven-site-plugin/3.0/maven-site-plugin-3.0.jar
Downloading: http://snapshots.jboss.org/maven2/org/apache/maven/plugins/maven-site-plugin/3.0/maven-site-plugin-3.0.jar
Downloading: https://repository.jboss.org/nexus/content/groups/developer/org/apache/maven/plugins/maven-site-plugin/3.0/maven-site-plugin-3.0.jar
Downloaded: https://repository.jboss.org/nexus/content/groups/developer/org/apache/maven/plugins/maven-site-plugin/3.0/maven-site-plugin-3.0.jar (112 KB at 216.8 KB/sec)
Downloading: http://repository.jboss.org/maven2/org/eclipse/tycho/tycho-p2-publisher-plugin/0.16.0/tycho-p2-publisher-plugin-0.16.0.pom
Downloading: http://snapshots.jboss.org/maven2/org/eclipse/tycho/tycho-p2-publisher-plugin/0.16.0/tycho-p2-publisher-plugin-0.16.0.pom
Downloading: https://repository.jboss.org/nexus/content/groups/developer/org/eclipse/tycho/tycho-p2-publisher-plugin/0.16.0/tycho-p2-publisher-plugin-0.16.0.pom
Downloaded: https://repository.jboss.org/nexus/content/groups/developer/org/eclipse/tycho/tycho-p2-publisher-plugin/0.16.0/tycho-p2-publisher-plugin-0.16.0.pom (2 KB at 4.7 KB/sec)
Downloading: http://repository.jboss.org/maven2/org/eclipse/tycho/tycho-p2-publisher-plugin/0.16.0/tycho-p2-publisher-plugin-0.16.0.jar
Downloading: http://snapshots.jboss.org/maven2/org/eclipse/tycho/tycho-p2-publisher-plugin/0.16.0/tycho-p2-publisher-plugin-0.16.0.jar
Downloading: https://repository.jboss.org/nexus/content/groups/developer/org/eclipse/tycho/tycho-p2-publisher-plugin/0.16.0/tycho-p2-publisher-plugin-0.16.0.jar
Downloaded: https://repository.jboss.org/nexus/content/groups/developer/org/eclipse/tycho/tycho-p2-publisher-plugin/0.16.0/tycho-p2-publisher-plugin-0.16.0.jar (21 KB at 57.4 KB/sec)
Downloading: http://repository.jboss.org/maven2/org/eclipse/tycho/tycho-p2-repository-plugin/0.16.0/tycho-p2-repository-plugin-0.16.0.pom
Downloading: http://snapshots.jboss.org/maven2/org/eclipse/tycho/tycho-p2-repository-plugin/0.16.0/tycho-p2-repository-plugin-0.16.0.pom
Downloading: https://repository.jboss.org/nexus/content/groups/developer/org/eclipse/tycho/tycho-p2-repository-plugin/0.16.0/tycho-p2-repository-plugin-0.16.0.pom
Downloaded: https://repository.jboss.org/nexus/content/groups/developer/org/eclipse/tycho/tycho-p2-repository-plugin/0.16.0/tycho-p2-repository-plugin-0.16.0.pom (2 KB at 6.6 KB/sec)
Downloading: http://repository.jboss.org/maven2/org/eclipse/tycho/tycho-p2-repository-plugin/0.16.0/tycho-p2-repository-plugin-0.16.0.jar
Downloading: http://snapshots.jboss.org/maven2/org/eclipse/tycho/tycho-p2-repository-plugin/0.16.0/tycho-p2-repository-plugin-0.16.0.jar
Downloading: https://repository.jboss.org/nexus/content/groups/developer/org/eclipse/tycho/tycho-p2-repository-plugin/0.16.0/tycho-p2-repository-plugin-0.16.0.jar
Downloaded: https://repository.jboss.org/nexus/content/groups/developer/org/eclipse/tycho/tycho-p2-repository-plugin/0.16.0/tycho-p2-repository-plugin-0.16.0.jar (10 KB at 34.0 KB/sec)
[INFO] Computing target platform for MavenProject: org.jboss.tools.teiid.plugins.teiid:org.teiid.7.7.x:8.1.0-SNAPSHOT @ <http://jenkins.mw.lab.eng.bos.redhat.com/hudson/job/jbosstools-teiid-designer_trunk/ws/sources/plugins/teiid/org.teiid.7.7.x/pom.xml>
[INFO] Adding repository http://download.jboss.org/jbosstools/updates/nightly/core/4.0.juno
[INFO] Fetching content.jar from http://download.jboss.org/jbosstools/updates/nightly/core/4.0.juno/ (0B of 112.25kB at 0B/s)
[INFO] Fetching content.jar from http://download.jboss.org/jbosstools/updates/nightly/core/4.0.juno/ (3.69kB of 112.25kB at 0B/s)
[INFO] 1 operation remaining.
[INFO] Adding repository http://download.jboss.org/jbosstools/updates/nightly/core/4.0.juno
[INFO] Fetching artifacts.jar from http://download.jboss.org/jbosstools/updates/nightly/core/4.0.juno/ (0B of 19.5kB at 0B/s)
[INFO] 1 operation remaining.
[INFO] Fetching artifacts.jar from http://download.jboss.org/jbosstools/updates/nightly/core/4.0.juno/ (3.7kB of 19.5kB at 0B/s)
[INFO] Adding repository http://download.jboss.org/jbosstools/updates/nightly/coretests/4.0.juno
[INFO] Fetching content.jar from http://download.jboss.org/jbosstools/updates/nightly/coretests/4.0.juno/ (0B of 39.65kB at 0B/s)
[INFO] 1 operation remaining.
[INFO] Fetching content.jar from http://download.jboss.org/jbosstools/updates/nightly/coretests/4.0.juno/ (3.7kB of 39.65kB at 0B/s)
[INFO] Adding repository http://download.jboss.org/jbosstools/updates/nightly/coretests/4.0.juno
[INFO] Fetching artifacts.jar from http://download.jboss.org/jbosstools/updates/nightly/coretests/4.0.juno/ (0B of 11.25kB at 0B/s)
[INFO] 1 operation remaining.
[INFO] Fetching artifacts.jar from http://download.jboss.org/jbosstools/updates/nightly/coretests/4.0.juno/ (3.7kB of 11.25kB at 0B/s)
[ERROR] Internal error: java.lang.RuntimeException: Failed to resolve target definition <http://jenkins.mw.lab.eng.bos.redhat.com/hudson/job/jbosstools-teiid-designer_trunk/ws/sources/target-platform/teiid-designer.target>: Could not find "org.jbosstools.locus.apache.poi.feature.feature.group/2.5.1.Final-v20130115-1620" in the repositories of the current location -> [Help 1]
org.apache.maven.InternalErrorException: Internal error: java.lang.RuntimeException: Failed to resolve target definition <http://jenkins.mw.lab.eng.bos.redhat.com/hudson/job/jbosstools-teiid-designer_trunk/ws/sources/target-platform/teiid-designer.target>
	at org.apache.maven.DefaultMaven.execute(DefaultMaven.java:168)
	at org.apache.maven.cli.MavenCli.execute(MavenCli.java:537)
	at org.apache.maven.cli.MavenCli.doMain(MavenCli.java:196)
	at org.apache.maven.cli.MavenCli.main(MavenCli.java:141)
	at sun.reflect.NativeMethodAccessorImpl.invoke0(Native Method)
	at sun.reflect.NativeMethodAccessorImpl.invoke(NativeMethodAccessorImpl.java:39)
	at sun.reflect.DelegatingMethodAccessorImpl.invoke(DelegatingMethodAccessorImpl.java:25)
	at java.lang.reflect.Method.invoke(Method.java:597)
	at org.codehaus.plexus.classworlds.launcher.Launcher.launchEnhanced(Launcher.java:290)
	at org.codehaus.plexus.classworlds.launcher.Launcher.launch(Launcher.java:230)
	at org.codehaus.plexus.classworlds.launcher.Launcher.mainWithExitCode(Launcher.java:409)
	at org.codehaus.plexus.classworlds.launcher.Launcher.main(Launcher.java:352)
Caused by: java.lang.RuntimeException: Failed to resolve target definition <http://jenkins.mw.lab.eng.bos.redhat.com/hudson/job/jbosstools-teiid-designer_trunk/ws/sources/target-platform/teiid-designer.target>
	at org.eclipse.tycho.p2.resolver.P2TargetPlatformResolver.addTargetFileContentToTargetPlatform(P2TargetPlatformResolver.java:338)
	at org.eclipse.tycho.p2.resolver.P2TargetPlatformResolver.computeTargetPlatform(P2TargetPlatformResolver.java:207)
	at org.eclipse.tycho.core.resolver.DefaultTychoDependencyResolver.resolveProject(DefaultTychoDependencyResolver.java:94)
	at org.eclipse.tycho.core.maven.TychoMavenLifecycleParticipant.afterProjectsRead(TychoMavenLifecycleParticipant.java:82)
	at org.apache.maven.DefaultMaven.doExecute(DefaultMaven.java:274)
	at org.apache.maven.DefaultMaven.execute(DefaultMaven.java:156)
	... 11 more
Caused by: org.eclipse.tycho.p2.target.facade.TargetDefinitionResolutionException: Could not find "org.jbosstools.locus.apache.poi.feature.feature.group/2.5.1.Final-v20130115-1620" in the repositories of the current location
	at org.eclipse.tycho.p2.target.TargetDefinitionResolver.getUnitInstance(TargetDefinitionResolver.java:199)
	at org.eclipse.tycho.p2.target.TargetDefinitionResolver.resolveContent(TargetDefinitionResolver.java:116)
	at org.eclipse.tycho.p2.target.TargetDefinitionResolverService.resolveFromArguments(TargetDefinitionResolverService.java:64)
	at org.eclipse.tycho.p2.target.TargetDefinitionResolverService.getTargetDefinitionContent(TargetDefinitionResolverService.java:54)
	at org.eclipse.tycho.p2.target.TargetPlatformBuilderImpl.addTargetDefinition(TargetPlatformBuilderImpl.java:289)
	at org.eclipse.tycho.p2.resolver.P2TargetPlatformResolver.addTargetFileContentToTargetPlatform(P2TargetPlatformResolver.java:331)
	... 16 more
[ERROR] 
[ERROR] To see the full stack trace of the errors, re-run Maven with the -e switch.
[ERROR] Re-run Maven using the -X switch to enable full debug logging.
[ERROR] 
[ERROR] For more information about the errors and possible solutions, please read the following articles:
[ERROR] [Help 1] http://cwiki.apache.org/confluence/display/MAVEN/InternalErrorException
Build step 'Invoke top-level Maven targets' marked build as failure
Terminating xvnc.
$ vncserver -kill :187
Killing Xvnc process ID 3866
Archiving artifacts
Recording test results



More information about the teiid-designer-dev mailing list