[teiid-designer-dev] Build failed in Jenkins: jbosstools-teiid-komodo #505 ()

ci-builds at redhat.com ci-builds at redhat.com
Wed Feb 18 21:25:53 EST 2015


See <http://jenkins.mw.lab.eng.bos.redhat.com/hudson/job/jbosstools-teiid-komodo/505/>

------------------------------------------
[...truncated 1775 lines...]
Downloading: http://repository.jboss.org/maven2/org/apache/maven/plugins/maven-plugins/16/maven-plugins-16.pom
Feb 18, 2015 9:25:08 PM org.apache.maven.wagon.providers.http.httpclient.client.protocol.ResponseProcessCookies processCookies
WARNING: Cookie rejected: "[version: 0][name: rememberMe][value: deleteMe][domain: repository.jboss.org][path: /nexus][expiry: Wed Feb 18 21:25:08 EST 2015]". Illegal path attribute "/nexus". Path of origin: "/maven2/org/apache/maven/plugins/maven-plugins/16/maven-plugins-16.pom"
Downloading: http://snapshots.jboss.org/maven2/org/apache/maven/plugins/maven-plugins/16/maven-plugins-16.pom
Downloading: https://repository.jboss.org/nexus/content/groups/developer/org/apache/maven/plugins/maven-plugins/16/maven-plugins-16.pom
Downloaded: https://repository.jboss.org/nexus/content/groups/developer/org/apache/maven/plugins/maven-plugins/16/maven-plugins-16.pom (13 KB at 50.8 KB/sec)
Downloading: http://repository.jboss.org/maven2/org/apache/maven/plugins/maven-deploy-plugin/2.5/maven-deploy-plugin-2.5.jar
Feb 18, 2015 9:25:09 PM org.apache.maven.wagon.providers.http.httpclient.client.protocol.ResponseProcessCookies processCookies
WARNING: Cookie rejected: "[version: 0][name: rememberMe][value: deleteMe][domain: repository.jboss.org][path: /nexus][expiry: Wed Feb 18 21:25:09 EST 2015]". Illegal path attribute "/nexus". Path of origin: "/maven2/org/apache/maven/plugins/maven-deploy-plugin/2.5/maven-deploy-plugin-2.5.jar"
Downloading: http://snapshots.jboss.org/maven2/org/apache/maven/plugins/maven-deploy-plugin/2.5/maven-deploy-plugin-2.5.jar
Downloading: https://repository.jboss.org/nexus/content/groups/developer/org/apache/maven/plugins/maven-deploy-plugin/2.5/maven-deploy-plugin-2.5.jar
Downloaded: https://repository.jboss.org/nexus/content/groups/developer/org/apache/maven/plugins/maven-deploy-plugin/2.5/maven-deploy-plugin-2.5.jar (23 KB at 91.7 KB/sec)
Downloading: http://repository.jboss.org/maven2/org/apache/maven/plugins/maven-site-plugin/3.0/maven-site-plugin-3.0.pom
Feb 18, 2015 9:25:09 PM org.apache.maven.wagon.providers.http.httpclient.client.protocol.ResponseProcessCookies processCookies
WARNING: Cookie rejected: "[version: 0][name: rememberMe][value: deleteMe][domain: repository.jboss.org][path: /nexus][expiry: Wed Feb 18 21:25:09 EST 2015]". Illegal path attribute "/nexus". Path of origin: "/maven2/org/apache/maven/plugins/maven-site-plugin/3.0/maven-site-plugin-3.0.pom"
Downloading: http://snapshots.jboss.org/maven2/org/apache/maven/plugins/maven-site-plugin/3.0/maven-site-plugin-3.0.pom
Downloading: https://repository.jboss.org/nexus/content/groups/developer/org/apache/maven/plugins/maven-site-plugin/3.0/maven-site-plugin-3.0.pom
Downloaded: https://repository.jboss.org/nexus/content/groups/developer/org/apache/maven/plugins/maven-site-plugin/3.0/maven-site-plugin-3.0.pom (20 KB at 75.9 KB/sec)
Downloading: http://repository.jboss.org/maven2/org/apache/maven/plugins/maven-plugins/21/maven-plugins-21.pom
Feb 18, 2015 9:25:10 PM org.apache.maven.wagon.providers.http.httpclient.client.protocol.ResponseProcessCookies processCookies
WARNING: Cookie rejected: "[version: 0][name: rememberMe][value: deleteMe][domain: repository.jboss.org][path: /nexus][expiry: Wed Feb 18 21:25:10 EST 2015]". Illegal path attribute "/nexus". Path of origin: "/maven2/org/apache/maven/plugins/maven-plugins/21/maven-plugins-21.pom"
Downloading: http://snapshots.jboss.org/maven2/org/apache/maven/plugins/maven-plugins/21/maven-plugins-21.pom
Downloading: https://repository.jboss.org/nexus/content/groups/developer/org/apache/maven/plugins/maven-plugins/21/maven-plugins-21.pom
Downloaded: https://repository.jboss.org/nexus/content/groups/developer/org/apache/maven/plugins/maven-plugins/21/maven-plugins-21.pom (13 KB at 37.4 KB/sec)
Downloading: http://repository.jboss.org/maven2/org/apache/maven/plugins/maven-site-plugin/3.0/maven-site-plugin-3.0.jar
Feb 18, 2015 9:25:10 PM org.apache.maven.wagon.providers.http.httpclient.client.protocol.ResponseProcessCookies processCookies
WARNING: Cookie rejected: "[version: 0][name: rememberMe][value: deleteMe][domain: repository.jboss.org][path: /nexus][expiry: Wed Feb 18 21:25:10 EST 2015]". Illegal path attribute "/nexus". Path of origin: "/maven2/org/apache/maven/plugins/maven-site-plugin/3.0/maven-site-plugin-3.0.jar"
Downloading: http://snapshots.jboss.org/maven2/org/apache/maven/plugins/maven-site-plugin/3.0/maven-site-plugin-3.0.jar
Downloading: https://repository.jboss.org/nexus/content/groups/developer/org/apache/maven/plugins/maven-site-plugin/3.0/maven-site-plugin-3.0.jar
Downloaded: https://repository.jboss.org/nexus/content/groups/developer/org/apache/maven/plugins/maven-site-plugin/3.0/maven-site-plugin-3.0.jar (112 KB at 273.1 KB/sec)
Downloading: http://repository.jboss.org/maven2/org/apache/maven/plugins/maven-dependency-plugin/2.4/maven-dependency-plugin-2.4.pom
Feb 18, 2015 9:25:12 PM org.apache.maven.wagon.providers.http.httpclient.client.protocol.ResponseProcessCookies processCookies
WARNING: Cookie rejected: "[version: 0][name: rememberMe][value: deleteMe][domain: repository.jboss.org][path: /nexus][expiry: Wed Feb 18 21:25:12 EST 2015]". Illegal path attribute "/nexus". Path of origin: "/maven2/org/apache/maven/plugins/maven-dependency-plugin/2.4/maven-dependency-plugin-2.4.pom"
Downloading: http://snapshots.jboss.org/maven2/org/apache/maven/plugins/maven-dependency-plugin/2.4/maven-dependency-plugin-2.4.pom
Downloading: https://repository.jboss.org/nexus/content/groups/developer/org/apache/maven/plugins/maven-dependency-plugin/2.4/maven-dependency-plugin-2.4.pom
Downloaded: https://repository.jboss.org/nexus/content/groups/developer/org/apache/maven/plugins/maven-dependency-plugin/2.4/maven-dependency-plugin-2.4.pom (11 KB at 42.8 KB/sec)
Downloading: http://repository.jboss.org/maven2/org/apache/maven/plugins/maven-dependency-plugin/2.4/maven-dependency-plugin-2.4.jar
Feb 18, 2015 9:25:12 PM org.apache.maven.wagon.providers.http.httpclient.client.protocol.ResponseProcessCookies processCookies
WARNING: Cookie rejected: "[version: 0][name: rememberMe][value: deleteMe][domain: repository.jboss.org][path: /nexus][expiry: Wed Feb 18 21:25:12 EST 2015]". Illegal path attribute "/nexus". Path of origin: "/maven2/org/apache/maven/plugins/maven-dependency-plugin/2.4/maven-dependency-plugin-2.4.jar"
Downloading: http://snapshots.jboss.org/maven2/org/apache/maven/plugins/maven-dependency-plugin/2.4/maven-dependency-plugin-2.4.jar
Downloading: https://repository.jboss.org/nexus/content/groups/developer/org/apache/maven/plugins/maven-dependency-plugin/2.4/maven-dependency-plugin-2.4.jar
Downloaded: https://repository.jboss.org/nexus/content/groups/developer/org/apache/maven/plugins/maven-dependency-plugin/2.4/maven-dependency-plugin-2.4.jar (132 KB at 271.6 KB/sec)
Downloading: http://repository.jboss.org/maven2/org/apache/maven/plugins/maven-scm-plugin/1.9.2/maven-scm-plugin-1.9.2.pom
Feb 18, 2015 9:25:13 PM org.apache.maven.wagon.providers.http.httpclient.client.protocol.ResponseProcessCookies processCookies
WARNING: Cookie rejected: "[version: 0][name: rememberMe][value: deleteMe][domain: repository.jboss.org][path: /nexus][expiry: Wed Feb 18 21:25:13 EST 2015]". Illegal path attribute "/nexus". Path of origin: "/maven2/org/apache/maven/plugins/maven-scm-plugin/1.9.2/maven-scm-plugin-1.9.2.pom"
Downloading: http://snapshots.jboss.org/maven2/org/apache/maven/plugins/maven-scm-plugin/1.9.2/maven-scm-plugin-1.9.2.pom
Downloading: https://repository.jboss.org/nexus/content/groups/developer/org/apache/maven/plugins/maven-scm-plugin/1.9.2/maven-scm-plugin-1.9.2.pom
Downloaded: https://repository.jboss.org/nexus/content/groups/developer/org/apache/maven/plugins/maven-scm-plugin/1.9.2/maven-scm-plugin-1.9.2.pom (7 KB at 34.1 KB/sec)
Downloading: http://repository.jboss.org/maven2/org/apache/maven/scm/maven-scm/1.9.2/maven-scm-1.9.2.pom
Feb 18, 2015 9:25:14 PM org.apache.maven.wagon.providers.http.httpclient.client.protocol.ResponseProcessCookies processCookies
WARNING: Cookie rejected: "[version: 0][name: rememberMe][value: deleteMe][domain: repository.jboss.org][path: /nexus][expiry: Wed Feb 18 21:25:14 EST 2015]". Illegal path attribute "/nexus". Path of origin: "/maven2/org/apache/maven/scm/maven-scm/1.9.2/maven-scm-1.9.2.pom"
Downloading: http://snapshots.jboss.org/maven2/org/apache/maven/scm/maven-scm/1.9.2/maven-scm-1.9.2.pom
Downloading: https://repository.jboss.org/nexus/content/groups/developer/org/apache/maven/scm/maven-scm/1.9.2/maven-scm-1.9.2.pom
Downloaded: https://repository.jboss.org/nexus/content/groups/developer/org/apache/maven/scm/maven-scm/1.9.2/maven-scm-1.9.2.pom (23 KB at 81.4 KB/sec)
Downloading: http://repository.jboss.org/maven2/org/apache/maven/maven-parent/24/maven-parent-24.pom
Feb 18, 2015 9:25:15 PM org.apache.maven.wagon.providers.http.httpclient.client.protocol.ResponseProcessCookies processCookies
WARNING: Cookie rejected: "[version: 0][name: rememberMe][value: deleteMe][domain: repository.jboss.org][path: /nexus][expiry: Wed Feb 18 21:25:15 EST 2015]". Illegal path attribute "/nexus". Path of origin: "/maven2/org/apache/maven/maven-parent/24/maven-parent-24.pom"
Downloading: http://snapshots.jboss.org/maven2/org/apache/maven/maven-parent/24/maven-parent-24.pom
Downloading: https://repository.jboss.org/nexus/content/groups/developer/org/apache/maven/maven-parent/24/maven-parent-24.pom
Downloaded: https://repository.jboss.org/nexus/content/groups/developer/org/apache/maven/maven-parent/24/maven-parent-24.pom (37 KB at 110.9 KB/sec)
Downloading: http://repository.jboss.org/maven2/org/apache/apache/14/apache-14.pom
Feb 18, 2015 9:25:16 PM org.apache.maven.wagon.providers.http.httpclient.client.protocol.ResponseProcessCookies processCookies
WARNING: Cookie rejected: "[version: 0][name: rememberMe][value: deleteMe][domain: repository.jboss.org][path: /nexus][expiry: Wed Feb 18 21:25:16 EST 2015]". Illegal path attribute "/nexus". Path of origin: "/maven2/org/apache/apache/14/apache-14.pom"
Downloading: http://snapshots.jboss.org/maven2/org/apache/apache/14/apache-14.pom
Downloading: https://repository.jboss.org/nexus/content/groups/developer/org/apache/apache/14/apache-14.pom
Downloaded: https://repository.jboss.org/nexus/content/groups/developer/org/apache/apache/14/apache-14.pom (15 KB at 58.3 KB/sec)
Downloading: http://repository.jboss.org/maven2/org/apache/maven/plugins/maven-scm-plugin/1.9.2/maven-scm-plugin-1.9.2.jar
Feb 18, 2015 9:25:17 PM org.apache.maven.wagon.providers.http.httpclient.client.protocol.ResponseProcessCookies processCookies
WARNING: Cookie rejected: "[version: 0][name: rememberMe][value: deleteMe][domain: repository.jboss.org][path: /nexus][expiry: Wed Feb 18 21:25:17 EST 2015]". Illegal path attribute "/nexus". Path of origin: "/maven2/org/apache/maven/plugins/maven-scm-plugin/1.9.2/maven-scm-plugin-1.9.2.jar"
Downloading: http://snapshots.jboss.org/maven2/org/apache/maven/plugins/maven-scm-plugin/1.9.2/maven-scm-plugin-1.9.2.jar
Downloading: https://repository.jboss.org/nexus/content/groups/developer/org/apache/maven/plugins/maven-scm-plugin/1.9.2/maven-scm-plugin-1.9.2.jar
Downloaded: https://repository.jboss.org/nexus/content/groups/developer/org/apache/maven/plugins/maven-scm-plugin/1.9.2/maven-scm-plugin-1.9.2.jar (61 KB at 174.9 KB/sec)
Downloading: http://repository.jboss.org/maven2/org/apache/maven/plugins/maven-resources-plugin/2.7/maven-resources-plugin-2.7.pom
Feb 18, 2015 9:25:18 PM org.apache.maven.wagon.providers.http.httpclient.client.protocol.ResponseProcessCookies processCookies
WARNING: Cookie rejected: "[version: 0][name: rememberMe][value: deleteMe][domain: repository.jboss.org][path: /nexus][expiry: Wed Feb 18 21:25:18 EST 2015]". Illegal path attribute "/nexus". Path of origin: "/maven2/org/apache/maven/plugins/maven-resources-plugin/2.7/maven-resources-plugin-2.7.pom"
Downloading: http://snapshots.jboss.org/maven2/org/apache/maven/plugins/maven-resources-plugin/2.7/maven-resources-plugin-2.7.pom
Downloading: https://repository.jboss.org/nexus/content/groups/developer/org/apache/maven/plugins/maven-resources-plugin/2.7/maven-resources-plugin-2.7.pom
Downloaded: https://repository.jboss.org/nexus/content/groups/developer/org/apache/maven/plugins/maven-resources-plugin/2.7/maven-resources-plugin-2.7.pom (8 KB at 42.8 KB/sec)
Downloading: http://repository.jboss.org/maven2/org/apache/maven/plugins/maven-plugins/25/maven-plugins-25.pom
Feb 18, 2015 9:25:19 PM org.apache.maven.wagon.providers.http.httpclient.client.protocol.ResponseProcessCookies processCookies
WARNING: Cookie rejected: "[version: 0][name: rememberMe][value: deleteMe][domain: repository.jboss.org][path: /nexus][expiry: Wed Feb 18 21:25:19 EST 2015]". Illegal path attribute "/nexus". Path of origin: "/maven2/org/apache/maven/plugins/maven-plugins/25/maven-plugins-25.pom"
Downloading: http://snapshots.jboss.org/maven2/org/apache/maven/plugins/maven-plugins/25/maven-plugins-25.pom
Downloading: https://repository.jboss.org/nexus/content/groups/developer/org/apache/maven/plugins/maven-plugins/25/maven-plugins-25.pom
Downloaded: https://repository.jboss.org/nexus/content/groups/developer/org/apache/maven/plugins/maven-plugins/25/maven-plugins-25.pom (10 KB at 55.2 KB/sec)
Downloading: http://repository.jboss.org/maven2/org/apache/maven/plugins/maven-resources-plugin/2.7/maven-resources-plugin-2.7.jar
Feb 18, 2015 9:25:19 PM org.apache.maven.wagon.providers.http.httpclient.client.protocol.ResponseProcessCookies processCookies
WARNING: Cookie rejected: "[version: 0][name: rememberMe][value: deleteMe][domain: repository.jboss.org][path: /nexus][expiry: Wed Feb 18 21:25:19 EST 2015]". Illegal path attribute "/nexus". Path of origin: "/maven2/org/apache/maven/plugins/maven-resources-plugin/2.7/maven-resources-plugin-2.7.jar"
Downloading: http://snapshots.jboss.org/maven2/org/apache/maven/plugins/maven-resources-plugin/2.7/maven-resources-plugin-2.7.jar
Downloading: https://repository.jboss.org/nexus/content/groups/developer/org/apache/maven/plugins/maven-resources-plugin/2.7/maven-resources-plugin-2.7.jar
Downloaded: https://repository.jboss.org/nexus/content/groups/developer/org/apache/maven/plugins/maven-resources-plugin/2.7/maven-resources-plugin-2.7.jar (31 KB at 121.9 KB/sec)
Downloading: http://repository.jboss.org/maven2/org/apache/maven/plugins/maven-clean-plugin/2.5/maven-clean-plugin-2.5.pom
Feb 18, 2015 9:25:21 PM org.apache.maven.wagon.providers.http.httpclient.client.protocol.ResponseProcessCookies processCookies
WARNING: Cookie rejected: "[version: 0][name: rememberMe][value: deleteMe][domain: repository.jboss.org][path: /nexus][expiry: Wed Feb 18 21:25:21 EST 2015]". Illegal path attribute "/nexus". Path of origin: "/maven2/org/apache/maven/plugins/maven-clean-plugin/2.5/maven-clean-plugin-2.5.pom"
Downloading: http://snapshots.jboss.org/maven2/org/apache/maven/plugins/maven-clean-plugin/2.5/maven-clean-plugin-2.5.pom
Downloading: https://repository.jboss.org/nexus/content/groups/developer/org/apache/maven/plugins/maven-clean-plugin/2.5/maven-clean-plugin-2.5.pom
Downloaded: https://repository.jboss.org/nexus/content/groups/developer/org/apache/maven/plugins/maven-clean-plugin/2.5/maven-clean-plugin-2.5.pom (4 KB at 22.1 KB/sec)
Downloading: http://repository.jboss.org/maven2/org/apache/maven/plugins/maven-clean-plugin/2.5/maven-clean-plugin-2.5.jar
Feb 18, 2015 9:25:22 PM org.apache.maven.wagon.providers.http.httpclient.client.protocol.ResponseProcessCookies processCookies
WARNING: Cookie rejected: "[version: 0][name: rememberMe][value: deleteMe][domain: repository.jboss.org][path: /nexus][expiry: Wed Feb 18 21:25:22 EST 2015]". Illegal path attribute "/nexus". Path of origin: "/maven2/org/apache/maven/plugins/maven-clean-plugin/2.5/maven-clean-plugin-2.5.jar"
Downloading: http://snapshots.jboss.org/maven2/org/apache/maven/plugins/maven-clean-plugin/2.5/maven-clean-plugin-2.5.jar
Downloading: https://repository.jboss.org/nexus/content/groups/developer/org/apache/maven/plugins/maven-clean-plugin/2.5/maven-clean-plugin-2.5.jar
Downloaded: https://repository.jboss.org/nexus/content/groups/developer/org/apache/maven/plugins/maven-clean-plugin/2.5/maven-clean-plugin-2.5.jar (25 KB at 96.6 KB/sec)
Downloading: http://repository.jboss.org/maven2/org/codehaus/mojo/javacc-maven-plugin/2.6/javacc-maven-plugin-2.6.pom
Feb 18, 2015 9:25:23 PM org.apache.maven.wagon.providers.http.httpclient.client.protocol.ResponseProcessCookies processCookies
WARNING: Cookie rejected: "[version: 0][name: rememberMe][value: deleteMe][domain: repository.jboss.org][path: /nexus][expiry: Wed Feb 18 21:25:23 EST 2015]". Illegal path attribute "/nexus". Path of origin: "/maven2/org/codehaus/mojo/javacc-maven-plugin/2.6/javacc-maven-plugin-2.6.pom"
Downloading: http://snapshots.jboss.org/maven2/org/codehaus/mojo/javacc-maven-plugin/2.6/javacc-maven-plugin-2.6.pom
Downloading: https://repository.jboss.org/nexus/content/groups/developer/org/codehaus/mojo/javacc-maven-plugin/2.6/javacc-maven-plugin-2.6.pom
Downloaded: https://repository.jboss.org/nexus/content/groups/developer/org/codehaus/mojo/javacc-maven-plugin/2.6/javacc-maven-plugin-2.6.pom (7 KB at 31.6 KB/sec)
Downloading: http://repository.jboss.org/maven2/org/codehaus/mojo/mojo-parent/22/mojo-parent-22.pom
Feb 18, 2015 9:25:23 PM org.apache.maven.wagon.providers.http.httpclient.client.protocol.ResponseProcessCookies processCookies
WARNING: Cookie rejected: "[version: 0][name: rememberMe][value: deleteMe][domain: repository.jboss.org][path: /nexus][expiry: Wed Feb 18 21:25:23 EST 2015]". Illegal path attribute "/nexus". Path of origin: "/maven2/org/codehaus/mojo/mojo-parent/22/mojo-parent-22.pom"
Downloading: http://snapshots.jboss.org/maven2/org/codehaus/mojo/mojo-parent/22/mojo-parent-22.pom
Downloading: https://repository.jboss.org/nexus/content/groups/developer/org/codehaus/mojo/mojo-parent/22/mojo-parent-22.pom
Downloaded: https://repository.jboss.org/nexus/content/groups/developer/org/codehaus/mojo/mojo-parent/22/mojo-parent-22.pom (19 KB at 72.9 KB/sec)
Downloading: http://repository.jboss.org/maven2/org/codehaus/mojo/javacc-maven-plugin/2.6/javacc-maven-plugin-2.6.jar
Feb 18, 2015 9:25:24 PM org.apache.maven.wagon.providers.http.httpclient.client.protocol.ResponseProcessCookies processCookies
WARNING: Cookie rejected: "[version: 0][name: rememberMe][value: deleteMe][domain: repository.jboss.org][path: /nexus][expiry: Wed Feb 18 21:25:24 EST 2015]". Illegal path attribute "/nexus". Path of origin: "/maven2/org/codehaus/mojo/javacc-maven-plugin/2.6/javacc-maven-plugin-2.6.jar"
Downloading: http://snapshots.jboss.org/maven2/org/codehaus/mojo/javacc-maven-plugin/2.6/javacc-maven-plugin-2.6.jar
Downloading: https://repository.jboss.org/nexus/content/groups/developer/org/codehaus/mojo/javacc-maven-plugin/2.6/javacc-maven-plugin-2.6.jar
Downloaded: https://repository.jboss.org/nexus/content/groups/developer/org/codehaus/mojo/javacc-maven-plugin/2.6/javacc-maven-plugin-2.6.jar (73 KB at 195.9 KB/sec)
Downloading: http://repository.jboss.org/maven2/org/apache/maven/plugins/maven-dependency-plugin/2.6/maven-dependency-plugin-2.6.pom
Feb 18, 2015 9:25:27 PM org.apache.maven.wagon.providers.http.httpclient.client.protocol.ResponseProcessCookies processCookies
WARNING: Cookie rejected: "[version: 0][name: rememberMe][value: deleteMe][domain: repository.jboss.org][path: /nexus][expiry: Wed Feb 18 21:25:27 EST 2015]". Illegal path attribute "/nexus". Path of origin: "/maven2/org/apache/maven/plugins/maven-dependency-plugin/2.6/maven-dependency-plugin-2.6.pom"
Downloading: http://snapshots.jboss.org/maven2/org/apache/maven/plugins/maven-dependency-plugin/2.6/maven-dependency-plugin-2.6.pom
Downloading: https://repository.jboss.org/nexus/content/groups/developer/org/apache/maven/plugins/maven-dependency-plugin/2.6/maven-dependency-plugin-2.6.pom
Downloaded: https://repository.jboss.org/nexus/content/groups/developer/org/apache/maven/plugins/maven-dependency-plugin/2.6/maven-dependency-plugin-2.6.pom (11 KB at 34.8 KB/sec)
Downloading: http://repository.jboss.org/maven2/org/apache/maven/plugins/maven-plugins/23/maven-plugins-23.pom
Feb 18, 2015 9:25:28 PM org.apache.maven.wagon.providers.http.httpclient.client.protocol.ResponseProcessCookies processCookies
WARNING: Cookie rejected: "[version: 0][name: rememberMe][value: deleteMe][domain: repository.jboss.org][path: /nexus][expiry: Wed Feb 18 21:25:28 EST 2015]". Illegal path attribute "/nexus". Path of origin: "/maven2/org/apache/maven/plugins/maven-plugins/23/maven-plugins-23.pom"
Downloading: http://snapshots.jboss.org/maven2/org/apache/maven/plugins/maven-plugins/23/maven-plugins-23.pom
Downloading: https://repository.jboss.org/nexus/content/groups/developer/org/apache/maven/plugins/maven-plugins/23/maven-plugins-23.pom
Downloaded: https://repository.jboss.org/nexus/content/groups/developer/org/apache/maven/plugins/maven-plugins/23/maven-plugins-23.pom (9 KB at 53.5 KB/sec)
Downloading: http://repository.jboss.org/maven2/org/apache/maven/maven-parent/22/maven-parent-22.pom
Feb 18, 2015 9:25:28 PM org.apache.maven.wagon.providers.http.httpclient.client.protocol.ResponseProcessCookies processCookies
WARNING: Cookie rejected: "[version: 0][name: rememberMe][value: deleteMe][domain: repository.jboss.org][path: /nexus][expiry: Wed Feb 18 21:25:28 EST 2015]". Illegal path attribute "/nexus". Path of origin: "/maven2/org/apache/maven/maven-parent/22/maven-parent-22.pom"
Downloading: http://snapshots.jboss.org/maven2/org/apache/maven/maven-parent/22/maven-parent-22.pom
Downloading: https://repository.jboss.org/nexus/content/groups/developer/org/apache/maven/maven-parent/22/maven-parent-22.pom
Downloaded: https://repository.jboss.org/nexus/content/groups/developer/org/apache/maven/maven-parent/22/maven-parent-22.pom (30 KB at 116.2 KB/sec)
Downloading: http://repository.jboss.org/maven2/org/apache/apache/11/apache-11.pom
Feb 18, 2015 9:25:29 PM org.apache.maven.wagon.providers.http.httpclient.client.protocol.ResponseProcessCookies processCookies
WARNING: Cookie rejected: "[version: 0][name: rememberMe][value: deleteMe][domain: repository.jboss.org][path: /nexus][expiry: Wed Feb 18 21:25:29 EST 2015]". Illegal path attribute "/nexus". Path of origin: "/maven2/org/apache/apache/11/apache-11.pom"
Downloading: http://snapshots.jboss.org/maven2/org/apache/apache/11/apache-11.pom
Downloading: https://repository.jboss.org/nexus/content/groups/developer/org/apache/apache/11/apache-11.pom
Downloaded: https://repository.jboss.org/nexus/content/groups/developer/org/apache/apache/11/apache-11.pom (15 KB at 58.6 KB/sec)
Downloading: http://repository.jboss.org/maven2/org/apache/maven/plugins/maven-dependency-plugin/2.6/maven-dependency-plugin-2.6.jar
Feb 18, 2015 9:25:30 PM org.apache.maven.wagon.providers.http.httpclient.client.protocol.ResponseProcessCookies processCookies
WARNING: Cookie rejected: "[version: 0][name: rememberMe][value: deleteMe][domain: repository.jboss.org][path: /nexus][expiry: Wed Feb 18 21:25:30 EST 2015]". Illegal path attribute "/nexus". Path of origin: "/maven2/org/apache/maven/plugins/maven-dependency-plugin/2.6/maven-dependency-plugin-2.6.jar"
Downloading: http://snapshots.jboss.org/maven2/org/apache/maven/plugins/maven-dependency-plugin/2.6/maven-dependency-plugin-2.6.jar
Downloading: https://repository.jboss.org/nexus/content/groups/developer/org/apache/maven/plugins/maven-dependency-plugin/2.6/maven-dependency-plugin-2.6.jar
Downloaded: https://repository.jboss.org/nexus/content/groups/developer/org/apache/maven/plugins/maven-dependency-plugin/2.6/maven-dependency-plugin-2.6.jar (142 KB at 273.0 KB/sec)
Downloading: http://repository.jboss.org/maven2/org/eclipse/tycho/tycho-p2-publisher-plugin/0.21.0/tycho-p2-publisher-plugin-0.21.0.pom
Feb 18, 2015 9:25:31 PM org.apache.maven.wagon.providers.http.httpclient.client.protocol.ResponseProcessCookies processCookies
WARNING: Cookie rejected: "[version: 0][name: rememberMe][value: deleteMe][domain: repository.jboss.org][path: /nexus][expiry: Wed Feb 18 21:25:31 EST 2015]". Illegal path attribute "/nexus". Path of origin: "/maven2/org/eclipse/tycho/tycho-p2-publisher-plugin/0.21.0/tycho-p2-publisher-plugin-0.21.0.pom"
Downloading: http://snapshots.jboss.org/maven2/org/eclipse/tycho/tycho-p2-publisher-plugin/0.21.0/tycho-p2-publisher-plugin-0.21.0.pom
Downloading: https://repository.jboss.org/nexus/content/groups/developer/org/eclipse/tycho/tycho-p2-publisher-plugin/0.21.0/tycho-p2-publisher-plugin-0.21.0.pom
Downloaded: https://repository.jboss.org/nexus/content/groups/developer/org/eclipse/tycho/tycho-p2-publisher-plugin/0.21.0/tycho-p2-publisher-plugin-0.21.0.pom (2 KB at 9.3 KB/sec)
Downloading: http://repository.jboss.org/maven2/org/eclipse/tycho/tycho-p2-publisher-plugin/0.21.0/tycho-p2-publisher-plugin-0.21.0.jar
Feb 18, 2015 9:25:31 PM org.apache.maven.wagon.providers.http.httpclient.client.protocol.ResponseProcessCookies processCookies
WARNING: Cookie rejected: "[version: 0][name: rememberMe][value: deleteMe][domain: repository.jboss.org][path: /nexus][expiry: Wed Feb 18 21:25:31 EST 2015]". Illegal path attribute "/nexus". Path of origin: "/maven2/org/eclipse/tycho/tycho-p2-publisher-plugin/0.21.0/tycho-p2-publisher-plugin-0.21.0.jar"
Downloading: http://snapshots.jboss.org/maven2/org/eclipse/tycho/tycho-p2-publisher-plugin/0.21.0/tycho-p2-publisher-plugin-0.21.0.jar
Downloading: https://repository.jboss.org/nexus/content/groups/developer/org/eclipse/tycho/tycho-p2-publisher-plugin/0.21.0/tycho-p2-publisher-plugin-0.21.0.jar
Downloaded: https://repository.jboss.org/nexus/content/groups/developer/org/eclipse/tycho/tycho-p2-publisher-plugin/0.21.0/tycho-p2-publisher-plugin-0.21.0.jar (23 KB at 89.6 KB/sec)
Downloading: http://repository.jboss.org/maven2/org/eclipse/tycho/tycho-p2-repository-plugin/0.21.0/tycho-p2-repository-plugin-0.21.0.pom
Feb 18, 2015 9:25:32 PM org.apache.maven.wagon.providers.http.httpclient.client.protocol.ResponseProcessCookies processCookies
WARNING: Cookie rejected: "[version: 0][name: rememberMe][value: deleteMe][domain: repository.jboss.org][path: /nexus][expiry: Wed Feb 18 21:25:32 EST 2015]". Illegal path attribute "/nexus". Path of origin: "/maven2/org/eclipse/tycho/tycho-p2-repository-plugin/0.21.0/tycho-p2-repository-plugin-0.21.0.pom"
Downloading: http://snapshots.jboss.org/maven2/org/eclipse/tycho/tycho-p2-repository-plugin/0.21.0/tycho-p2-repository-plugin-0.21.0.pom
Downloading: https://repository.jboss.org/nexus/content/groups/developer/org/eclipse/tycho/tycho-p2-repository-plugin/0.21.0/tycho-p2-repository-plugin-0.21.0.pom
Downloaded: https://repository.jboss.org/nexus/content/groups/developer/org/eclipse/tycho/tycho-p2-repository-plugin/0.21.0/tycho-p2-repository-plugin-0.21.0.pom (2 KB at 7.4 KB/sec)
Downloading: http://repository.jboss.org/maven2/org/eclipse/tycho/tycho-p2-repository-plugin/0.21.0/tycho-p2-repository-plugin-0.21.0.jar
Feb 18, 2015 9:25:33 PM org.apache.maven.wagon.providers.http.httpclient.client.protocol.ResponseProcessCookies processCookies
WARNING: Cookie rejected: "[version: 0][name: rememberMe][value: deleteMe][domain: repository.jboss.org][path: /nexus][expiry: Wed Feb 18 21:25:33 EST 2015]". Illegal path attribute "/nexus". Path of origin: "/maven2/org/eclipse/tycho/tycho-p2-repository-plugin/0.21.0/tycho-p2-repository-plugin-0.21.0.jar"
Downloading: http://snapshots.jboss.org/maven2/org/eclipse/tycho/tycho-p2-repository-plugin/0.21.0/tycho-p2-repository-plugin-0.21.0.jar
Downloading: https://repository.jboss.org/nexus/content/groups/developer/org/eclipse/tycho/tycho-p2-repository-plugin/0.21.0/tycho-p2-repository-plugin-0.21.0.jar
Downloaded: https://repository.jboss.org/nexus/content/groups/developer/org/eclipse/tycho/tycho-p2-repository-plugin/0.21.0/tycho-p2-repository-plugin-0.21.0.jar (13 KB at 45.9 KB/sec)
[INFO] Computing target platform for MavenProject: org.jboss.tools.komodo.features:org.komodo.engine.feature:1.0.0-SNAPSHOT @ <http://jenkins.mw.lab.eng.bos.redhat.com/hudson/job/jbosstools-teiid-komodo/ws/sources/features/org.komodo.engine.feature/pom.xml>
[INFO] Adding repository https://repository.jboss.org/nexus/content/unzip/unzip/org/jboss/tools/locus/update.site/1.1.1.Final/update.site-1.1.1.Final.zip-unzip
[INFO] Fetching content.jar from https://repository.jboss.org/nexus/content/unzip/unzip/org/jboss/tools/locus/update.site/1.1.1.Final/update.site-1.1.1.Final.zip-unzip/ (0B of 3.45kB at 0B/s)
[INFO] Adding repository http://download.jboss.org/jbosstools/updates/requirements/springide/3.2.0.201303060654-RELEASE-e4.3
[INFO] Fetching content.jar from http://download.jboss.org/jbosstools/updates/requirements/springide/3.2.0.201303060654-RELEASE-e4.3/ (0B of 86.39kB at 0B/s)
[INFO] Adding repository http://download.jboss.org/jbosstools/updates/requirements/luna/201406120900-RC4
[INFO] Fetching content.jar from http://download.jboss.org/jbosstools/updates/requirements/luna/201406120900-RC4/ (0B of 2.5MB at 0B/s)
[INFO] Fetching content.jar from http://download.jboss.org/jbosstools/updates/requirements/luna/201406120900-RC4/ (606.66kB of 2.5MB at 602.66kB/s)
[INFO] Adding repository http://download.jboss.org/jbosstools/updates/requirements/bpmn2-modeler/1.1.1.201501081320_1.0.0.201412192138_luna
[INFO] Fetching content.jar from http://download.jboss.org/jbosstools/updates/requirements/bpmn2-modeler/1.1.1.201501081320_1.0.0.201412192138_luna/ (0B of 12.57kB at 0B/s)
[INFO] Adding repository http://download.jboss.org/jbosstools/updates/requirements/bpel/1.0.4.v201412041949
[INFO] Fetching content.jar from http://download.jboss.org/jbosstools/updates/requirements/bpel/1.0.4.v201412041949/ (0B of 11.24kB at 0B/s)
[INFO] Adding repository http://download.jboss.org/jbosstools/updates/requirements/gemini/2.0.0.RELEASE
[INFO] Fetching content.jar from http://download.jboss.org/jbosstools/updates/requirements/gemini/2.0.0.RELEASE/ (0B of 1.63kB at 0B/s)
[INFO] Adding repository http://download.jboss.org/jbosstools/updates/requirements/orbit/R20140525021250
[INFO] Fetching content.jar from http://download.jboss.org/jbosstools/updates/requirements/orbit/R20140525021250/ (0B of 186.5kB at 0B/s)
[INFO] Adding repository http://download.jboss.org/jbosstools/static/releases/jbosstools-4.2.0.Final-updatesite-coretests
[INFO] Fetching content.jar from http://download.jboss.org/jbosstools/static/releases/jbosstools-4.2.0.Final-updatesite-coretests/ (0B of 58.81kB at 0B/s)
[INFO] Adding repository http://download.jboss.org/jbosstools/static/releases/jbosstools-4.2.0.Final-updatesite-core
[INFO] Fetching content.jar from http://download.jboss.org/jbosstools/static/releases/jbosstools-4.2.0.Final-updatesite-core/ (0B of 197.83kB at 0B/s)
[INFO] Adding repository http://download.jboss.org/jbosstools/targetplatforms/jbosstoolstarget/4.41.0.Final/REPO
[ERROR] Internal error: java.lang.RuntimeException: Failed to resolve target definition <http://jenkins.mw.lab.eng.bos.redhat.com/hudson/job/jbosstools-teiid-komodo/ws/.repository/org/jboss/tools/integration-stack/target-platform/4.2.0.Final/target-platform-4.2.0.Final-base.target>: Failed to load p2 metadata repository from location http://download.jboss.org/jbosstools/targetplatforms/jbosstoolstarget/4.41.0.Final/REPO/: No repository found at http://download.jboss.org/jbosstools/targetplatforms/jbosstoolstarget/4.41.0.Final/REPO. -> [Help 1]
org.apache.maven.InternalErrorException: Internal error: java.lang.RuntimeException: Failed to resolve target definition <http://jenkins.mw.lab.eng.bos.redhat.com/hudson/job/jbosstools-teiid-komodo/ws/.repository/org/jboss/tools/integration-stack/target-platform/4.2.0.Final/target-platform-4.2.0.Final-base.target>
	at org.apache.maven.DefaultMaven.execute(DefaultMaven.java:168)
	at org.apache.maven.cli.MavenCli.execute(MavenCli.java:537)
	at org.apache.maven.cli.MavenCli.doMain(MavenCli.java:196)
	at org.apache.maven.cli.MavenCli.main(MavenCli.java:141)
	at sun.reflect.NativeMethodAccessorImpl.invoke0(Native Method)
	at sun.reflect.NativeMethodAccessorImpl.invoke(NativeMethodAccessorImpl.java:57)
	at sun.reflect.DelegatingMethodAccessorImpl.invoke(DelegatingMethodAccessorImpl.java:43)
	at java.lang.reflect.Method.invoke(Method.java:606)
	at org.codehaus.plexus.classworlds.launcher.Launcher.launchEnhanced(Launcher.java:290)
	at org.codehaus.plexus.classworlds.launcher.Launcher.launch(Launcher.java:230)
	at org.codehaus.plexus.classworlds.launcher.Launcher.mainWithExitCode(Launcher.java:409)
	at org.codehaus.plexus.classworlds.launcher.Launcher.main(Launcher.java:352)
Caused by: java.lang.RuntimeException: Failed to resolve target definition <http://jenkins.mw.lab.eng.bos.redhat.com/hudson/job/jbosstools-teiid-komodo/ws/.repository/org/jboss/tools/integration-stack/target-platform/4.2.0.Final/target-platform-4.2.0.Final-base.target>
	at org.eclipse.tycho.p2.target.TargetDefinitionResolver.resolveContent(TargetDefinitionResolver.java:91)
	at org.eclipse.tycho.p2.target.TargetDefinitionResolverService.resolveFromArguments(TargetDefinitionResolverService.java:70)
	at org.eclipse.tycho.p2.target.TargetDefinitionResolverService.getTargetDefinitionContent(TargetDefinitionResolverService.java:60)
	at org.eclipse.tycho.p2.target.TargetPlatformFactoryImpl.resolveTargetDefinitions(TargetPlatformFactoryImpl.java:213)
	at org.eclipse.tycho.p2.target.TargetPlatformFactoryImpl.createTargetPlatform(TargetPlatformFactoryImpl.java:153)
	at org.eclipse.tycho.p2.target.TargetPlatformFactoryImpl.createTargetPlatform(TargetPlatformFactoryImpl.java:126)
	at org.eclipse.tycho.p2.target.TargetPlatformFactoryImpl.createTargetPlatform(TargetPlatformFactoryImpl.java:1)
	at org.eclipse.tycho.p2.manager.ReactorRepositoryManagerImpl.computePreliminaryTargetPlatform(ReactorRepositoryManagerImpl.java:82)
	at org.eclipse.tycho.p2.resolver.P2DependencyResolver.computePreliminaryTargetPlatform(P2DependencyResolver.java:215)
	at org.eclipse.tycho.core.resolver.DefaultTychoResolver.resolveProject(DefaultTychoResolver.java:99)
	at org.eclipse.tycho.core.maven.TychoMavenLifecycleParticipant.afterProjectsRead(TychoMavenLifecycleParticipant.java:75)
	at org.apache.maven.DefaultMaven.doExecute(DefaultMaven.java:274)
	at org.apache.maven.DefaultMaven.execute(DefaultMaven.java:156)
	... 11 more
Caused by: org.eclipse.tycho.p2.target.facade.TargetDefinitionResolutionException: Failed to load p2 metadata repository from location http://download.jboss.org/jbosstools/targetplatforms/jbosstoolstarget/4.41.0.Final/REPO/
	at org.eclipse.tycho.p2.target.TargetDefinitionResolver.loadRepository(TargetDefinitionResolver.java:210)
	at org.eclipse.tycho.p2.target.TargetDefinitionResolver.resolveContentWithExceptions(TargetDefinitionResolver.java:127)
	at org.eclipse.tycho.p2.target.TargetDefinitionResolver.resolveContent(TargetDefinitionResolver.java:86)
	... 23 more
Caused by: org.eclipse.equinox.p2.core.ProvisionException: No repository found at http://download.jboss.org/jbosstools/targetplatforms/jbosstoolstarget/4.41.0.Final/REPO.
	at org.eclipse.equinox.internal.p2.repository.helpers.AbstractRepositoryManager.fail(AbstractRepositoryManager.java:395)
	at org.eclipse.equinox.internal.p2.repository.helpers.AbstractRepositoryManager.loadRepository(AbstractRepositoryManager.java:692)
	at org.eclipse.equinox.internal.p2.metadata.repository.MetadataRepositoryManager.loadRepository(MetadataRepositoryManager.java:96)
	at org.eclipse.tycho.p2.remote.RemoteMetadataRepositoryManager.loadRepository(RemoteMetadataRepositoryManager.java:59)
	at org.eclipse.tycho.p2.remote.RemoteMetadataRepositoryManager.loadRepository(RemoteMetadataRepositoryManager.java:52)
	at org.eclipse.tycho.p2.target.TargetDefinitionResolver.loadRepository(TargetDefinitionResolver.java:208)
	... 25 more
[ERROR] 
[ERROR] To see the full stack trace of the errors, re-run Maven with the -e switch.
[ERROR] Re-run Maven using the -X switch to enable full debug logging.
[ERROR] 
[ERROR] For more information about the errors and possible solutions, please read the following articles:
[ERROR] [Help 1] http://cwiki.apache.org/confluence/display/MAVEN/InternalErrorException
Build step 'Invoke top-level Maven targets' marked build as failure
Terminating xvnc.
$ vncserver -kill :64
Killing Xvnc process ID 16532
Archiving artifacts
Recording test results


More information about the teiid-designer-dev mailing list