[teiid-designer-dev] Build failed in Jenkins: jbosstools-teiid-komodo #848 ()

ci-builds at redhat.com ci-builds at redhat.com
Thu May 14 15:42:18 EDT 2015


See <http://jenkins.mw.lab.eng.bos.redhat.com/hudson/job/jbosstools-teiid-komodo/848/changes>

Changes:

[dflorian] Issue 124 Provide means for each object type to expose a getAllowedChildTypes() method

[mdrillin] Changes to set cli root path to workspace

[mdrillin] Fixes Cli Unit Tests

[dflorian] - Added some debug logging around session creation and disposal

[dflorian] Added "resources" directory to the bundle classpath/build.properties in the org.komodo.test.utils plugin. Deleted all the @Ignore tests and they all run now.

[dflorian] Fixed merge conflicts. Also put back the index entries in the test repo config to see if the Jenkings build works.

------------------------------------------
[...truncated 40465 lines...]
Downloaded: http://repository.jboss.org/maven2/org/apache/maven/shared/maven-common-artifact-filters/1.0-alpha-1/maven-common-artifact-filters-1.0-alpha-1.pom (2 KB at 10.3 KB/sec)
Downloading: http://repository.jboss.org/maven2/org/apache/maven/shared/maven-shared-components/6/maven-shared-components-6.pom
Downloaded: http://repository.jboss.org/maven2/org/apache/maven/shared/maven-shared-components/6/maven-shared-components-6.pom (3 KB at 17.7 KB/sec)
Downloading: http://repository.jboss.org/maven2/org/slf4j/slf4j-jdk14/1.5.6/slf4j-jdk14-1.5.6.jar
Downloading: http://repository.jboss.org/maven2/org/slf4j/slf4j-api/1.5.6/slf4j-api-1.5.6.jar
Downloading: http://repository.jboss.org/maven2/org/slf4j/jcl-over-slf4j/1.5.6/jcl-over-slf4j-1.5.6.jar
Downloading: http://repository.jboss.org/maven2/commons-cli/commons-cli/1.2/commons-cli-1.2.jar
Downloading: http://repository.jboss.org/maven2/org/codehaus/plexus/plexus-interpolation/1.15/plexus-interpolation-1.15.jar
Downloading: http://repository.jboss.org/maven2/org/apache/maven/shared/file-management/1.1/file-management-1.1.jar
Downloading: http://repository.jboss.org/maven2/org/apache/maven/shared/maven-filtering/1.1/maven-filtering-1.1.jar
Downloading: http://repository.jboss.org/maven2/org/codehaus/plexus/plexus-utils/3.0.8/plexus-utils-3.0.8.jar
Downloading: http://repository.jboss.org/maven2/org/apache/maven/shared/maven-repository-builder/1.0-alpha-2/maven-repository-builder-1.0-alpha-2.jar
Downloaded: http://repository.jboss.org/maven2/org/apache/maven/shared/file-management/1.1/file-management-1.1.jar (31 KB at 93.9 KB/sec)
Downloaded: http://repository.jboss.org/maven2/org/apache/maven/shared/maven-repository-builder/1.0-alpha-2/maven-repository-builder-1.0-alpha-2.jar (23 KB at 70.2 KB/sec)
Downloading: http://snapshots.jboss.org/maven2/org/slf4j/slf4j-jdk14/1.5.6/slf4j-jdk14-1.5.6.jar
Downloading: http://snapshots.jboss.org/maven2/org/slf4j/slf4j-api/1.5.6/slf4j-api-1.5.6.jar
Downloading: http://snapshots.jboss.org/maven2/org/slf4j/jcl-over-slf4j/1.5.6/jcl-over-slf4j-1.5.6.jar
Downloading: http://snapshots.jboss.org/maven2/commons-cli/commons-cli/1.2/commons-cli-1.2.jar
Downloading: http://snapshots.jboss.org/maven2/org/codehaus/plexus/plexus-interpolation/1.15/plexus-interpolation-1.15.jar
Downloading: http://snapshots.jboss.org/maven2/org/apache/maven/shared/maven-filtering/1.1/maven-filtering-1.1.jar
Downloading: http://snapshots.jboss.org/maven2/org/codehaus/plexus/plexus-utils/3.0.8/plexus-utils-3.0.8.jar
Downloading: https://repository.jboss.org/nexus/content/groups/developer/org/slf4j/slf4j-jdk14/1.5.6/slf4j-jdk14-1.5.6.jar
Downloading: https://repository.jboss.org/nexus/content/groups/developer/org/slf4j/slf4j-api/1.5.6/slf4j-api-1.5.6.jar
Downloading: https://repository.jboss.org/nexus/content/groups/developer/org/slf4j/jcl-over-slf4j/1.5.6/jcl-over-slf4j-1.5.6.jar
Downloading: https://repository.jboss.org/nexus/content/groups/developer/commons-cli/commons-cli/1.2/commons-cli-1.2.jar
Downloading: https://repository.jboss.org/nexus/content/groups/developer/org/codehaus/plexus/plexus-interpolation/1.15/plexus-interpolation-1.15.jar
Downloaded: https://repository.jboss.org/nexus/content/groups/developer/org/slf4j/slf4j-jdk14/1.5.6/slf4j-jdk14-1.5.6.jar (9 KB at 51.2 KB/sec)
Downloading: https://repository.jboss.org/nexus/content/groups/developer/org/apache/maven/shared/maven-filtering/1.1/maven-filtering-1.1.jar
Downloaded: https://repository.jboss.org/nexus/content/groups/developer/org/slf4j/jcl-over-slf4j/1.5.6/jcl-over-slf4j-1.5.6.jar (17 KB at 39.7 KB/sec)
Downloading: https://repository.jboss.org/nexus/content/groups/developer/org/codehaus/plexus/plexus-utils/3.0.8/plexus-utils-3.0.8.jar
Downloaded: https://repository.jboss.org/nexus/content/groups/developer/org/slf4j/slf4j-api/1.5.6/slf4j-api-1.5.6.jar (22 KB at 52.8 KB/sec)
Downloaded: https://repository.jboss.org/nexus/content/groups/developer/commons-cli/commons-cli/1.2/commons-cli-1.2.jar (41 KB at 82.1 KB/sec)
Downloaded: https://repository.jboss.org/nexus/content/groups/developer/org/apache/maven/shared/maven-filtering/1.1/maven-filtering-1.1.jar (43 KB at 129.1 KB/sec)
Downloaded: https://repository.jboss.org/nexus/content/groups/developer/org/codehaus/plexus/plexus-interpolation/1.15/plexus-interpolation-1.15.jar (60 KB at 104.3 KB/sec)
Downloaded: https://repository.jboss.org/nexus/content/groups/developer/org/codehaus/plexus/plexus-utils/3.0.8/plexus-utils-3.0.8.jar (227 KB at 317.1 KB/sec)
[INFO] Reading assembly descriptor: assembly/cli.xml
[WARNING] NOTE: Currently, inclusion of module dependencies may produce unpredictable results if a version conflict occurs.
[WARNING] The following patterns were never triggered in this artifact exclusion filter:
o  'org.jboss.tools.komodo.plugins:*'
o  'org.jboss.tools.komodo.plugins.lib:*'

[WARNING] The following patterns were never triggered in this artifact exclusion filter:
o  'org.jboss.tools.komodo.plugins:*'
o  'org.jboss.tools.komodo.plugins.lib:*'

[WARNING] The following patterns were never triggered in this artifact exclusion filter:
o  'org.jboss.tools.komodo.plugins:*'
o  'org.jboss.tools.komodo.plugins.lib:*'

[WARNING] The following patterns were never triggered in this artifact exclusion filter:
o  'org.jboss.tools.komodo.plugins:*'
o  'org.jboss.tools.komodo.plugins.lib:*'

[WARNING] The following patterns were never triggered in this artifact exclusion filter:
o  'org.jboss.tools.komodo.plugins:*'
o  'org.jboss.tools.komodo.plugins.lib:*'

[WARNING] The following patterns were never triggered in this artifact exclusion filter:
o  'org.jboss.tools.komodo.plugins:*'
o  'org.jboss.tools.komodo.plugins.lib:*'

[WARNING] The following patterns were never triggered in this artifact exclusion filter:
o  'org.jboss.tools.komodo.plugins:*'
o  'org.jboss.tools.komodo.plugins.lib:*'

[WARNING] The following patterns were never triggered in this artifact exclusion filter:
o  'org.jboss.tools.komodo.plugins:*'
o  'org.jboss.tools.komodo.plugins.lib:*'

[WARNING] The following patterns were never triggered in this artifact exclusion filter:
o  'org.jboss.tools.komodo.plugins:*'
o  'org.jboss.tools.komodo.plugins.lib:*'

[WARNING] The following patterns were never triggered in this artifact exclusion filter:
o  'org.jboss.tools.komodo.plugins:*'
o  'org.jboss.tools.komodo.plugins.lib:*'

[WARNING] The following patterns were never triggered in this artifact exclusion filter:
o  'org.jboss.tools.komodo.plugins:*'
o  'org.jboss.tools.komodo.plugins.lib:*'

[WARNING] The following patterns were never triggered in this artifact exclusion filter:
o  'org.jboss.tools.komodo.plugins:*'
o  'org.jboss.tools.komodo.plugins.lib:*'

[WARNING] The following patterns were never triggered in this artifact exclusion filter:
o  'org.jboss.tools.komodo.plugins:*'
o  'org.jboss.tools.komodo.plugins.lib:*'

[INFO] Copying files to <http://jenkins.mw.lab.eng.bos.redhat.com/hudson/job/jbosstools-teiid-komodo/ws/sources/build/target/komodo.build-0.0.1-SNAPSHOT-komodo-console>
[WARNING] Assembly file: <http://jenkins.mw.lab.eng.bos.redhat.com/hudson/job/jbosstools-teiid-komodo/ws/sources/build/target/komodo.build-0.0.1-SNAPSHOT-komodo-console> is not a regular file (it may be a directory). It cannot be attached to the project build for installation or deployment.
[WARNING] NOTE: Currently, inclusion of module dependencies may produce unpredictable results if a version conflict occurs.
[WARNING] The following patterns were never triggered in this artifact exclusion filter:
o  'org.jboss.tools.komodo.plugins:*'
o  'org.jboss.tools.komodo.plugins.lib:*'

[WARNING] The following patterns were never triggered in this artifact exclusion filter:
o  'org.jboss.tools.komodo.plugins:*'
o  'org.jboss.tools.komodo.plugins.lib:*'

[WARNING] The following patterns were never triggered in this artifact exclusion filter:
o  'org.jboss.tools.komodo.plugins:*'
o  'org.jboss.tools.komodo.plugins.lib:*'

[WARNING] The following patterns were never triggered in this artifact exclusion filter:
o  'org.jboss.tools.komodo.plugins:*'
o  'org.jboss.tools.komodo.plugins.lib:*'

[WARNING] The following patterns were never triggered in this artifact exclusion filter:
o  'org.jboss.tools.komodo.plugins:*'
o  'org.jboss.tools.komodo.plugins.lib:*'

[WARNING] The following patterns were never triggered in this artifact exclusion filter:
o  'org.jboss.tools.komodo.plugins:*'
o  'org.jboss.tools.komodo.plugins.lib:*'

[WARNING] The following patterns were never triggered in this artifact exclusion filter:
o  'org.jboss.tools.komodo.plugins:*'
o  'org.jboss.tools.komodo.plugins.lib:*'

[WARNING] The following patterns were never triggered in this artifact exclusion filter:
o  'org.jboss.tools.komodo.plugins:*'
o  'org.jboss.tools.komodo.plugins.lib:*'

[WARNING] The following patterns were never triggered in this artifact exclusion filter:
o  'org.jboss.tools.komodo.plugins:*'
o  'org.jboss.tools.komodo.plugins.lib:*'

[WARNING] The following patterns were never triggered in this artifact exclusion filter:
o  'org.jboss.tools.komodo.plugins:*'
o  'org.jboss.tools.komodo.plugins.lib:*'

[WARNING] The following patterns were never triggered in this artifact exclusion filter:
o  'org.jboss.tools.komodo.plugins:*'
o  'org.jboss.tools.komodo.plugins.lib:*'

[WARNING] The following patterns were never triggered in this artifact exclusion filter:
o  'org.jboss.tools.komodo.plugins:*'
o  'org.jboss.tools.komodo.plugins.lib:*'

[WARNING] The following patterns were never triggered in this artifact exclusion filter:
o  'org.jboss.tools.komodo.plugins:*'
o  'org.jboss.tools.komodo.plugins.lib:*'

[INFO] Building zip: <http://jenkins.mw.lab.eng.bos.redhat.com/hudson/job/jbosstools-teiid-komodo/ws/sources/build/target/komodo.build-0.0.1-SNAPSHOT-komodo-console.zip>
[INFO] 
[INFO] --- maven-install-plugin:2.3.1:install (default-install) @ komodo.build ---
[INFO] Installing <http://jenkins.mw.lab.eng.bos.redhat.com/hudson/job/jbosstools-teiid-komodo/ws/sources/build/target/komodo.build-0.0.1-SNAPSHOT.jar> to <http://jenkins.mw.lab.eng.bos.redhat.com/hudson/job/jbosstools-teiid-komodo/ws/.repository/org/jboss/tools/komodo.build/0.0.1-SNAPSHOT/komodo.build-0.0.1-SNAPSHOT.jar>
[INFO] Installing <http://jenkins.mw.lab.eng.bos.redhat.com/hudson/job/jbosstools-teiid-komodo/ws/sources/build/pom.xml> to <http://jenkins.mw.lab.eng.bos.redhat.com/hudson/job/jbosstools-teiid-komodo/ws/.repository/org/jboss/tools/komodo.build/0.0.1-SNAPSHOT/komodo.build-0.0.1-SNAPSHOT.pom>
[INFO] Installing <http://jenkins.mw.lab.eng.bos.redhat.com/hudson/job/jbosstools-teiid-komodo/ws/sources/build/target/komodo.build-0.0.1-SNAPSHOT-komodo-console.zip> to <http://jenkins.mw.lab.eng.bos.redhat.com/hudson/job/jbosstools-teiid-komodo/ws/.repository/org/jboss/tools/komodo.build/0.0.1-SNAPSHOT/komodo.build-0.0.1-SNAPSHOT-komodo-console.zip>
[INFO] ------------------------------------------------------------------------
[INFO] Reactor Summary:
[INFO] 
[INFO] komodo ............................................ SUCCESS [1:39.074s]
[INFO] Komodo Target Platform ............................ SUCCESS [0.424s]
[INFO] plugins ........................................... SUCCESS [0.085s]
[INFO] org.komodo.spi .................................... SUCCESS [28.267s]
[INFO] org.komodo.utils .................................. SUCCESS [0.603s]
[INFO] libs .............................................. SUCCESS [0.073s]
[INFO] org.komodo.modeshape.lib .......................... SUCCESS [58.914s]
[INFO] Komodo Teiid Client ............................... SUCCESS [49.251s]
[INFO] org.komodo.modeshape.teiid.sql.sequencer .......... SUCCESS [13.667s]
[INFO] org.komodo.core ................................... SUCCESS [0.677s]
[INFO] org.komodo.modeshape.vdb .......................... SUCCESS [0.455s]
[INFO] org.komodo.relational ............................. SUCCESS [1.281s]
[INFO] org.komodo.importer ............................... SUCCESS [0.384s]
[INFO] org.komodo.utils.logger.modeshape ................. SUCCESS [0.269s]
[INFO] features .......................................... SUCCESS [0.108s]
[INFO] org.komodo.engine.feature ......................... SUCCESS [0.581s]
[INFO] org.komodo.shell-api .............................. SUCCESS [0.282s]
[INFO] org.komodo.shell.lib .............................. SUCCESS [1.240s]
[INFO] org.komodo.shell .................................. SUCCESS [0.569s]
[INFO] org.komodo.eclipse.shell .......................... SUCCESS [0.407s]
[INFO] org.komodo.eclipse.spi ............................ SUCCESS [0.199s]
[INFO] org.komodo.eclipse.sql.ui ......................... SUCCESS [0.479s]
[INFO] org.komodo.eclipse.teiid.client ................... SUCCESS [0.495s]
[INFO] org.komodo.ui.feature ............................. SUCCESS [0.260s]
[INFO] tests ............................................. SUCCESS [0.030s]
[INFO] org.komodo.test.utils ............................. SUCCESS [0.341s]
[INFO] org.komodo.core.test .............................. SUCCESS [50.201s]
[INFO] org.komodo.eclipse.test.utils ..................... SUCCESS [0.181s]
[INFO] org.komodo.teiid.client.test ...................... SUCCESS [2:40.519s]
[INFO] org.komodo.utils.test ............................. SUCCESS [5.887s]
[INFO] org.komodo.relational.test ........................ SUCCESS [1:48.365s]
[INFO] org.komodo.importer.test .......................... SUCCESS [23.252s]
[INFO] org.komodo.shell.test ............................. SUCCESS [21.378s]
[INFO] org.komodo.modeshape.teiid.sql.sequencer.test ..... SUCCESS [1:51.430s]
[INFO] org.komodo.modeshape.vdb.test ..................... SUCCESS [13.862s]
[INFO] integration-tests ................................. SUCCESS [0.046s]
[INFO] org.komodo.eclipse.teiid-8.4.client.test .......... FAILURE [2:12.441s]
[INFO] org.komodo.eclipse.teiid-8.7.client.test .......... FAILURE [0.165s]
[INFO] Teiid Komodo ...................................... SUCCESS [6.974s]
[INFO] Komodo Build ...................................... SUCCESS [36.792s]
[INFO] ------------------------------------------------------------------------
[INFO] BUILD FAILURE
[INFO] ------------------------------------------------------------------------
[INFO] Total time: 20:39.044s
[INFO] Finished at: Thu May 14 15:42:15 EDT 2015
[INFO] Final Memory: 139M/669M
[INFO] ------------------------------------------------------------------------
[ERROR] Failed to execute goal org.apache.maven.plugins:maven-dependency-plugin:2.6:unpack (unpack-for-teiid-testing) on project org.komodo.eclipse.teiid-8.4.client.test: Unable to resolve artifact. Could not transfer artifact org.jboss.as:jboss-as-dist:zip:7.2.0.Alpha1-redhat-4 from/to jboss-earlyaccess (https://maven.repository.redhat.com/earlyaccess/all/): GET request of: org/jboss/as/jboss-as-dist/7.2.0.Alpha1-redhat-4/jboss-as-dist-7.2.0.Alpha1-redhat-4.zip from jboss-earlyaccess failed
[ERROR] org.jboss.as:jboss-as-dist:zip:7.2.0.Alpha1-redhat-4
[ERROR] 
[ERROR] from the specified remote repositories:
[ERROR] jboss-deprecated (https://repository.jboss.org/nexus/content/repositories/deprecated/, releases=true, snapshots=false),
[ERROR] jboss-developer-repository-group (https://repository.jboss.org/nexus/content/groups/developer/, releases=true, snapshots=true),
[ERROR] snapshots.jboss.org (http://snapshots.jboss.org/maven2, releases=true, snapshots=true),
[ERROR] repository.jboss.org (http://repository.jboss.org/maven2, releases=true, snapshots=false),
[ERROR] jboss-public-repository-group (http://repository.jboss.org/nexus/content/groups/public/, releases=true, snapshots=true),
[ERROR] sonatype (http://oss.sonatype.org/content/repositories/snapshots, releases=false, snapshots=true),
[ERROR] jboss-maven2-release-repository (https://repository.jboss.org/nexus/content/groups/m2-proxy/, releases=true, snapshots=true),
[ERROR] redhat-techpreview-all-repository (http://maven.repository.redhat.com/techpreview/all/, releases=true, snapshots=false),
[ERROR] jboss-earlyaccess (https://maven.repository.redhat.com/earlyaccess/all/, releases=true, snapshots=false),
[ERROR] jboss-releases (https://repository.jboss.org/nexus/content/repositories/releases/, releases=true, snapshots=true),
[ERROR] jboss-snapshots-repository (https://repository.jboss.org/nexus/content/repositories/snapshots/, releases=true, snapshots=true),
[ERROR] central (http://repo.maven.apache.org/maven2, releases=true, snapshots=false): Premature end of Content-Length delimited message body (expected: 128612031; received: 2097152
[ERROR] -> [Help 1]
[ERROR] Failed to execute goal org.apache.maven.plugins:maven-dependency-plugin:2.6:unpack (unpack-for-teiid-testing) on project org.komodo.eclipse.teiid-8.7.client.test: Unable to resolve artifact. Failure to transfer org.jboss.as:jboss-as-dist:zip:7.2.0.Alpha1-redhat-4 from https://maven.repository.redhat.com/earlyaccess/all/ was cached in the local repository, resolution will not be reattempted until the update interval of jboss-earlyaccess has elapsed or updates are forced. Original error: Could not transfer artifact org.jboss.as:jboss-as-dist:zip:7.2.0.Alpha1-redhat-4 from/to jboss-earlyaccess (https://maven.repository.redhat.com/earlyaccess/all/): GET request of: org/jboss/as/jboss-as-dist/7.2.0.Alpha1-redhat-4/jboss-as-dist-7.2.0.Alpha1-redhat-4.zip from jboss-earlyaccess failed
[ERROR] org.jboss.as:jboss-as-dist:zip:7.2.0.Alpha1-redhat-4
[ERROR] 
[ERROR] from the specified remote repositories:
[ERROR] jboss-deprecated (https://repository.jboss.org/nexus/content/repositories/deprecated/, releases=true, snapshots=false),
[ERROR] jboss-developer-repository-group (https://repository.jboss.org/nexus/content/groups/developer/, releases=true, snapshots=true),
[ERROR] snapshots.jboss.org (http://snapshots.jboss.org/maven2, releases=true, snapshots=true),
[ERROR] repository.jboss.org (http://repository.jboss.org/maven2, releases=true, snapshots=false),
[ERROR] jboss-public-repository-group (http://repository.jboss.org/nexus/content/groups/public/, releases=true, snapshots=true),
[ERROR] sonatype (http://oss.sonatype.org/content/repositories/snapshots, releases=false, snapshots=true),
[ERROR] jboss-maven2-release-repository (https://repository.jboss.org/nexus/content/groups/m2-proxy/, releases=true, snapshots=true),
[ERROR] redhat-techpreview-all-repository (http://maven.repository.redhat.com/techpreview/all/, releases=true, snapshots=false),
[ERROR] jboss-earlyaccess (https://maven.repository.redhat.com/earlyaccess/all/, releases=true, snapshots=false),
[ERROR] jboss-releases (https://repository.jboss.org/nexus/content/repositories/releases/, releases=true, snapshots=true),
[ERROR] jboss-snapshots-repository (https://repository.jboss.org/nexus/content/repositories/snapshots/, releases=true, snapshots=true),
[ERROR] central (http://repo.maven.apache.org/maven2, releases=true, snapshots=false)
[ERROR] -> [Help 1]
[ERROR] 
[ERROR] To see the full stack trace of the errors, re-run Maven with the -e switch.
[ERROR] Re-run Maven using the -X switch to enable full debug logging.
[ERROR] 
[ERROR] For more information about the errors and possible solutions, please read the following articles:
[ERROR] [Help 1] http://cwiki.apache.org/confluence/display/MAVEN/MojoExecutionException
[ERROR] 
[ERROR] After correcting the problems, you can resume the build with the command
[ERROR]   mvn <goals> -rf :org.komodo.eclipse.teiid-8.4.client.test
Build step 'Invoke top-level Maven targets' marked build as failure
Terminating xvnc.
$ vncserver -kill :15
Killing Xvnc process ID 31874
Archiving artifacts
Recording test results


More information about the teiid-designer-dev mailing list