[weld-builds] Build failed in Jenkins: Weld-2.x-int-servlet-jetty #1090

ci-builds at redhat.com ci-builds at redhat.com
Wed Aug 19 04:02:21 EDT 2015


See <http://jenkins.mw.lab.eng.bos.redhat.com/hudson/job/Weld-2.x-int-servlet-jetty/1090/changes>

Changes:

[Jozef Hartinger] WELD-2011 Simplify JandexIndexBeanArchiveHandler

------------------------------------------
[...truncated 1138 lines...]
[INFO] --- build-helper-maven-plugin:1.5:parse-version (default) @ weld-core-test-arquillian ---
[INFO] 
[INFO] --- buildnumber-maven-plugin:1.2:create (set-build-properties) @ weld-core-test-arquillian ---
[INFO] 
[INFO] --- maven-remote-resources-plugin:1.1:process (attach-license) @ weld-core-test-arquillian ---
[INFO] 
[INFO] --- maven-resources-plugin:2.4.3:resources (default-resources) @ weld-core-test-arquillian ---
[INFO] Using 'UTF-8' encoding to copy filtered resources.
[INFO] skip non existing resourceDirectory <http://jenkins.mw.lab.eng.bos.redhat.com/hudson/job/Weld-2.x-int-servlet-jetty/ws/tests-arquillian/src/main/resources>
[INFO] Copying 2 resources
[INFO] 
[INFO] --- maven-compiler-plugin:2.5.1:compile (default-compile) @ weld-core-test-arquillian ---
[INFO] No sources to compile
[INFO] 
[INFO] --- maven-checkstyle-plugin:2.12.1:checkstyle (check-style) @ weld-core-test-arquillian ---
[INFO] Starting audit...
Audit done.

[INFO] 
[INFO] --- maven-resources-plugin:2.4.3:testResources (default-testResources) @ weld-core-test-arquillian ---
[INFO] Using 'UTF-8' encoding to copy filtered resources.
[INFO] Copying 90 resources
[INFO] Copying 2 resources
[INFO] 
[INFO] --- maven-compiler-plugin:2.5.1:testCompile (default-testCompile) @ weld-core-test-arquillian ---
[INFO] Compiling 2682 source files to <http://jenkins.mw.lab.eng.bos.redhat.com/hudson/job/Weld-2.x-int-servlet-jetty/ws/tests-arquillian/target/test-classes>
[INFO] 
[INFO] --- maven-surefire-plugin:2.17:test (default-test) @ weld-core-test-arquillian ---
[INFO] Tests are skipped.
[INFO] 
[INFO] --- maven-jar-plugin:2.3.1:jar (default-jar) @ weld-core-test-arquillian ---
[INFO] Building jar: <http://jenkins.mw.lab.eng.bos.redhat.com/hudson/job/Weld-2.x-int-servlet-jetty/ws/tests-arquillian/target/weld-core-test-arquillian-2.3.0-SNAPSHOT.jar>
[INFO] 
[INFO] >>> maven-source-plugin:2.1.2:jar (attach-sources) @ weld-core-test-arquillian >>>
[INFO] 
[INFO] --- maven-enforcer-plugin:1.0-beta-1:enforce (enforce) @ weld-core-test-arquillian ---
[WARNING] This rule is not compatible with the current version of Maven. The rule is not able to perform any checks.
[INFO] 
[INFO] --- build-helper-maven-plugin:1.5:maven-version (default) @ weld-core-test-arquillian ---
[INFO] 
[INFO] --- build-helper-maven-plugin:1.5:parse-version (default) @ weld-core-test-arquillian ---
[INFO] 
[INFO] --- buildnumber-maven-plugin:1.2:create (set-build-properties) @ weld-core-test-arquillian ---
[INFO] 
[INFO] <<< maven-source-plugin:2.1.2:jar (attach-sources) @ weld-core-test-arquillian <<<
[INFO] 
[INFO] --- maven-source-plugin:2.1.2:jar (attach-sources) @ weld-core-test-arquillian ---
[INFO] META-INF already added, skipping
[INFO] META-INF/DEPENDENCIES.txt already added, skipping
[INFO] META-INF/LICENSE.txt already added, skipping
[INFO] Building jar: <http://jenkins.mw.lab.eng.bos.redhat.com/hudson/job/Weld-2.x-int-servlet-jetty/ws/tests-arquillian/target/weld-core-test-arquillian-2.3.0-SNAPSHOT-sources.jar>
[INFO] META-INF already added, skipping
[INFO] META-INF/DEPENDENCIES.txt already added, skipping
[INFO] META-INF/LICENSE.txt already added, skipping
[INFO] 
[INFO] --- maven-install-plugin:2.3.1:install (default-install) @ weld-core-test-arquillian ---
[INFO] Installing <http://jenkins.mw.lab.eng.bos.redhat.com/hudson/job/Weld-2.x-int-servlet-jetty/ws/tests-arquillian/target/weld-core-test-arquillian-2.3.0-SNAPSHOT.jar> to /qa/home/hudson/private_maven_repos/weld/org/jboss/weld/weld-core-test-arquillian/2.3.0-SNAPSHOT/weld-core-test-arquillian-2.3.0-SNAPSHOT.jar
[INFO] Installing <http://jenkins.mw.lab.eng.bos.redhat.com/hudson/job/Weld-2.x-int-servlet-jetty/ws/tests-arquillian/pom.xml> to /qa/home/hudson/private_maven_repos/weld/org/jboss/weld/weld-core-test-arquillian/2.3.0-SNAPSHOT/weld-core-test-arquillian-2.3.0-SNAPSHOT.pom
[INFO] Installing <http://jenkins.mw.lab.eng.bos.redhat.com/hudson/job/Weld-2.x-int-servlet-jetty/ws/tests-arquillian/target/weld-core-test-arquillian-2.3.0-SNAPSHOT-sources.jar> to /qa/home/hudson/private_maven_repos/weld/org/jboss/weld/weld-core-test-arquillian/2.3.0-SNAPSHOT/weld-core-test-arquillian-2.3.0-SNAPSHOT-sources.jar
[INFO]                                                                         
[INFO] ------------------------------------------------------------------------
[INFO] Building AtInject TCK runner for Weld 2.3.0-SNAPSHOT
[INFO] ------------------------------------------------------------------------
Downloading: http://repository.jboss.org/maven2/org/apache/maven/plugins/maven-eclipse-plugin/maven-metadata.xml
Downloading: http://snapshots.jboss.org/maven2/org/apache/maven/plugins/maven-eclipse-plugin/maven-metadata.xml
Downloading: https://repository.jboss.org/nexus/content/groups/developer/org/apache/maven/plugins/maven-eclipse-plugin/maven-metadata.xml
Downloading: http://repo1.maven.org/maven2/org/apache/maven/plugins/maven-eclipse-plugin/maven-metadata.xml
741 B           
        
Downloaded: http://repo1.maven.org/maven2/org/apache/maven/plugins/maven-eclipse-plugin/maven-metadata.xml (741 B at 6.6 KB/sec)
        
        
787 B   
        
Downloaded: https://repository.jboss.org/nexus/content/groups/developer/org/apache/maven/plugins/maven-eclipse-plugin/maven-metadata.xml (787 B at 2.2 KB/sec)
[INFO] 
[INFO] --- maven-clean-plugin:2.4.1:clean (default-clean) @ weld-inject-tck-runner ---
[INFO] Deleting <http://jenkins.mw.lab.eng.bos.redhat.com/hudson/job/Weld-2.x-int-servlet-jetty/ws/inject-tck-runner/target>
[INFO] 
[INFO] --- maven-enforcer-plugin:1.0-beta-1:enforce (enforce) @ weld-inject-tck-runner ---
[WARNING] This rule is not compatible with the current version of Maven. The rule is not able to perform any checks.
[INFO] 
[INFO] --- build-helper-maven-plugin:1.5:maven-version (default) @ weld-inject-tck-runner ---
[INFO] 
[INFO] --- build-helper-maven-plugin:1.5:parse-version (default) @ weld-inject-tck-runner ---
[INFO] 
[INFO] --- buildnumber-maven-plugin:1.2:create (set-build-properties) @ weld-inject-tck-runner ---
[INFO] 
[INFO] --- maven-remote-resources-plugin:1.1:process (attach-license) @ weld-inject-tck-runner ---
[INFO] 
[INFO] --- maven-resources-plugin:2.4.3:resources (default-resources) @ weld-inject-tck-runner ---
[INFO] Using 'UTF-8' encoding to copy filtered resources.
[INFO] skip non existing resourceDirectory <http://jenkins.mw.lab.eng.bos.redhat.com/hudson/job/Weld-2.x-int-servlet-jetty/ws/inject-tck-runner/src/main/resources>
[INFO] Copying 2 resources
[INFO] 
[INFO] --- maven-compiler-plugin:2.5.1:compile (default-compile) @ weld-inject-tck-runner ---
[INFO] No sources to compile
[INFO] 
[INFO] --- maven-checkstyle-plugin:2.12.1:checkstyle (check-style) @ weld-inject-tck-runner ---
[INFO] Starting audit...
Audit done.

[INFO] 
[INFO] --- maven-resources-plugin:2.4.3:testResources (default-testResources) @ weld-inject-tck-runner ---
[INFO] Using 'UTF-8' encoding to copy filtered resources.
[INFO] skip non existing resourceDirectory <http://jenkins.mw.lab.eng.bos.redhat.com/hudson/job/Weld-2.x-int-servlet-jetty/ws/inject-tck-runner/src/test/resources>
[INFO] Copying 2 resources
[INFO] 
[INFO] --- maven-compiler-plugin:2.5.1:testCompile (default-testCompile) @ weld-inject-tck-runner ---
[INFO] Compiling 2 source files to <http://jenkins.mw.lab.eng.bos.redhat.com/hudson/job/Weld-2.x-int-servlet-jetty/ws/inject-tck-runner/target/test-classes>
[INFO] 
[INFO] --- maven-surefire-plugin:2.17:test (default-test) @ weld-inject-tck-runner ---
[INFO] Tests are skipped.
[INFO] 
[INFO] --- maven-jar-plugin:2.3.1:jar (default-jar) @ weld-inject-tck-runner ---
[INFO] Building jar: <http://jenkins.mw.lab.eng.bos.redhat.com/hudson/job/Weld-2.x-int-servlet-jetty/ws/inject-tck-runner/target/weld-inject-tck-runner-2.3.0-SNAPSHOT.jar>
[INFO] 
[INFO] --- maven-jar-plugin:2.3.1:test-jar (default) @ weld-inject-tck-runner ---
[INFO] Building jar: <http://jenkins.mw.lab.eng.bos.redhat.com/hudson/job/Weld-2.x-int-servlet-jetty/ws/inject-tck-runner/target/weld-inject-tck-runner-2.3.0-SNAPSHOT-tests.jar>
[INFO] 
[INFO] >>> maven-source-plugin:2.1.2:jar (attach-sources) @ weld-inject-tck-runner >>>
[INFO] 
[INFO] --- maven-enforcer-plugin:1.0-beta-1:enforce (enforce) @ weld-inject-tck-runner ---
[WARNING] This rule is not compatible with the current version of Maven. The rule is not able to perform any checks.
[INFO] 
[INFO] --- build-helper-maven-plugin:1.5:maven-version (default) @ weld-inject-tck-runner ---
[INFO] 
[INFO] --- build-helper-maven-plugin:1.5:parse-version (default) @ weld-inject-tck-runner ---
[INFO] 
[INFO] --- buildnumber-maven-plugin:1.2:create (set-build-properties) @ weld-inject-tck-runner ---
[INFO] 
[INFO] <<< maven-source-plugin:2.1.2:jar (attach-sources) @ weld-inject-tck-runner <<<
[INFO] 
[INFO] --- maven-source-plugin:2.1.2:jar (attach-sources) @ weld-inject-tck-runner ---
[INFO] META-INF already added, skipping
[INFO] META-INF/DEPENDENCIES.txt already added, skipping
[INFO] META-INF/LICENSE.txt already added, skipping
[INFO] Building jar: <http://jenkins.mw.lab.eng.bos.redhat.com/hudson/job/Weld-2.x-int-servlet-jetty/ws/inject-tck-runner/target/weld-inject-tck-runner-2.3.0-SNAPSHOT-sources.jar>
[INFO] META-INF already added, skipping
[INFO] META-INF/DEPENDENCIES.txt already added, skipping
[INFO] META-INF/LICENSE.txt already added, skipping
[INFO] 
[INFO] >>> maven-source-plugin:2.1.2:test-jar (default) @ weld-inject-tck-runner >>>
[INFO] 
[INFO] --- maven-enforcer-plugin:1.0-beta-1:enforce (enforce) @ weld-inject-tck-runner ---
[WARNING] This rule is not compatible with the current version of Maven. The rule is not able to perform any checks.
[INFO] 
[INFO] --- build-helper-maven-plugin:1.5:maven-version (default) @ weld-inject-tck-runner ---
[INFO] 
[INFO] --- build-helper-maven-plugin:1.5:parse-version (default) @ weld-inject-tck-runner ---
[INFO] 
[INFO] --- buildnumber-maven-plugin:1.2:create (set-build-properties) @ weld-inject-tck-runner ---
[INFO] 
[INFO] <<< maven-source-plugin:2.1.2:test-jar (default) @ weld-inject-tck-runner <<<
[INFO] 
[INFO] --- maven-source-plugin:2.1.2:test-jar (default) @ weld-inject-tck-runner ---
[INFO] META-INF already added, skipping
[INFO] META-INF/DEPENDENCIES.txt already added, skipping
[INFO] META-INF/LICENSE.txt already added, skipping
[INFO] Building jar: <http://jenkins.mw.lab.eng.bos.redhat.com/hudson/job/Weld-2.x-int-servlet-jetty/ws/inject-tck-runner/target/weld-inject-tck-runner-2.3.0-SNAPSHOT-test-sources.jar>
[INFO] META-INF already added, skipping
[INFO] META-INF/DEPENDENCIES.txt already added, skipping
[INFO] META-INF/LICENSE.txt already added, skipping
[INFO] 
[INFO] --- maven-install-plugin:2.3.1:install (default-install) @ weld-inject-tck-runner ---
[INFO] Installing <http://jenkins.mw.lab.eng.bos.redhat.com/hudson/job/Weld-2.x-int-servlet-jetty/ws/inject-tck-runner/target/weld-inject-tck-runner-2.3.0-SNAPSHOT.jar> to /qa/home/hudson/private_maven_repos/weld/org/jboss/weld/weld-inject-tck-runner/2.3.0-SNAPSHOT/weld-inject-tck-runner-2.3.0-SNAPSHOT.jar
[INFO] Installing <http://jenkins.mw.lab.eng.bos.redhat.com/hudson/job/Weld-2.x-int-servlet-jetty/ws/inject-tck-runner/pom.xml> to /qa/home/hudson/private_maven_repos/weld/org/jboss/weld/weld-inject-tck-runner/2.3.0-SNAPSHOT/weld-inject-tck-runner-2.3.0-SNAPSHOT.pom
[INFO] Installing <http://jenkins.mw.lab.eng.bos.redhat.com/hudson/job/Weld-2.x-int-servlet-jetty/ws/inject-tck-runner/target/weld-inject-tck-runner-2.3.0-SNAPSHOT-tests.jar> to /qa/home/hudson/private_maven_repos/weld/org/jboss/weld/weld-inject-tck-runner/2.3.0-SNAPSHOT/weld-inject-tck-runner-2.3.0-SNAPSHOT-tests.jar
[INFO] ------------------------------------------------------------------------
[INFO] Reactor Summary:
[INFO] 
[INFO] Weld Parent ....................................... SUCCESS [13.547s]
[INFO] Weld Implementation (Core) ........................ SUCCESS [28.828s]
[INFO] Weld Core - JSF ................................... SUCCESS [1.956s]
[INFO] Weld Implementation ............................... SUCCESS [2.684s]
[INFO] Weld Probe Parent ................................. SUCCESS [0.602s]
[INFO] Weld Probe Core ................................... SUCCESS [9.116s]
[INFO] Weld Test Utilities ............................... SUCCESS [2.199s]
[INFO] weld-probe-integration-tests ...................... SUCCESS [3.536s]
[INFO] Weld Porting Package for the CDI TCK 1.1 .......... SUCCESS [1.889s]
[INFO] Weld Unit Tests ................................... SUCCESS [3.636s]
[INFO] Weld Integration Tests (JBoss AS) ................. SUCCESS [15.821s]
[INFO] AtInject TCK runner for Weld ...................... FAILURE [2.214s]
[INFO] CDI TCK runner (1.1, 1.2) for Weld (WildFly) ...... SKIPPED
[INFO] Weld Environment Common ........................... SKIPPED
[INFO] Weld SE (Core) .................................... SKIPPED
[INFO] Weld SE (Uber Jar) ................................ SKIPPED
[INFO] Weld Servlet Parent ............................... SKIPPED
[INFO] Weld Servlet Core ................................. SKIPPED
[INFO] Weld Servlet (Uber Jar) ........................... SKIPPED
[INFO] Weld Servlet Integration Tests (Base) ............. SKIPPED
[INFO] Weld Servlet Integration Tests (Tomcat) ........... SKIPPED
[INFO] Weld Servlet Integration Tests (Jetty) ............ SKIPPED
[INFO] ------------------------------------------------------------------------
[INFO] BUILD FAILURE
[INFO] ------------------------------------------------------------------------
[INFO] Total time: 1:27.838s
[INFO] Finished at: Wed Aug 19 04:02:20 EDT 2015
[INFO] Final Memory: 67M/353M
[INFO] ------------------------------------------------------------------------
[ERROR] Failed to execute goal org.apache.maven.plugins:maven-install-plugin:2.3.1:install (default-install) on project weld-inject-tck-runner: Failed to install metadata org.jboss.weld:weld-inject-tck-runner:2.3.0-SNAPSHOT/maven-metadata.xml: Could not read metadata /qa/home/hudson/private_maven_repos/weld/org/jboss/weld/weld-inject-tck-runner/2.3.0-SNAPSHOT/maven-metadata-local.xml: input contained no data -> [Help 1]
[ERROR] 
[ERROR] To see the full stack trace of the errors, re-run Maven with the -e switch.
[ERROR] Re-run Maven using the -X switch to enable full debug logging.
[ERROR] 
[ERROR] For more information about the errors and possible solutions, please read the following articles:
[ERROR] [Help 1] http://cwiki.apache.org/confluence/display/MAVEN/MojoExecutionException
[ERROR] 
[ERROR] After correcting the problems, you can resume the build with the command
[ERROR]   mvn <goals> -rf :weld-inject-tck-runner
Build step 'Invoke top-level Maven targets' marked build as failure
Recording test results
ERROR: Publisher hudson.tasks.junit.JUnitResultArchiver aborted due to exception
hudson.AbortException: Test reports were found but none of them are new. Did tests run? 
For example, <http://jenkins.mw.lab.eng.bos.redhat.com/hudson/job/Weld-2.x-int-servlet-jetty/ws/jetty-surefire-reports/8.1.17.v20150415>:jetty-embedded-7-TEST-org.jboss.weld.environment.servlet.test.bootstrap.BootstrapOrderingTest.xml is 5 days 20 hr old

	at hudson.tasks.junit.TestResult.parse(TestResult.java:178)
	at hudson.tasks.junit.TestResult.parse(TestResult.java:146)
	at hudson.tasks.junit.TestResult.<init>(TestResult.java:122)
	at hudson.tasks.junit.JUnitParser$ParseResultCallable.invoke(JUnitParser.java:119)
	at hudson.tasks.junit.JUnitParser$ParseResultCallable.invoke(JUnitParser.java:93)
	at hudson.FilePath$FileCallableWrapper.call(FilePath.java:2589)
	at hudson.remoting.UserRequest.perform(UserRequest.java:121)
	at hudson.remoting.UserRequest.perform(UserRequest.java:49)
	at hudson.remoting.Request$2.run(Request.java:324)
	at hudson.remoting.InterceptingExecutorService$1.call(InterceptingExecutorService.java:68)
	at java.util.concurrent.FutureTask.run(FutureTask.java:262)
	at java.util.concurrent.ThreadPoolExecutor.runWorker(ThreadPoolExecutor.java:1145)
	at java.util.concurrent.ThreadPoolExecutor$Worker.run(ThreadPoolExecutor.java:615)
	at java.lang.Thread.run(Thread.java:745)
	at ......remote call to qa04-rhel6-x86_64(Native Method)
	at hudson.remoting.Channel.attachCallSiteStackTrace(Channel.java:1356)
	at hudson.remoting.UserResponse.retrieve(UserRequest.java:221)
	at hudson.remoting.Channel.call(Channel.java:752)
	at hudson.FilePath.act(FilePath.java:969)
	at hudson.FilePath.act(FilePath.java:958)
	at hudson.tasks.junit.JUnitParser.parseResult(JUnitParser.java:90)
	at hudson.tasks.junit.JUnitResultArchiver.parse(JUnitResultArchiver.java:120)
	at hudson.tasks.junit.JUnitResultArchiver.perform(JUnitResultArchiver.java:137)
	at hudson.tasks.BuildStepCompatibilityLayer.perform(BuildStepCompatibilityLayer.java:74)
	at hudson.tasks.BuildStepMonitor$1.perform(BuildStepMonitor.java:20)
	at hudson.model.AbstractBuild$AbstractBuildExecution.perform(AbstractBuild.java:770)
	at hudson.model.AbstractBuild$AbstractBuildExecution.performAllBuildSteps(AbstractBuild.java:734)
	at hudson.model.Build$BuildExecution.post2(Build.java:183)
	at hudson.model.AbstractBuild$AbstractBuildExecution.post(AbstractBuild.java:683)
	at hudson.model.Run.execute(Run.java:1770)
	at hudson.model.FreeStyleBuild.run(FreeStyleBuild.java:43)
	at hudson.model.ResourceController.execute(ResourceController.java:89)
	at hudson.model.Executor.run(Executor.java:240)


More information about the weld-builds mailing list