[weld-builds] Build failed in Jenkins: Weld-2.x-incontainer-WF9-osprey #123

ci-builds at redhat.com ci-builds at redhat.com
Fri Mar 20 06:16:20 EDT 2015


See <http://jenkins.mw.lab.eng.bos.redhat.com/hudson/job/Weld-2.x-incontainer-WF9-osprey/123/>

------------------------------------------
[...truncated 93287 lines...]
  UnbackedAnnotatedTypeSerializationTest.org.jboss.weld.tests.serialization.annotated.UnbackedAnnotatedTypeSerializationTest » Deployment
  BackedAnnotatedTypeSerializationTest.org.jboss.weld.tests.serialization.annotated.BackedAnnotatedTypeSerializationTest » Deployment
  AnnotatedTypeBdaIdTest.org.jboss.weld.tests.serialization.annotated.id.AnnotatedTypeBdaIdTest » Deployment
  SerializationTest.org.jboss.weld.tests.serialization.SerializationTest » Deployment
  SerializationTest.org.jboss.weld.tests.serialization.noncontextual.SerializationTest » Deployment
  ServletListenerTest.org.jboss.weld.tests.nonContextual.ServletListenerTest » Deployment
  ExampleTest.org.jboss.weld.tests.nonContextual.ExampleTest » Deployment Cannot...
  Ejb3InterceptionModelTest.org.jboss.weld.tests.interceptors.ejb3model.Ejb3InterceptionModelTest » Deployment
  SuicidalInterceptorTest.org.jboss.weld.tests.interceptors.suicide.SuicidalInterceptorTest » Deployment
  UnreachableInterceptedInterfaceTest.org.jboss.weld.tests.interceptors.visibility.UnreachableInterceptedInterfaceTest » Deployment
  LifecycleInterceptorOrderingTest.org.jboss.weld.tests.interceptors.lifecycle.LifecycleInterceptorOrderingTest » Deployment
  CustomInterceptorRegistrationTest.org.jboss.weld.tests.interceptors.extension.CustomInterceptorRegistrationTest » Deployment
  CustomInterceptorInvocationTest.org.jboss.weld.tests.interceptors.extension.CustomInterceptorInvocationTest » Deployment
  AdvancedInterceptorDelegatingChainTest.org.jboss.weld.tests.interceptors.weld1538.advanced.AdvancedInterceptorDelegatingChainTest » Deployment
  InterceptorDelegatingChainTest.org.jboss.weld.tests.interceptors.weld1538.InterceptorDelegatingChainTest » Deployment
  InterceptionTest.org.jboss.weld.tests.interceptors.InterceptionTest » Deployment
  InterceptedBeanWithFinalMethodTest.org.jboss.weld.tests.interceptors.finalMethod.InterceptedBeanWithFinalMethodTest » Deployment
  SelfInvocationTest.org.jboss.weld.tests.interceptors.self.SelfInvocationTest » Deployment
  ExcludeClassInterceptorsTest.org.jboss.weld.tests.interceptors.exclusion.ExcludeClassInterceptorsTest » Deployment
  TargetClassInterceptorTest.org.jboss.weld.tests.interceptors.spi.TargetClassInterceptorTest » Deployment
  IgnoredAtEJBTest.org.jboss.weld.tests.interceptors.weld783.IgnoredAtEJBTest » Deployment
  Weld1019Test.org.jboss.weld.tests.interceptors.weld1019.Weld1019Test » Deployment
  InterceptorOrderTest.org.jboss.weld.tests.interceptors.interceptorsOrderWithEjbInterceptorOnClass.InterceptorOrderTest » Deployment
  CircularInvocationClassTest.org.jboss.weld.tests.interceptors.circularInvocation.ejb.CircularInvocationClassTest » Deployment
  SelfInvokingClassTest.org.jboss.weld.tests.interceptors.circularInvocation.SelfInvokingClassTest » Deployment
  AroundConstructInterceptorWithObjectReturnTypeTest.org.jboss.weld.tests.interceptors.signature.AroundConstructInterceptorWithObjectReturnTypeTest » Deployment
  TargetClassWithPostConstructWithInvalidReturnTypeTest.org.jboss.weld.tests.interceptors.signature.TargetClassWithPostConstructWithInvalidReturnTypeTest » Deployment
  TargetClassWithPostConstructWithInvalidParameterCountTest.org.jboss.weld.tests.interceptors.signature.TargetClassWithPostConstructWithInvalidParameterCountTest » Deployment
  AroundInvokeInterceptorWithValidSignatureTest.org.jboss.weld.tests.interceptors.signature.AroundInvokeInterceptorWithValidSignatureTest » Deployment
  PostConstructInterceptorWithoutParametersTest.org.jboss.weld.tests.interceptors.signature.PostConstructInterceptorWithoutParametersTest » Deployment
  AroundConstructInterceptorWithVoidReturnTypeTest.org.jboss.weld.tests.interceptors.signature.AroundConstructInterceptorWithVoidReturnTypeTest » Deployment
  TargetClassWithValidPostConstructTest.org.jboss.weld.tests.interceptors.signature.TargetClassWithValidPostConstructTest » Deployment
  PostConstructInterceptorWithVoidReturnTypeTest.org.jboss.weld.tests.interceptors.signature.PostConstructInterceptorWithVoidReturnTypeTest » Deployment
  PostConstructInterceptorWithObjectReturnTypeTest.org.jboss.weld.tests.interceptors.signature.PostConstructInterceptorWithObjectReturnTypeTest » Deployment
  TargetClassWithPostConstructWithThrowsClauseTest.org.jboss.weld.tests.interceptors.signature.TargetClassWithPostConstructWithThrowsClauseTest » Deployment
  TestInjectionWithExclusions.org.jboss.weld.tests.interceptors.injectionWithExclusions.TestInjectionWithExclusions » Deployment
  InvocationContextProceedDelegationTest.org.jboss.weld.tests.interceptors.delegation.InvocationContextProceedDelegationTest » Deployment
  InterceptedBeanWithFinalEqualsTest.org.jboss.weld.tests.interceptors.finalEquals.InterceptedBeanWithFinalEqualsTest » Deployment
  InicializationBlockTest.org.jboss.weld.tests.interceptors.initialization.block.InicializationBlockTest » Deployment
  DAOTest.org.jboss.weld.tests.interceptors.tb.DAOTest » Deployment Cannot deplo...
  ManagedBeanBridgeMethodTest.org.jboss.weld.tests.interceptors.bridgemethods.managed.ManagedBeanBridgeMethodTest » Deployment
  InterceptorBridgeMethodTest.org.jboss.weld.tests.interceptors.bridgemethods.hierarchy.InterceptorBridgeMethodTest » Deployment
  EJBBridgeMethodTest.org.jboss.weld.tests.interceptors.bridgemethods.ejb.EJBBridgeMethodTest » Deployment
  AroundConstructTest.org.jboss.weld.tests.interceptors.aroundConstruct.basic.AroundConstructTest » Deployment
  AroundConstructContainerIntegrationTest.org.jboss.weld.tests.interceptors.aroundConstruct.integration.AroundConstructContainerIntegrationTest » Deployment
  SessionBeanConstructorInterceptionTest.org.jboss.weld.tests.interceptors.aroundConstruct.extended.ejb.SessionBeanConstructorInterceptionTest » Deployment
  ConstructorInterceptionTest.org.jboss.weld.tests.interceptors.aroundConstruct.extended.ConstructorInterceptionTest » Deployment
  RetryInterceptorTest.org.jboss.weld.tests.interceptors.retrySimple.RetryInterceptorTest » Deployment
  InterceptorOrderTest.org.jboss.weld.tests.interceptors.interceptorsOrderWithEjbInterceptorOnMethod.InterceptorOrderTest » Deployment
  SplitInterceptorsTest.org.jboss.weld.tests.interceptors.lhotse.SplitInterceptorsTest » Deployment
  PassivationActivationTest.org.jboss.weld.tests.interceptors.passivation.PassivationActivationTest » Deployment
  SimpleWeldClassTest.org.jboss.weld.tests.interceptors.generic.SimpleWeldClassTest » Deployment
  DuplicateInterceptorTest.org.jboss.weld.tests.interceptors.weld1410.DuplicateInterceptorTest » Deployment
  DuplicateInterceptorTest.org.jboss.weld.tests.interceptors.weld760.DuplicateInterceptorTest » Deployment
  SingleInterceptorInstancePerBeanInstanceTest.org.jboss.weld.tests.interceptors.singleInstance.SingleInterceptorInstancePerBeanInstanceTest » Deployment
  InterceptorOrderTest.org.jboss.weld.tests.interceptors.interceptorsOrderWithExclusions.InterceptorOrderTest » Deployment
  SimpleInterceptorTest.org.jboss.weld.tests.interceptors.simple.SimpleInterceptorTest » Deployment
  EnterpriseBeanInterceptionTest.org.jboss.weld.tests.interceptors.ejb.EnterpriseBeanInterceptionTest » Deployment
  InterceptorsWithHierarchyTest.org.jboss.weld.tests.interceptors.hierarchical.InterceptorsWithHierarchyTest » Deployment
  TestInjectionWithExclusionsOnMethods.org.jboss.weld.tests.interceptors.injectionWithMethodExclusions.TestInjectionWithExclusionsOnMethods » Deployment
  InterceptorWithNoBindingTest.org.jboss.weld.tests.interceptors.no.binding.InterceptorWithNoBindingTest » Deployment
  TestInterceptedBeanWithFinalMethod.org.jboss.weld.tests.interceptors.weld771.TestInterceptedBeanWithFinalMethod » Deployment
  InterceptorInvocationTest.org.jboss.weld.tests.interceptors.weld1391.InterceptorInvocationTest » Deployment
  InterceptorExceptionWrappingTest.org.jboss.weld.tests.interceptors.exceptions.InterceptorExceptionWrappingTest » Deployment
  InterceptorConflictingEnablementTest.org.jboss.weld.tests.interceptors.conflictingenablement.InterceptorConflictingEnablementTest » Deployment
  InterceptorTest.org.jboss.weld.tests.interceptors.weld1174.InterceptorTest » Deployment
  InterceptorDispatchingToDiffferentThreadTest.org.jboss.weld.tests.interceptors.thread.InterceptorDispatchingToDiffferentThreadTest » Deployment
  AsyncInterceptorTest.org.jboss.weld.tests.interceptors.thread.async.AsyncInterceptorTest » Deployment
  CachedInterceptionDecorationContextTest.org.jboss.weld.tests.interceptors.cache.CachedInterceptionDecorationContextTest » Deployment
  InheritedInterceptorBindingsTest.org.jboss.weld.tests.interceptors.binding.inheritance.InheritedInterceptorBindingsTest » Deployment
  InterceptorBindingOverridingTest.org.jboss.weld.tests.interceptors.binding.overriding.InterceptorBindingOverridingTest » Deployment
  InterceptorBindingTargetCheckTest.org.jboss.weld.tests.interceptors.binding.validation.InterceptorBindingTargetCheckTest » Deployment
  InterceptorBindingTransitivityTest.org.jboss.weld.tests.interceptors.binding.transitivity.InterceptorBindingTransitivityTest » Deployment
  TestInterceptedBeanWithoutNoArgConstructor.org.jboss.weld.tests.interceptors.weld770.TestInterceptedBeanWithoutNoArgConstructor » Deployment
  ContextTest.org.jboss.weld.tests.contexts.ContextTest » Deployment Cannot depl...
  ApplicationScopedTest.org.jboss.weld.tests.contexts.ApplicationScopedTest » Deployment
  Weld1418Test.org.jboss.weld.tests.contexts.conversation.weld1418.Weld1418Test » Deployment
  PassivatingContextTest.org.jboss.weld.tests.contexts.PassivatingContextTest » Deployment
  ParameterizedTypeScopedTest.org.jboss.weld.tests.contexts.ParameterizedTypeScopedTest » Deployment
  NonPassivationCapableSessionBeanTest.org.jboss.weld.tests.contexts.passivating.enterprise.NonPassivationCapableSessionBeanTest » Deployment
  PassivationTest.org.jboss.weld.tests.contexts.passivating.serialization.interception.PassivationTest » Deployment
  PassivationTest.org.jboss.weld.tests.contexts.passivating.serialization.PassivationTest » Deployment
  CustomPassivatingScopeCalledWithSerializableParametersTest.org.jboss.weld.tests.contexts.passivating.custom.CustomPassivatingScopeCalledWithSerializableParametersTest » Deployment
  NonPassivatingInjectionIntoPassivatingBeanTest.org.jboss.weld.tests.contexts.passivating.injection.NonPassivatingInjectionIntoPassivatingBeanTest » Deployment
  DecoratorWithNonPassivationCapableDependenciesTest.org.jboss.weld.tests.contexts.passivating.validation.DecoratorWithNonPassivationCapableDependenciesTest » Deployment
  InterceptorWithNonPassivationCapableDependenciesTest.org.jboss.weld.tests.contexts.passivating.validation.InterceptorWithNonPassivationCapableDependenciesTest » Deployment
  ApplicationScopeEventTest.org.jboss.weld.tests.contexts.application.event.ApplicationScopeEventTest » Deployment
  CustomRequestContextDuringAsyncCallTest.org.jboss.weld.tests.contexts.request.custom.CustomRequestContextDuringAsyncCallTest » Deployment
  RequestScopeActiveDuringSingletonStartupWithDependenciesTest.org.jboss.weld.tests.contexts.request.postConstruct.singleton.complicated.RequestScopeActiveDuringSingletonStartupWithDependenciesTest » Deployment
  RequestScopeActiveDuringSingletonStartupTest.org.jboss.weld.tests.contexts.request.postConstruct.singleton.simple.RequestScopeActiveDuringSingletonStartupTest » Deployment
  RequestScopeActiveDuringSLSBInitializationTest.org.jboss.weld.tests.contexts.request.postConstruct.slsb.RequestScopeActiveDuringSLSBInitializationTest » Deployment
  RmiRequestScopeTest.org.jboss.weld.tests.contexts.request.rmi.RmiRequestScopeTest » Deployment
  RequestScopeActiveDuringSingletonStartupTest.org.jboss.weld.tests.contexts.request.startup.ejb.RequestScopeActiveDuringSingletonStartupTest » Deployment
  AlterableContextTest.org.jboss.weld.tests.contexts.alterable.AlterableContextTest » Deployment
  CreationalContextTest.org.jboss.weld.tests.contexts.creational.CreationalContextTest » Deployment
  DisposerBridgeMethodTest.org.jboss.weld.tests.bridge.methods.DisposerBridgeMethodTest » Deployment
  ObserverBridgeMethodTest.org.jboss.weld.tests.bridge.methods.ObserverBridgeMethodTest » Deployment
  ProducerBridgeMethodTest.org.jboss.weld.tests.bridge.methods.ProducerBridgeMethodTest » Deployment
  AnnotationTest.org.jboss.weld.tests.annotations.AnnotationTest » Deployment Ca...
  Weld1131Test.org.jboss.weld.tests.annotations.weld1131.Weld1131Test » Deployment
  StaticFinalMethodTest.org.jboss.weld.tests.scope.unproxyable.method.StaticFinalMethodTest » Deployment
  PrivateFinalMethodTest.org.jboss.weld.tests.scope.unproxyable.method.PrivateFinalMethodTest » Deployment
  ScopeTest.org.jboss.weld.tests.scope.ScopeTest » Deployment Cannot deploy: 3de...
  ContainerLifecycleEventDeliveryNotConcurrentTest.org.jboss.weld.tests.event.lifecycle.concurrent.ContainerLifecycleEventDeliveryNotConcurrentTest » Deployment
  ContainerLifecycleEventInvocationOutsideObserverTest.org.jboss.weld.tests.event.lifecycle.phase.ContainerLifecycleEventInvocationOutsideObserverTest » Deployment
  ContainerLifecycleEventNotFiredIntoBeanTest.org.jboss.weld.tests.event.lifecycle.ContainerLifecycleEventNotFiredIntoBeanTest » Deployment
  SimpleEventTest.org.jboss.weld.tests.event.SimpleEventTest » Deployment Cannot...
  SuperclassObserversTest.org.jboss.weld.tests.event.observer.superclass.SuperclassObserversTest » Deployment
  SuperclassObservers1Test.org.jboss.weld.tests.event.observer.superclass.SuperclassObservers1Test » Deployment
  SuperclassObservers2Test.org.jboss.weld.tests.event.observer.superclass.SuperclassObservers2Test » Deployment
  ConditionalObserverCustomContextTest.org.jboss.weld.tests.event.observer.conditional.ConditionalObserverCustomContextTest » Deployment
  FiringArrayEventTest.org.jboss.weld.tests.event.observer.validation.FiringArrayEventTest » Deployment
  TransactionalObserversTest.org.jboss.weld.tests.event.observer.transactional.TransactionalObserversTest » Deployment
  EventQualifierTest.org.jboss.weld.tests.event.EventQualifierTest » Deployment ...
  EventSelectTest.org.jboss.weld.tests.event.subtype.EventSelectTest » Deployment
  ParameterizedEventTest.org.jboss.weld.tests.event.parameterized.ParameterizedEventTest » Deployment
  FiringNullEventTest.org.jboss.weld.tests.event.weld1361.FiringNullEventTest » Deployment
  RawEventTypeTest.org.jboss.weld.tests.event.weld1361.RawEventTypeTest » Deployment
  JsfTest.org.jboss.weld.tests.jsf.JsfTest » Deployment Cannot deploy: test.war
  Weld1247Test.org.jboss.weld.tests.jsf.weld1247.Weld1247Test » Deployment Canno...
  Weld1037Test.org.jboss.weld.tests.jsf.weld1037.Weld1037Test » Deployment Canno...
  VetoTest.org.jboss.weld.tests.veto.VetoTest » Deployment Cannot deploy: ecf4ea...
  ResourceTest.org.jboss.weld.tests.resources.ResourceTest » Deployment Cannot d...
  RequestScopeEventMessageDeliveryTest.org.jboss.weld.tests.resources.proxy.weld1782.RequestScopeEventMessageDeliveryTest » Deployment
  WebServiceResourceTest.org.jboss.weld.tests.resources.ws.WebServiceResourceTest » Deployment
  GenericBeanTest.org.jboss.weld.tests.generic.GenericBeanTest » Deployment Cann...
  DisposesMethodCalledOnceTest.org.jboss.weld.tests.disposer.weld1894.DisposesMethodCalledOnceTest » Deployment
  DisposerMethodThrowsExceptionTest.org.jboss.weld.tests.disposer.exception.DisposerMethodThrowsExceptionTest » Deployment
  DisposedParameterWithNoRequiredQualifiersTest.org.jboss.weld.tests.disposer.resolution.DisposedParameterWithNoRequiredQualifiersTest » Deployment
  DisposedParameterPositionTest.org.jboss.weld.tests.disposer.parameter.position.DisposedParameterPositionTest » Deployment
  SmokeNamedTest.org.jboss.weld.tests.named.SmokeNamedTest » Deployment Cannot d...
  ResolutionTest.org.jboss.weld.tests.resolution.ResolutionTest » Deployment Can...
  Weld279Test.org.jboss.weld.tests.resolution.wbri279.Weld279Test » Deployment C...
  SelfInjectionBeanTest.org.jboss.weld.tests.resolution.circular.self.SelfInjectionBeanTest » Deployment
  ResourceCircularDependencyTest.org.jboss.weld.tests.resolution.circular.resource.ResourceCircularDependencyTest » Deployment
  LookupInstanceTest.org.jboss.weld.tests.resolution.LookupInstanceTest » Deployment
  Weld256Test.org.jboss.weld.tests.resolution.Weld256Test » Deployment Cannot de...
  DependentScopeInjectionTest.org.jboss.weld.tests.resolution.weld911.DependentScopeInjectionTest » Deployment
  NamedBeanTest.org.jboss.weld.tests.resolution.named.NamedBeanTest » Deployment
  ResolutionTest.org.jboss.weld.tests.resolution.weld1075.ResolutionTest » Deployment
  RawBeanTypeTest.org.jboss.weld.tests.resolution.weld1723.RawBeanTypeTest » Deployment
  ContextualReferenceTest.org.jboss.weld.tests.resolution.wbri293.ContextualReferenceTest » Deployment
  StereotypesTest.org.jboss.weld.tests.stereotypes.StereotypesTest » Deployment ...
  AlternativeStereotypeTest.org.jboss.weld.tests.stereotypes.alternative.AlternativeStereotypeTest » Deployment
  DependentSessionBeanNotSharedOptimDisabledTest.org.jboss.weld.tests.ejb.dependent.stateful.DependentSessionBeanNotSharedOptimDisabledTest » Deployment
  DependentSessionBeanNotSharedOptimEnabledTest.org.jboss.weld.tests.ejb.dependent.stateful.DependentSessionBeanNotSharedOptimEnabledTest » Deployment
  SingletonStartupTest.org.jboss.weld.tests.ejb.singleton.SingletonStartupTest » Deployment
  StatefulSessionBeanRecreatedAfterDestroyTest.org.jboss.weld.tests.ejb.stateful.exception.StatefulSessionBeanRecreatedAfterDestroyTest » Deployment
  EJBCallTest.org.jboss.weld.tests.ejb.EJBCallTest » Deployment Cannot deploy: t...
  EjbBusinessInterfaceTest.org.jboss.weld.tests.ejb.business.view.EjbBusinessInterfaceTest » Deployment
  EJBTest.org.jboss.weld.tests.ejb.mdb.dummy.EJBTest » Deployment Cannot deploy:...
  DuplicateEJBNamesDiscoveryTest.org.jboss.weld.tests.ejb.duplicatenames.DuplicateEJBNamesDiscoveryTest » Deployment
  SessionBeanInterceptorTest.org.jboss.weld.tests.ejb.interceptor.SessionBeanInterceptorTest » Deployment
  SessionBeanInterceptorTrulySerializableTest.org.jboss.weld.tests.ejb.interceptor.serializable.SessionBeanInterceptorTrulySerializableTest » Deployment
  EJBTest.org.jboss.weld.tests.ejb.EJBTest » Deployment Cannot deploy: cbbe61fc-...
  MockExampleTest.org.jboss.weld.tests.examples.MockExampleTest » Deployment Can...
  ExampleTest.org.jboss.weld.tests.examples.ExampleTest » Deployment Cannot depl...
  BeansXmlTest.org.jboss.weld.tests.xml.broken.parsing.BeansXmlTest » Deployment
  BeanMetadataAvailableForTransientReferenceTest.org.jboss.weld.tests.transientReference.metadata.BeanMetadataAvailableForTransientReferenceTest » Deployment
  TransientReferenceDestroyedAfterInvocationTest.org.jboss.weld.tests.transientReference.TransientReferenceDestroyedAfterInvocationTest » Deployment
  Weld930Test.org.jboss.weld.tests.alternatives.weld930.Weld930Test » Deployment
  EnabledClassWithAlternativeStereotypeTest.org.jboss.weld.tests.alternatives.weld1286.EnabledClassWithAlternativeStereotypeTest » Deployment
  Alternatives2Test.org.jboss.weld.tests.alternatives.Alternatives2Test » Deployment
  AlternativeEEComponentTest.org.jboss.weld.tests.alternatives.ee.AlternativeEEComponentTest » Deployment
  AlternativesTest.org.jboss.weld.tests.alternatives.AlternativesTest » Deployment
  DisabledAlternativeNotValidatedTest.org.jboss.weld.tests.alternatives.weld1438.DisabledAlternativeNotValidatedTest » Deployment
  AccessibleAlternatives2Test.org.jboss.weld.tests.alternatives.accessible.AccessibleAlternatives2Test » Deployment
  AccessibleAlternativesTest.org.jboss.weld.tests.alternatives.accessible.AccessibleAlternativesTest » Deployment
  AssignabilityTest.org.jboss.weld.tests.assignability.AssignabilityTest » Deployment
  TypeVariableAssignabilityTest.org.jboss.weld.tests.assignability.variable.TypeVariableAssignabilityTest » Deployment
  ExceptionHandlingTest.org.jboss.weld.tests.exceptions.ExceptionHandlingTest » Deployment
  MultipleBeansTest.org.jboss.weld.tests.extensions.multipleBeans.MultipleBeansTest » Deployment
  SuperTypeTest.org.jboss.weld.tests.extensions.supertypes.beans.SuperTypeTest » Deployment
  VerifyValuesTest.org.jboss.weld.tests.extensions.lifecycle.processBeanAttributes.VerifyValuesTest » Deployment
  SetBeanAttributesTest.org.jboss.weld.tests.extensions.lifecycle.processBeanAttributes.modify.SetBeanAttributesTest » Deployment
  VetoTest.org.jboss.weld.tests.extensions.lifecycle.processBeanAttributes.specialization.VetoTest » Deployment
  SpecializationTest.org.jboss.weld.tests.extensions.lifecycle.processBeanAttributes.specialization.SpecializationTest » Deployment
  VetoTest.org.jboss.weld.tests.extensions.lifecycle.processBeanAttributes.veto.VetoTest » Deployment
  ProcessBeanAttributesNotFiredTest.org.jboss.weld.tests.extensions.lifecycle.processBeanAttributes.notfired.ProcessBeanAttributesNotFiredTest » Deployment
  ProcessSyntheticAnnotatedTypeTest.org.jboss.weld.tests.extensions.lifecycle.processSyntheticAnnotatedType.ProcessSyntheticAnnotatedTypeTest » Deployment
  EventsNotFiredForAnonymousClassTest.org.jboss.weld.tests.extensions.lifecycle.weld1884.EventsNotFiredForAnonymousClassTest » Deployment
  GetDisposedParameterTest.org.jboss.weld.tests.extensions.lifecycle.processProducerField.GetDisposedParameterTest » Deployment
  AfterTypeDiscoveryTest.org.jboss.weld.tests.extensions.lifecycle.atd.AfterTypeDiscoveryTest » Deployment
  InjectionPointOverridingTest.org.jboss.weld.tests.extensions.lifecycle.processInjectionPoint.modify.InjectionPointOverridingTest » Deployment
  ProcessInjectionPointFiredTest.org.jboss.weld.tests.extensions.lifecycle.processInjectionPoint.ProcessInjectionPointFiredTest » Deployment
  SubclassConstructorInjectionPointTest.org.jboss.weld.tests.extensions.lifecycle.processInjectionPoint.subclass.SubclassConstructorInjectionPointTest » Deployment
  BeforeShutdownExtTest.org.jboss.weld.tests.extensions.lifecycle.BeforeShutdownExtTest » Deployment
  ProcessBeanTest.org.jboss.weld.tests.extensions.lifecycle.processBean.annotated.ProcessBeanTest » Deployment
  AddPassivationCapableBeanWithNullIdTest.org.jboss.weld.tests.extensions.lifecycle.processBean.passivationCapable.AddPassivationCapableBeanWithNullIdTest » Deployment
  WithAnnotationsTest.org.jboss.weld.tests.extensions.annotatedType.withAnnotations.WithAnnotationsTest » Deployment
  AnnotatedTypeExtensionTest.org.jboss.weld.tests.extensions.annotatedType.AnnotatedTypeExtensionTest » Deployment
  AnnotatedTypeSessionBeanTest.org.jboss.weld.tests.extensions.annotatedType.ejb.AnnotatedTypeSessionBeanTest » Deployment
  ExtensionFieldMissingDependencyTest.org.jboss.weld.tests.extensions.missing.dependencies.ExtensionFieldMissingDependencyTest » Deployment
  SessionBeanExtensionTest.org.jboss.weld.tests.extensions.sessionbean.SessionBeanExtensionTest » Deployment
  EnterpriseExtensionTest.org.jboss.weld.tests.extensions.EnterpriseExtensionTest » Deployment
  InterceptorExtensionTest.org.jboss.weld.tests.extensions.interceptors.InterceptorExtensionTest » Deployment
  SpiAddedInterceptorBindingTest.org.jboss.weld.tests.extensions.interceptors.annotated.SpiAddedInterceptorBindingTest » Deployment
  InjectedExtensionIsPassivationCapableDependencyTest.org.jboss.weld.tests.extensions.injection.InjectedExtensionIsPassivationCapableDependencyTest » Deployment
  SpiAddedQualifierTest.org.jboss.weld.tests.extensions.qualifiers.annotated.SpiAddedQualifierTest » Deployment
  SpiAddedQualifierTest.org.jboss.weld.tests.extensions.qualifiers.SpiAddedQualifierTest » Deployment
  AlternativeMetadataTest.org.jboss.weld.tests.extensions.alternative.metadata.AlternativeMetadataTest » Deployment
  ExtensionTest.org.jboss.weld.tests.extensions.ExtensionTest » Deployment Canno...
  InjectionPointWithTypesAndQualifiersOnlyTest.org.jboss.weld.tests.extensions.injectionPointWithTypesAndQualifiersOnly.InjectionPointWithTypesAndQualifiersOnlyTest » Deployment
  DestroyingDependentInstanceTest.org.jboss.weld.tests.instance.destroy.dependent.DestroyingDependentInstanceTest » Deployment
  DestroyingNormalScopedInstanceTest.org.jboss.weld.tests.instance.destroy.normal.DestroyingNormalScopedInstanceTest » Deployment
  InstanceIteratorTest.org.jboss.weld.tests.instance.iterator.dependent.InstanceIteratorTest » Deployment
  EventCurrentActivityTest.org.jboss.weld.tests.activities.current.EventCurrentActivityTest » Deployment
  NonNormalScopeTest.org.jboss.weld.tests.activities.current.NonNormalScopeTest » Deployment
  InactiveScopeTest.org.jboss.weld.tests.activities.current.InactiveScopeTest » Deployment
  ELCurrentActivityTest.org.jboss.weld.tests.activities.current.ELCurrentActivityTest » Deployment
  InjectedManagerCurrentActivityTest.org.jboss.weld.tests.activities.current.InjectedManagerCurrentActivityTest » Deployment
  InstanceCurrentActivityTest.org.jboss.weld.tests.activities.current.InstanceCurrentActivityTest » Deployment
  ActivitiesTest.org.jboss.weld.tests.activities.ActivitiesTest » Deployment Can...
  AdditionalServiceTest.org.jboss.weld.tests.service.additional.AdditionalServiceTest » Deployment
  BootstrapTest.org.jboss.weld.tests.beanDeployment.session.single.BootstrapTest » Deployment
  BootstrapTest.org.jboss.weld.tests.beanDeployment.session.multiple.BootstrapTest » Deployment
  BootstrapTest.org.jboss.weld.tests.beanDeployment.managed.single.BootstrapTest » Deployment
  BootstrapTest.org.jboss.weld.tests.beanDeployment.managed.missingClassDependency.BootstrapTest » Deployment
  Bootstrap2Test.org.jboss.weld.tests.beanDeployment.managed.missingClassDependency.Bootstrap2Test » Deployment
  BootstrapTest.org.jboss.weld.tests.beanDeployment.managed.multiple.BootstrapTest » Deployment
  NoClassDefFoundErrorTest.org.jboss.weld.tests.beanDeployment.noclassdeffound.NoClassDefFoundErrorTest » Deployment
  BootstrapTest.org.jboss.weld.tests.beanDeployment.producers.singleProducerMethod.BootstrapTest » Deployment
  BootstrapTest.org.jboss.weld.tests.beanDeployment.mixed.BootstrapTest » Deployment
  ArrayInjectionTest.org.jboss.weld.tests.arrays.ArrayInjectionTest » Deployment
  AssignabilityTest.org.jboss.weld.tests.arrays.test.AssignabilityTest » Deployment
  WebServiceInterceptorTest.org.jboss.weld.tests.ws.interceptors.WebServiceInterceptorTest » Deployment

Tests run: 619, Failures: 0, Errors: 428, Skipped: 10

[INFO] ------------------------------------------------------------------------
[INFO] BUILD FAILURE
[INFO] ------------------------------------------------------------------------
[INFO] Total time: 02:14 min
[INFO] Finished at: 2015-03-20T18:14:03+08:00
[INFO] Final Memory: 50M/742M
[INFO] ------------------------------------------------------------------------
[ERROR] Failed to execute goal org.apache.maven.plugins:maven-surefire-plugin:2.17:test (default-test) on project weld-core-test-arquillian: There are test failures.
[ERROR] 
[ERROR] Please refer to <http://jenkins.mw.lab.eng.bos.redhat.com/hudson/job/Weld-2.x-incontainer-WF9-osprey/ws/weld/tests-arquillian/target/surefire-reports> for the individual test results.
[ERROR] -> [Help 1]
[ERROR] 
[ERROR] To see the full stack trace of the errors, re-run Maven with the -e switch.
[ERROR] Re-run Maven using the -X switch to enable full debug logging.
[ERROR] 
[ERROR] For more information about the errors and possible solutions, please read the following articles:
[ERROR] [Help 1] http://cwiki.apache.org/confluence/display/MAVEN/MojoFailureException
Build step 'Execute shell' marked build as failure
Archiving artifacts
Recording test results



More information about the weld-builds mailing list