[weld-builds] Build failed in Jenkins: Weld-2.x-interoperability-deltaspike-WF8 #472

ci-builds at redhat.com ci-builds at redhat.com
Wed May 13 15:47:03 EDT 2015


See <http://jenkins.mw.lab.eng.bos.redhat.com/hudson/job/Weld-2.x-interoperability-deltaspike-WF8/472/>

------------------------------------------
[...truncated 7137 lines...]
[INFO] --- maven-clean-plugin:2.5:clean (default-clean) @ deltaspike-jsf-playground ---
[INFO] Deleting <http://jenkins.mw.lab.eng.bos.redhat.com/hudson/job/Weld-2.x-interoperability-deltaspike-WF8/ws/deltaspike/examples/jsf-playground/target>
[INFO] 
[INFO] --- maven-bundle-plugin:2.3.7:cleanVersions (versions) @ deltaspike-jsf-playground ---
[INFO] 
[INFO] --- maven-antrun-plugin:1.7:run (javadoc.resources) @ deltaspike-jsf-playground ---
[WARNING] Parameter tasks is deprecated, use target instead
[INFO] Executing tasks

main:
[INFO] Executed tasks
[INFO] 
[INFO] --- maven-remote-resources-plugin:1.3:process (process-remote-resources) @ deltaspike-jsf-playground ---
[INFO] 
[INFO] --- maven-remote-resources-plugin:1.3:process (default) @ deltaspike-jsf-playground ---
[INFO] 
[INFO] --- maven-resources-plugin:2.6:resources (default-resources) @ deltaspike-jsf-playground ---
[INFO] Using 'UTF-8' encoding to copy filtered resources.
[INFO] Copying 1 resource
[INFO] Copying 4 resources
[INFO] Copying 4 resources
[INFO] 
[INFO] --- maven-compiler-plugin:2.5:compile (default-compile) @ deltaspike-jsf-playground ---
[INFO] Compiling 8 source files to <http://jenkins.mw.lab.eng.bos.redhat.com/hudson/job/Weld-2.x-interoperability-deltaspike-WF8/ws/deltaspike/examples/jsf-playground/target/classes>
[INFO] 
[INFO] --- maven-resources-plugin:2.6:testResources (default-testResources) @ deltaspike-jsf-playground ---
[INFO] Using 'UTF-8' encoding to copy filtered resources.
[INFO] skip non existing resourceDirectory <http://jenkins.mw.lab.eng.bos.redhat.com/hudson/job/Weld-2.x-interoperability-deltaspike-WF8/ws/deltaspike/examples/jsf-playground/src/test/resources>
[INFO] Copying 4 resources
[INFO] Copying 4 resources
[INFO] 
[INFO] --- maven-compiler-plugin:2.5:testCompile (default-testCompile) @ deltaspike-jsf-playground ---
[INFO] No sources to compile
[INFO] 
[INFO] --- maven-surefire-plugin:2.11:test (default-test) @ deltaspike-jsf-playground ---
[INFO] Surefire report directory: <http://jenkins.mw.lab.eng.bos.redhat.com/hudson/job/Weld-2.x-interoperability-deltaspike-WF8/ws/deltaspike/examples/jsf-playground/target/surefire-reports>
[INFO] Using configured provider org.apache.maven.surefire.junitcore.JUnitCoreProvider

-------------------------------------------------------
 T E S T S
-------------------------------------------------------
Concurrency config is parallel='none', perCoreThreadCount=true, threadCount=2, useUnlimitedThreads=false

Results :

Tests run: 0, Failures: 0, Errors: 0, Skipped: 0

[INFO] 
[INFO] --- maven-war-plugin:2.2:war (default-war) @ deltaspike-jsf-playground ---
[INFO] Packaging webapp
[INFO] Assembling webapp [deltaspike-jsf-playground] in [<http://jenkins.mw.lab.eng.bos.redhat.com/hudson/job/Weld-2.x-interoperability-deltaspike-WF8/ws/deltaspike/examples/jsf-playground/target/ds]>
[INFO] Processing war project
[INFO] Copying webapp resources [<http://jenkins.mw.lab.eng.bos.redhat.com/hudson/job/Weld-2.x-interoperability-deltaspike-WF8/ws/deltaspike/examples/jsf-playground/src/main/webapp]>
[INFO] Webapp assembled in [17 msecs]
[INFO] Building war: <http://jenkins.mw.lab.eng.bos.redhat.com/hudson/job/Weld-2.x-interoperability-deltaspike-WF8/ws/deltaspike/examples/jsf-playground/target/ds.war>
[INFO] WEB-INF/web.xml already added, skipping
[INFO] 
[INFO] --- maven-site-plugin:3.3:attach-descriptor (attach-descriptor) @ deltaspike-jsf-playground ---
[INFO] 
[INFO] >>> maven-source-plugin:2.2.1:jar (attach-sources) @ deltaspike-jsf-playground >>>
[INFO] 
[INFO] --- maven-bundle-plugin:2.3.7:cleanVersions (versions) @ deltaspike-jsf-playground ---
[INFO] 
[INFO] --- maven-antrun-plugin:1.7:run (javadoc.resources) @ deltaspike-jsf-playground ---
[WARNING] Parameter tasks is deprecated, use target instead
[INFO] Executing tasks

main:
[INFO] Executed tasks
[INFO] 
[INFO] <<< maven-source-plugin:2.2.1:jar (attach-sources) @ deltaspike-jsf-playground <<<
[INFO] 
[INFO] --- maven-source-plugin:2.2.1:jar (attach-sources) @ deltaspike-jsf-playground ---
[INFO] Building jar: <http://jenkins.mw.lab.eng.bos.redhat.com/hudson/job/Weld-2.x-interoperability-deltaspike-WF8/ws/deltaspike/examples/jsf-playground/target/ds-sources.jar>
[INFO] 
[INFO] --- maven-checkstyle-plugin:2.9.1:check (verify-style) @ deltaspike-jsf-playground ---
[INFO] Starting audit...
Audit done.

[INFO] 
[INFO] --- maven-install-plugin:2.5.1:install (default-install) @ deltaspike-jsf-playground ---
[INFO] Installing <http://jenkins.mw.lab.eng.bos.redhat.com/hudson/job/Weld-2.x-interoperability-deltaspike-WF8/ws/deltaspike/examples/jsf-playground/target/ds.war> to /home/hudson/.m2/repository/org/apache/deltaspike/examples/deltaspike-jsf-playground/1.3.1-SNAPSHOT/deltaspike-jsf-playground-1.3.1-SNAPSHOT.war
[INFO] Installing <http://jenkins.mw.lab.eng.bos.redhat.com/hudson/job/Weld-2.x-interoperability-deltaspike-WF8/ws/deltaspike/examples/jsf-playground/pom.xml> to /home/hudson/.m2/repository/org/apache/deltaspike/examples/deltaspike-jsf-playground/1.3.1-SNAPSHOT/deltaspike-jsf-playground-1.3.1-SNAPSHOT.pom
[INFO] Installing <http://jenkins.mw.lab.eng.bos.redhat.com/hudson/job/Weld-2.x-interoperability-deltaspike-WF8/ws/deltaspike/examples/jsf-playground/target/ds-sources.jar> to /home/hudson/.m2/repository/org/apache/deltaspike/examples/deltaspike-jsf-playground/1.3.1-SNAPSHOT/deltaspike-jsf-playground-1.3.1-SNAPSHOT-sources.jar
[INFO]                                                                         
[INFO] ------------------------------------------------------------------------
[INFO] Building DeltaSpike Example: Show requested page after login with CDI 1.3.1-SNAPSHOT
[INFO] ------------------------------------------------------------------------
[INFO] 
[INFO] --- maven-clean-plugin:2.5:clean (default-clean) @ deltaspike-security-requested-page-after-login-cdi ---
[INFO] Deleting <http://jenkins.mw.lab.eng.bos.redhat.com/hudson/job/Weld-2.x-interoperability-deltaspike-WF8/ws/deltaspike/examples/security-requested-page-after-login-cdi/target>
[INFO] 
[INFO] --- maven-bundle-plugin:2.3.7:cleanVersions (versions) @ deltaspike-security-requested-page-after-login-cdi ---
[INFO] 
[INFO] --- maven-antrun-plugin:1.7:run (javadoc.resources) @ deltaspike-security-requested-page-after-login-cdi ---
[WARNING] Parameter tasks is deprecated, use target instead
[INFO] Executing tasks

main:
[INFO] Executed tasks
[INFO] 
[INFO] --- maven-remote-resources-plugin:1.3:process (process-remote-resources) @ deltaspike-security-requested-page-after-login-cdi ---
[INFO] 
[INFO] --- maven-remote-resources-plugin:1.3:process (default) @ deltaspike-security-requested-page-after-login-cdi ---
[INFO] 
[INFO] --- maven-resources-plugin:2.6:resources (default-resources) @ deltaspike-security-requested-page-after-login-cdi ---
[INFO] Using 'UTF-8' encoding to copy filtered resources.
[INFO] skip non existing resourceDirectory <http://jenkins.mw.lab.eng.bos.redhat.com/hudson/job/Weld-2.x-interoperability-deltaspike-WF8/ws/deltaspike/examples/security-requested-page-after-login-cdi/src/main/resources>
[INFO] Copying 4 resources
[INFO] Copying 4 resources
[INFO] 
[INFO] --- maven-compiler-plugin:2.5:compile (default-compile) @ deltaspike-security-requested-page-after-login-cdi ---
[INFO] Compiling 5 source files to <http://jenkins.mw.lab.eng.bos.redhat.com/hudson/job/Weld-2.x-interoperability-deltaspike-WF8/ws/deltaspike/examples/security-requested-page-after-login-cdi/target/classes>
[INFO] 
[INFO] --- maven-resources-plugin:2.6:testResources (default-testResources) @ deltaspike-security-requested-page-after-login-cdi ---
[INFO] Using 'UTF-8' encoding to copy filtered resources.
[INFO] skip non existing resourceDirectory <http://jenkins.mw.lab.eng.bos.redhat.com/hudson/job/Weld-2.x-interoperability-deltaspike-WF8/ws/deltaspike/examples/security-requested-page-after-login-cdi/src/test/resources>
[INFO] Copying 4 resources
[INFO] Copying 4 resources
[INFO] 
[INFO] --- maven-compiler-plugin:2.5:testCompile (default-testCompile) @ deltaspike-security-requested-page-after-login-cdi ---
[INFO] No sources to compile
[INFO] 
[INFO] --- maven-surefire-plugin:2.11:test (default-test) @ deltaspike-security-requested-page-after-login-cdi ---
[INFO] Surefire report directory: <http://jenkins.mw.lab.eng.bos.redhat.com/hudson/job/Weld-2.x-interoperability-deltaspike-WF8/ws/deltaspike/examples/security-requested-page-after-login-cdi/target/surefire-reports>
[INFO] Using configured provider org.apache.maven.surefire.junitcore.JUnitCoreProvider

-------------------------------------------------------
 T E S T S
-------------------------------------------------------
Concurrency config is parallel='none', perCoreThreadCount=true, threadCount=2, useUnlimitedThreads=false

Results :

Tests run: 0, Failures: 0, Errors: 0, Skipped: 0

[INFO] 
[INFO] --- maven-war-plugin:2.2:war (default-war) @ deltaspike-security-requested-page-after-login-cdi ---
[INFO] Packaging webapp
[INFO] Assembling webapp [deltaspike-security-requested-page-after-login-cdi] in [<http://jenkins.mw.lab.eng.bos.redhat.com/hudson/job/Weld-2.x-interoperability-deltaspike-WF8/ws/deltaspike/examples/security-requested-page-after-login-cdi/target/deltaspike-security-requested-page-after-login-cdi]>
[INFO] Processing war project
[INFO] Copying webapp resources [<http://jenkins.mw.lab.eng.bos.redhat.com/hudson/job/Weld-2.x-interoperability-deltaspike-WF8/ws/deltaspike/examples/security-requested-page-after-login-cdi/src/main/webapp]>
[INFO] Webapp assembled in [30 msecs]
[INFO] Building war: <http://jenkins.mw.lab.eng.bos.redhat.com/hudson/job/Weld-2.x-interoperability-deltaspike-WF8/ws/deltaspike/examples/security-requested-page-after-login-cdi/target/deltaspike-security-requested-page-after-login-cdi.war>
[INFO] WEB-INF/web.xml already added, skipping
[INFO] 
[INFO] --- maven-site-plugin:3.3:attach-descriptor (attach-descriptor) @ deltaspike-security-requested-page-after-login-cdi ---
[INFO] 
[INFO] >>> maven-source-plugin:2.2.1:jar (attach-sources) @ deltaspike-security-requested-page-after-login-cdi >>>
[INFO] 
[INFO] --- maven-bundle-plugin:2.3.7:cleanVersions (versions) @ deltaspike-security-requested-page-after-login-cdi ---
[INFO] 
[INFO] --- maven-antrun-plugin:1.7:run (javadoc.resources) @ deltaspike-security-requested-page-after-login-cdi ---
[WARNING] Parameter tasks is deprecated, use target instead
[INFO] Executing tasks

main:
[INFO] Executed tasks
[INFO] 
[INFO] <<< maven-source-plugin:2.2.1:jar (attach-sources) @ deltaspike-security-requested-page-after-login-cdi <<<
[INFO] 
[INFO] --- maven-source-plugin:2.2.1:jar (attach-sources) @ deltaspike-security-requested-page-after-login-cdi ---
[INFO] Building jar: <http://jenkins.mw.lab.eng.bos.redhat.com/hudson/job/Weld-2.x-interoperability-deltaspike-WF8/ws/deltaspike/examples/security-requested-page-after-login-cdi/target/deltaspike-security-requested-page-after-login-cdi-sources.jar>
[INFO] 
[INFO] --- maven-checkstyle-plugin:2.9.1:check (verify-style) @ deltaspike-security-requested-page-after-login-cdi ---
[INFO] Starting audit...
<http://jenkins.mw.lab.eng.bos.redhat.com/hudson/job/Weld-2.x-interoperability-deltaspike-WF8/ws/deltaspike/examples/security-requested-page-after-login-cdi/src/main/java/org/apache/deltaspike/example/security/requestedpage/cdi/LoggedInAccessDecisionVoter.java>:39:5: Variable access definition in wrong order.
<http://jenkins.mw.lab.eng.bos.redhat.com/hudson/job/Weld-2.x-interoperability-deltaspike-WF8/ws/deltaspike/examples/security-requested-page-after-login-cdi/src/main/java/org/apache/deltaspike/example/security/requestedpage/cdi/LoggedInAccessDecisionVoter.java>:40:21: warning: Variable 'loginController' must be private and have accessor methods.
<http://jenkins.mw.lab.eng.bos.redhat.com/hudson/job/Weld-2.x-interoperability-deltaspike-WF8/ws/deltaspike/examples/security-requested-page-after-login-cdi/src/main/java/org/apache/deltaspike/example/security/requestedpage/cdi/AuthenticationListener.java>:26:37: '{' should be on a new line.
<http://jenkins.mw.lab.eng.bos.redhat.com/hudson/job/Weld-2.x-interoperability-deltaspike-WF8/ws/deltaspike/examples/security-requested-page-after-login-cdi/src/main/java/org/apache/deltaspike/example/security/requestedpage/cdi/AuthenticationListener.java>:34:68: '{' should be on a new line.
Audit done.

[INFO] There are 3 checkstyle errors.
[INFO] ------------------------------------------------------------------------
[INFO] Reactor Summary:
[INFO] 
[INFO] Apache DeltaSpike Sources ......................... SUCCESS [  0.886 s]
[INFO] Apache DeltaSpike CheckStyle-rules ................ SUCCESS [  0.664 s]
[INFO] Apache DeltaSpike Parent .......................... SUCCESS [  2.212 s]
[INFO] Apache DeltaSpike Test-Utils ...................... SUCCESS [  2.618 s]
[INFO] Apache DeltaSpike Code Parent ..................... SUCCESS [  1.579 s]
[INFO] Apache DeltaSpike Core ............................ SUCCESS [  0.420 s]
[INFO] Apache DeltaSpike Core-API ........................ SUCCESS [  4.599 s]
[INFO] Apache DeltaSpike Core-Implementation ............. SUCCESS [ 54.805 s]
[INFO] Apache DeltaSpike ContainerControl parent ......... SUCCESS [  0.420 s]
[INFO] Apache DeltaSpike CDI ContainerControl API ........ SUCCESS [  0.835 s]
[INFO] Apache DeltaSpike CDI ContainerControl TCK ........ SUCCESS [  0.987 s]
[INFO] Apache DeltaSpike CDI OWB-ContainerControl ........ SUCCESS [  1.998 s]
[INFO] Apache DeltaSpike CDI Weld-ContainerControl ....... SUCCESS [  3.031 s]
[INFO] Apache DeltaSpike CDI OpenEJB-ContainerControl .... SUCCESS [  3.969 s]
[INFO] Apache DeltaSpike CDI Servlet-ContainerControl .... SUCCESS [  2.302 s]
[INFO] Apache DeltaSpike Modules ......................... SUCCESS [  0.392 s]
[INFO] Apache DeltaSpike Proxy-Module .................... SUCCESS [  0.388 s]
[INFO] Apache DeltaSpike Proxy-Module API ................ SUCCESS [  0.810 s]
[INFO] Apache DeltaSpike Proxy-Module Impl ASM5 .......... SUCCESS [  1.358 s]
[INFO] Apache DeltaSpike Security-Module ................. SUCCESS [  0.389 s]
[INFO] Apache DeltaSpike Security-Module API ............. SUCCESS [  0.987 s]
[INFO] Apache DeltaSpike Security-Module Impl ............ SUCCESS [ 19.932 s]
[INFO] Apache DeltaSpike JPA-Module ...................... SUCCESS [  0.407 s]
[INFO] Apache DeltaSpike JPA-Module API .................. SUCCESS [  0.952 s]
[INFO] Apache DeltaSpike JPA-Module Impl ................. SUCCESS [  1.937 s]
[INFO] Apache DeltaSpike Servlet-Module .................. SUCCESS [  0.390 s]
[INFO] Apache DeltaSpike Servlet-Module API .............. SUCCESS [  0.744 s]
[INFO] Apache DeltaSpike Servlet-Module Impl ............. SUCCESS [ 22.728 s]
[INFO] Apache DeltaSpike JSF-Module ...................... SUCCESS [  0.450 s]
[INFO] Apache DeltaSpike JSF-Module API .................. SUCCESS [  1.267 s]
[INFO] Apache DeltaSpike JSF-Module Impl ................. SUCCESS [01:14 min]
[INFO] Apache DeltaSpike JSF-Module Impl (EE6 only) ...... SUCCESS [  2.115 s]
[INFO] Apache DeltaSpike Partial-Bean-Module ............. SUCCESS [  0.363 s]
[INFO] Apache DeltaSpike Partial-Bean-Module API ......... SUCCESS [  0.912 s]
[INFO] Apache DeltaSpike Partial-Bean-Module Impl ........ SUCCESS [ 24.135 s]
[INFO] Apache DeltaSpike BeanValidation-Module ........... SUCCESS [  0.464 s]
[INFO] Apache DeltaSpike BeanValidation-Module API ....... SUCCESS [  0.776 s]
[INFO] Apache DeltaSpike BeanValidation-Module Impl ...... SUCCESS [ 13.407 s]
[INFO] Apache DeltaSpike Data-Module ..................... SUCCESS [  0.463 s]
[INFO] Apache DeltaSpike Data-Module API ................. SUCCESS [  1.388 s]
[INFO] Apache DeltaSpike Data-Module Impl ................ SUCCESS [01:02 min]
[INFO] Apache DeltaSpike Scheduler-Module ................ SUCCESS [  0.425 s]
[INFO] Apache DeltaSpike Scheduler-Module API ............ SUCCESS [  0.989 s]
[INFO] Apache DeltaSpike Scheduler-Module Impl ........... SUCCESS [ 17.828 s]
[INFO] Apache DeltaSpike Test-Control-Module ............. SUCCESS [  0.455 s]
[INFO] Apache DeltaSpike Test-Control-Module API ......... SUCCESS [  1.128 s]
[INFO] Apache DeltaSpike Test-Control-Module Impl ........ SUCCESS [  1.744 s]
[INFO] Apache DeltaSpike Examples ........................ SUCCESS [  0.424 s]
[INFO] Apache DeltaSpike Java-SE Examples ................ SUCCESS [  0.831 s]
[INFO] Apache DeltaSpike JSF Examples .................... SUCCESS [  1.314 s]
[INFO] Apache DeltaSpike JSF Playground .................. SUCCESS [  1.115 s]
[INFO] DeltaSpike Example: Show requested page after login with CDI  FAILURE [  0.930 s]
[INFO] DeltaSpike Example: Show requested page after login with PicketLink  SKIPPED
[INFO] Apache DeltaSpike Java-SE Scheduler Examples ...... SKIPPED
[INFO] ------------------------------------------------------------------------
[INFO] BUILD FAILURE
[INFO] ------------------------------------------------------------------------
[INFO] Total time: 05:44 min
[INFO] Finished at: 2015-05-14T03:46:14+08:00
[INFO] Final Memory: 140M/793M
[INFO] ------------------------------------------------------------------------
[ERROR] Failed to execute goal org.apache.maven.plugins:maven-checkstyle-plugin:2.9.1:check (verify-style) on project deltaspike-security-requested-page-after-login-cdi: You have 3 Checkstyle violations. -> [Help 1]
[ERROR] 
[ERROR] To see the full stack trace of the errors, re-run Maven with the -e switch.
[ERROR] Re-run Maven using the -X switch to enable full debug logging.
[ERROR] 
[ERROR] For more information about the errors and possible solutions, please read the following articles:
[ERROR] [Help 1] http://cwiki.apache.org/confluence/display/MAVEN/MojoFailureException
[ERROR] 
[ERROR] After correcting the problems, you can resume the build with the command
[ERROR]   mvn <goals> -rf :deltaspike-security-requested-page-after-login-cdi
Build step 'Execute shell' marked build as failure
Recording test results


More information about the weld-builds mailing list