[weld-builds] Build failed in Jenkins: Weld-2.x-int-servlet-windows #280

ci-builds at redhat.com ci-builds at redhat.com
Sat Oct 24 06:14:43 EDT 2015


See <http://jenkins.mw.lab.eng.bos.redhat.com/hudson/job/Weld-2.x-int-servlet-windows/280/changes>

Changes:

[mkouba] WELD-1912 change test archives name with hash of test class FQCN.

[mkouba] WELD-1912 Add txt suffix to the mapping file

[mkouba] WELD-2051 Allow to skip the registration of a shutdown hook

[mkouba] Probe - document container lifecycle events monitoring

------------------------------------------
[...truncated 8973 lines...]
[INFO] META-INF\LICENSE.txt already added, skipping
[INFO] Building jar: W:\workspace\Weld-2.x-int-servlet-windows\tests\target\weld-core-test-2.3.1-SNAPSHOT-sources.jar
[INFO] META-INF already added, skipping
[INFO] META-INF\DEPENDENCIES.txt already added, skipping
[INFO] META-INF\LICENSE.txt already added, skipping
[INFO] 
[INFO] --- maven-install-plugin:2.3.1:install (default-install) @ weld-core-test ---
[INFO] Installing W:\workspace\Weld-2.x-int-servlet-windows\tests\target\weld-core-test-2.3.1-SNAPSHOT.jar to w:\qa\home\hudson\private_maven_repos\weld\org\jboss\weld\weld-core-test\2.3.1-SNAPSHOT\weld-core-test-2.3.1-SNAPSHOT.jar
[INFO] Installing W:\workspace\Weld-2.x-int-servlet-windows\tests\pom.xml to w:\qa\home\hudson\private_maven_repos\weld\org\jboss\weld\weld-core-test\2.3.1-SNAPSHOT\weld-core-test-2.3.1-SNAPSHOT.pom
[INFO] Installing W:\workspace\Weld-2.x-int-servlet-windows\tests\target\weld-core-test-2.3.1-SNAPSHOT-sources.jar to w:\qa\home\hudson\private_maven_repos\weld\org\jboss\weld\weld-core-test\2.3.1-SNAPSHOT\weld-core-test-2.3.1-SNAPSHOT-sources.jar
[INFO]                                                                         
[INFO] ------------------------------------------------------------------------
[INFO] Building Weld Integration Tests (JBoss AS) 2.3.1-SNAPSHOT
[INFO] ------------------------------------------------------------------------
Downloading: http://snapshots.jboss.org/maven2/org/apache/maven/plugins/maven-eclipse-plugin/maven-metadata.xml
Downloading: http://repo1.maven.org/maven2/org/apache/maven/plugins/maven-eclipse-plugin/maven-metadata.xml
Downloading: http://repository.jboss.org/maven2/org/apache/maven/plugins/maven-eclipse-plugin/maven-metadata.xml
Downloading: https://repository.jboss.org/nexus/content/groups/developer/org/apache/maven/plugins/maven-eclipse-plugin/maven-metadata.xml
741 B   
        
Downloaded: http://repo1.maven.org/maven2/org/apache/maven/plugins/maven-eclipse-plugin/maven-metadata.xml (741 B at 9.3 KB/sec)
787 B   
        
        
        
Downloaded: https://repository.jboss.org/nexus/content/groups/developer/org/apache/maven/plugins/maven-eclipse-plugin/maven-metadata.xml (787 B at 4.5 KB/sec)
Downloading: http://repository.jboss.org/maven2/org/codehaus/mojo/exec-maven-plugin/1.1.1/exec-maven-plugin-1.1.1.pom
        
Downloading: http://snapshots.jboss.org/maven2/org/codehaus/mojo/exec-maven-plugin/1.1.1/exec-maven-plugin-1.1.1.pom
        
Downloading: https://repository.jboss.org/nexus/content/groups/developer/org/codehaus/mojo/exec-maven-plugin/1.1.1/exec-maven-plugin-1.1.1.pom
4 KB    
5 KB   
       
Downloaded: https://repository.jboss.org/nexus/content/groups/developer/org/codehaus/mojo/exec-maven-plugin/1.1.1/exec-maven-plugin-1.1.1.pom (5 KB at 18.5 KB/sec)
Downloading: http://repository.jboss.org/maven2/org/codehaus/mojo/mojo-parent/20/mojo-parent-20.pom
26 B   
5 KB   
8 KB   
9 KB   
12 KB   
13 KB   
13 KB   
17 KB   
18 KB   
[WARNING] Checksum validation failed, expected 1524383329218ad41caf18b01a876e10d9afcaee but is 168a4d16896dfbd6e2b2bf676344dd33905fa59e for http://repository.jboss.org/maven2/org/codehaus/mojo/mojo-parent/20/mojo-parent-20.pom
26 B    
5 KB   
8 KB   
9 KB   
13 KB   
13 KB   
13 KB   
15 KB   
16 KB   
16 KB   
18 KB   
[WARNING] Checksum validation failed, expected 1524383329218ad41caf18b01a876e10d9afcaee but is 168a4d16896dfbd6e2b2bf676344dd33905fa59e for http://repository.jboss.org/maven2/org/codehaus/mojo/mojo-parent/20/mojo-parent-20.pom
        
Downloaded: http://repository.jboss.org/maven2/org/codehaus/mojo/mojo-parent/20/mojo-parent-20.pom (18 KB at 31.1 KB/sec)
Downloading: http://repository.jboss.org/maven2/org/codehaus/mojo/exec-maven-plugin/1.1.1/exec-maven-plugin-1.1.1.jar
        
Downloading: http://snapshots.jboss.org/maven2/org/codehaus/mojo/exec-maven-plugin/1.1.1/exec-maven-plugin-1.1.1.jar
        
Downloading: https://repository.jboss.org/nexus/content/groups/developer/org/codehaus/mojo/exec-maven-plugin/1.1.1/exec-maven-plugin-1.1.1.jar
4 KB    
7 KB   
8 KB   
9 KB   
13 KB   
17 KB   
19 KB   
20 KB   
24 KB   
27 KB   
28 KB   
29 KB   
33 KB   
34 KB   
        
Downloaded: https://repository.jboss.org/nexus/content/groups/developer/org/codehaus/mojo/exec-maven-plugin/1.1.1/exec-maven-plugin-1.1.1.jar (34 KB at 122.6 KB/sec)
[INFO] 
[INFO] --- maven-clean-plugin:2.4.1:clean (default-clean) @ weld-core-test-arquillian ---
[INFO] Deleting W:\workspace\Weld-2.x-int-servlet-windows\tests-arquillian\target
[INFO] 
[INFO] --- maven-enforcer-plugin:1.0-beta-1:enforce (enforce) @ weld-core-test-arquillian ---
[WARNING] This rule is not compatible with the current version of Maven. The rule is not able to perform any checks.
[INFO] 
[INFO] --- build-helper-maven-plugin:1.5:maven-version (default) @ weld-core-test-arquillian ---
[INFO] 
[INFO] --- build-helper-maven-plugin:1.5:parse-version (default) @ weld-core-test-arquillian ---
[INFO] 
[INFO] --- buildnumber-maven-plugin:1.2:create (set-build-properties) @ weld-core-test-arquillian ---
[INFO] 
[INFO] --- maven-remote-resources-plugin:1.1:process (attach-license) @ weld-core-test-arquillian ---
[INFO] 
[INFO] --- maven-resources-plugin:2.4.3:resources (default-resources) @ weld-core-test-arquillian ---
[INFO] Using 'UTF-8' encoding to copy filtered resources.
[INFO] skip non existing resourceDirectory W:\workspace\Weld-2.x-int-servlet-windows\tests-arquillian\src\main\resources
[INFO] Copying 2 resources
[INFO] 
[INFO] --- maven-compiler-plugin:2.5.1:compile (default-compile) @ weld-core-test-arquillian ---
[INFO] No sources to compile
[INFO] 
[INFO] --- maven-checkstyle-plugin:2.13:checkstyle (check-style) @ weld-core-test-arquillian ---
[INFO] Starting audit...
Audit done.

[INFO] 
[INFO] --- maven-resources-plugin:2.4.3:testResources (default-testResources) @ weld-core-test-arquillian ---
[INFO] Using 'UTF-8' encoding to copy filtered resources.
[INFO] Copying 90 resources
[INFO] Copying 2 resources
[INFO] 
[INFO] --- maven-compiler-plugin:2.5.1:testCompile (default-testCompile) @ weld-core-test-arquillian ---
[INFO] Compiling 2707 source files to W:\workspace\Weld-2.x-int-servlet-windows\tests-arquillian\target\test-classes
[INFO] 
[INFO] --- maven-surefire-plugin:2.17:test (default-test) @ weld-core-test-arquillian ---
[INFO] Tests are skipped.
[INFO] 
[INFO] --- maven-jar-plugin:2.3.1:jar (default-jar) @ weld-core-test-arquillian ---
[INFO] Building jar: W:\workspace\Weld-2.x-int-servlet-windows\tests-arquillian\target\weld-core-test-arquillian-2.3.1-SNAPSHOT.jar
[INFO] 
[INFO] >>> maven-source-plugin:2.1.2:jar (attach-sources) @ weld-core-test-arquillian >>>
[INFO] 
[INFO] --- maven-enforcer-plugin:1.0-beta-1:enforce (enforce) @ weld-core-test-arquillian ---
[WARNING] This rule is not compatible with the current version of Maven. The rule is not able to perform any checks.
[INFO] 
[INFO] --- build-helper-maven-plugin:1.5:maven-version (default) @ weld-core-test-arquillian ---
[INFO] 
[INFO] --- build-helper-maven-plugin:1.5:parse-version (default) @ weld-core-test-arquillian ---
[INFO] 
[INFO] --- buildnumber-maven-plugin:1.2:create (set-build-properties) @ weld-core-test-arquillian ---
[INFO] 
[INFO] <<< maven-source-plugin:2.1.2:jar (attach-sources) @ weld-core-test-arquillian <<<
[INFO] 
[INFO] --- maven-source-plugin:2.1.2:jar (attach-sources) @ weld-core-test-arquillian ---
[INFO] META-INF already added, skipping
[INFO] META-INF\DEPENDENCIES.txt already added, skipping
[INFO] META-INF\LICENSE.txt already added, skipping
[INFO] Building jar: W:\workspace\Weld-2.x-int-servlet-windows\tests-arquillian\target\weld-core-test-arquillian-2.3.1-SNAPSHOT-sources.jar
[INFO] META-INF already added, skipping
[INFO] META-INF\DEPENDENCIES.txt already added, skipping
[INFO] META-INF\LICENSE.txt already added, skipping
[INFO] 
[INFO] --- maven-install-plugin:2.3.1:install (default-install) @ weld-core-test-arquillian ---
[INFO] Installing W:\workspace\Weld-2.x-int-servlet-windows\tests-arquillian\target\weld-core-test-arquillian-2.3.1-SNAPSHOT.jar to w:\qa\home\hudson\private_maven_repos\weld\org\jboss\weld\weld-core-test-arquillian\2.3.1-SNAPSHOT\weld-core-test-arquillian-2.3.1-SNAPSHOT.jar
[INFO] Installing W:\workspace\Weld-2.x-int-servlet-windows\tests-arquillian\pom.xml to w:\qa\home\hudson\private_maven_repos\weld\org\jboss\weld\weld-core-test-arquillian\2.3.1-SNAPSHOT\weld-core-test-arquillian-2.3.1-SNAPSHOT.pom
[INFO] Installing W:\workspace\Weld-2.x-int-servlet-windows\tests-arquillian\target\weld-core-test-arquillian-2.3.1-SNAPSHOT-sources.jar to w:\qa\home\hudson\private_maven_repos\weld\org\jboss\weld\weld-core-test-arquillian\2.3.1-SNAPSHOT\weld-core-test-arquillian-2.3.1-SNAPSHOT-sources.jar
[INFO] 
[INFO] >>> exec-maven-plugin:1.1.1:java (default) @ weld-core-test-arquillian >>>
[INFO] 
[INFO] --- maven-enforcer-plugin:1.0-beta-1:enforce (enforce) @ weld-core-test-arquillian ---
[WARNING] This rule is not compatible with the current version of Maven. The rule is not able to perform any checks.
[INFO] 
[INFO] --- build-helper-maven-plugin:1.5:maven-version (default) @ weld-core-test-arquillian ---
[INFO] 
[INFO] --- build-helper-maven-plugin:1.5:parse-version (default) @ weld-core-test-arquillian ---
[INFO] 
[INFO] <<< exec-maven-plugin:1.1.1:java (default) @ weld-core-test-arquillian <<<
[INFO] 
[INFO] --- exec-maven-plugin:1.1.1:java (default) @ weld-core-test-arquillian ---
[INFO] ------------------------------------------------------------------------
[INFO] Reactor Summary:
[INFO] 
[INFO] Weld Parent ....................................... SUCCESS [9.745s]
[INFO] Weld Implementation (Core) ........................ SUCCESS [27.932s]
[INFO] Weld Core - JSF ................................... SUCCESS [1.722s]
[INFO] Weld Implementation ............................... SUCCESS [2.234s]
[INFO] Weld Probe Parent ................................. SUCCESS [0.646s]
[INFO] Weld Probe Core ................................... SUCCESS [13.445s]
[INFO] Weld Test Utilities ............................... SUCCESS [2.328s]
[INFO] weld-probe-tests .................................. SUCCESS [1:30.782s]
[INFO] Weld Porting Package for the CDI TCK 1.1 .......... SUCCESS [1.298s]
[INFO] Weld Unit Tests ................................... SUCCESS [3.953s]
[INFO] Weld Integration Tests (JBoss AS) ................. FAILURE [40.243s]
[INFO] AtInject TCK runner for Weld ...................... SKIPPED
[INFO] CDI TCK runner (1.1, 1.2) for Weld (WildFly) ...... SKIPPED
[INFO] Weld Environment Common ........................... SKIPPED
[INFO] Weld SE (Core) .................................... SKIPPED
[INFO] Weld SE (Uber Jar) ................................ SKIPPED
[INFO] Weld SE Parent .................................... SKIPPED
[INFO] Weld SE Tests ..................................... SKIPPED
[INFO] Weld Servlet Parent ............................... SKIPPED
[INFO] Weld Servlet Core ................................. SKIPPED
[INFO] Weld Servlet (Uber Jar) ........................... SKIPPED
[INFO] Weld Servlet Integration Tests (Base) ............. SKIPPED
[INFO] Weld Servlet Integration Tests (Tomcat) ........... SKIPPED
[INFO] Weld Servlet Integration Tests (Jetty) ............ SKIPPED
[INFO] ------------------------------------------------------------------------
[INFO] BUILD FAILURE
[INFO] ------------------------------------------------------------------------
[INFO] Total time: 3:16.570s
[INFO] Finished at: Sat Oct 24 06:17:23 EDT 2015
[INFO] Final Memory: 85M/859M
[INFO] ------------------------------------------------------------------------
[ERROR] Failed to execute goal org.codehaus.mojo:exec-maven-plugin:1.1.1:java (default) on project weld-core-test-arquillian: An exception occured while executing the Java class. null: InvocationTargetException: Unexpected internal error near index 1
[ERROR] \
[ERROR] ^
[ERROR] -> [Help 1]
[ERROR] 
[ERROR] To see the full stack trace of the errors, re-run Maven with the -e switch.
[ERROR] Re-run Maven using the -X switch to enable full debug logging.
[ERROR] 
[ERROR] For more information about the errors and possible solutions, please read the following articles:
[ERROR] [Help 1] http://cwiki.apache.org/confluence/display/MAVEN/MojoExecutionException
[ERROR] 
[ERROR] After correcting the problems, you can resume the build with the command
[ERROR]   mvn <goals> -rf :weld-core-test-arquillian
Build step 'Invoke top-level Maven targets' marked build as failure
Recording test results
ERROR: Publisher hudson.tasks.junit.JUnitResultArchiver aborted due to exception
hudson.AbortException: Test reports were found but none of them are new. Did tests run? 
For example, <http://jenkins.mw.lab.eng.bos.redhat.com/hudson/job/Weld-2.x-int-servlet-windows/ws/environments\servlet\core\target\surefire-reports\TEST-org.jboss.weld.environment.servlet.deployment.ServletContextBeanArchiveHandlerTest.xml> is 21 days old

	at hudson.tasks.junit.TestResult.parse(TestResult.java:178)
	at hudson.tasks.junit.TestResult.parse(TestResult.java:146)
	at hudson.tasks.junit.TestResult.<init>(TestResult.java:122)
	at hudson.tasks.junit.JUnitParser$ParseResultCallable.invoke(JUnitParser.java:119)
	at hudson.tasks.junit.JUnitParser$ParseResultCallable.invoke(JUnitParser.java:93)
	at hudson.FilePath$FileCallableWrapper.call(FilePath.java:2589)
	at hudson.remoting.UserRequest.perform(UserRequest.java:121)
	at hudson.remoting.UserRequest.perform(UserRequest.java:49)
	at hudson.remoting.Request$2.run(Request.java:324)
	at hudson.remoting.InterceptingExecutorService$1.call(InterceptingExecutorService.java:68)
	at java.util.concurrent.FutureTask.run(FutureTask.java:262)
	at java.util.concurrent.ThreadPoolExecutor.runWorker(ThreadPoolExecutor.java:1145)
	at java.util.concurrent.ThreadPoolExecutor$Worker.run(ThreadPoolExecutor.java:615)
	at hudson.remoting.Engine$1$1.run(Engine.java:63)
	at java.lang.Thread.run(Thread.java:744)
	at ......remote call to brms06(Native Method)
	at hudson.remoting.Channel.attachCallSiteStackTrace(Channel.java:1356)
	at hudson.remoting.UserResponse.retrieve(UserRequest.java:221)
	at hudson.remoting.Channel.call(Channel.java:752)
	at hudson.FilePath.act(FilePath.java:969)
	at hudson.FilePath.act(FilePath.java:958)
	at hudson.tasks.junit.JUnitParser.parseResult(JUnitParser.java:90)
	at hudson.tasks.junit.JUnitResultArchiver.parse(JUnitResultArchiver.java:120)
	at hudson.tasks.junit.JUnitResultArchiver.perform(JUnitResultArchiver.java:137)
	at hudson.tasks.BuildStepCompatibilityLayer.perform(BuildStepCompatibilityLayer.java:74)
	at hudson.tasks.BuildStepMonitor$1.perform(BuildStepMonitor.java:20)
	at hudson.model.AbstractBuild$AbstractBuildExecution.perform(AbstractBuild.java:770)
	at hudson.model.AbstractBuild$AbstractBuildExecution.performAllBuildSteps(AbstractBuild.java:734)
	at hudson.model.Build$BuildExecution.post2(Build.java:183)
	at hudson.model.AbstractBuild$AbstractBuildExecution.post(AbstractBuild.java:683)
	at hudson.model.Run.execute(Run.java:1770)
	at hudson.model.FreeStyleBuild.run(FreeStyleBuild.java:43)
	at hudson.model.ResourceController.execute(ResourceController.java:89)
	at hudson.model.Executor.run(Executor.java:240)


More information about the weld-builds mailing list