[JBoss Builds] Build failed in Hudson: jboss-esb-windows #535
by jboss-qa-internal@redhat.com
See http://dev45.qa.atl.jboss.com:8585/hudson/job/jboss-esb-windows/535/changes
Changes:
[tcunning] bug:JBESB-925
Remove readme.txt - there's a top level readme.
------------------------------------------
[...truncated 4316 lines...]
[java] [junit] Running org.jboss.soa.esb.actions.scripting.GroovyActionProcessorUnitTest
[java] [junit] Tests run: 2, Failures: 0, Errors: 0, Time elapsed: 1.156 sec
[java] [junit] Testsuite: org.jboss.soa.esb.actions.scripting.GroovyActionProcessorUnitTest
[java] [junit] Tests run: 2, Failures: 0, Errors: 0, Time elapsed: 1.156 sec
[java] [junit] ------------- Standard Output ---------------
[java] [junit] EMMA: collecting runtime coverage data ...
[java] [junit] ------------- ---------------- ---------------
[java] [junit] Testcase: test_script_file took 0.89 sec
[java] [junit] Testcase: test_script_inlined took 0.094 sec
[java] [junit] Running org.jboss.soa.esb.actions.templates.MockActionUnitTest
[java] [junit] Tests run: 2, Failures: 0, Errors: 0, Time elapsed: 0.453 sec
[java] [junit] Testsuite: org.jboss.soa.esb.actions.templates.MockActionUnitTest
[java] [junit] Tests run: 2, Failures: 0, Errors: 0, Time elapsed: 0.453 sec
[java] [junit] ------------- Standard Output ---------------
[java] [junit] EMMA: collecting runtime coverage data ...
[java] [junit] ------------- ---------------- ---------------
[java] [junit] Testcase: testMockAction took 0.296 sec
[java] [junit] Testcase: testMockComposer took 0 sec
[java] [junit] Running org.jboss.soa.esb.actions.templating.StringTemplateProcessorUnitTest
[java] [junit] Tests run: 1, Failures: 0, Errors: 0, Time elapsed: 0.672 sec
[java] [junit] Testsuite: org.jboss.soa.esb.actions.templating.StringTemplateProcessorUnitTest
[java] [junit] Tests run: 1, Failures: 0, Errors: 0, Time elapsed: 0.672 sec
[java] [junit] ------------- Standard Output ---------------
[java] [junit] EMMA: collecting runtime coverage data ...
[java] [junit] ------------- ---------------- ---------------
[java] [junit] Testcase: testProcessor took 0.484 sec
[java] [junit] Running org.jboss.soa.esb.addressing.eprs.tests.DefaultFileReplyToEprUnitTest
[java] [junit] Tests run: 1, Failures: 0, Errors: 0, Time elapsed: 0.453 sec
[java] [junit] Testsuite: org.jboss.soa.esb.addressing.eprs.tests.DefaultFileReplyToEprUnitTest
[java] [junit] Tests run: 1, Failures: 0, Errors: 0, Time elapsed: 0.453 sec
[java] [junit] ------------- Standard Output ---------------
[java] [junit] EMMA: collecting runtime coverage data ...
[java] [junit] ------------- ---------------- ---------------
[java] [junit] Testcase: unknown took 0.437 sec
[java] [junit] Running org.jboss.soa.esb.addressing.eprs.tests.DefaultFtpReplyToEprIntegrationTest
[java] [junit] Tests run: 1, Failures: 0, Errors: 0, Time elapsed: 1.797 sec
[java] [junit] Testsuite: org.jboss.soa.esb.addressing.eprs.tests.DefaultFtpReplyToEprIntegrationTest
[java] [junit] Tests run: 1, Failures: 0, Errors: 0, Time elapsed: 1.797 sec
[java] [junit] ------------- Standard Output ---------------
[java] [junit] EMMA: collecting runtime coverage data ...
[java] [junit] ------------- ---------------- ---------------
[java] [junit] Testcase: unknown took 1.766 sec
[java] [junit] Running org.jboss.soa.esb.addressing.eprs.tests.DefaultJdbcReplyToEprUnitTest
[java] [junit] Tests run: 1, Failures: 0, Errors: 0, Time elapsed: 0.781 sec
[java] [junit] Testsuite: org.jboss.soa.esb.addressing.eprs.tests.DefaultJdbcReplyToEprUnitTest
[java] [junit] Tests run: 1, Failures: 0, Errors: 0, Time elapsed: 0.781 sec
[java] [junit] ------------- Standard Output ---------------
[java] [junit] EMMA: collecting runtime coverage data ...
[java] [junit] ------------- ---------------- ---------------
[java] [junit] Testcase: unknown took 0.234 sec
[java] [junit] Running org.jboss.soa.esb.addressing.helpers.tests.EmailUnitTest
[java] [junit] Tests run: 2, Failures: 0, Errors: 0, Time elapsed: 0.328 sec
[java] [junit] Testsuite: org.jboss.soa.esb.addressing.helpers.tests.EmailUnitTest
[java] [junit] Tests run: 2, Failures: 0, Errors: 0, Time elapsed: 0.328 sec
[java] [junit] ------------- Standard Output ---------------
[java] [junit] EMMA: collecting runtime coverage data ...
[java] [junit] ------------- ---------------- ---------------
[java] [junit] Testcase: testConstructor took 0.078 sec
[java] [junit] Testcase: testSetGet took 0 sec
[java] [junit] Running org.jboss.soa.esb.addressing.helpers.tests.FTPUnitTest
[java] [junit] Tests run: 2, Failures: 0, Errors: 0, Time elapsed: 0.265 sec
[java] [junit] Testsuite: org.jboss.soa.esb.addressing.helpers.tests.FTPUnitTest
[java] [junit] Tests run: 2, Failures: 0, Errors: 0, Time elapsed: 0.265 sec
[java] [junit] ------------- Standard Output ---------------
[java] [junit] EMMA: collecting runtime coverage data ...
[java] [junit] ------------- ---------------- ---------------
[java] [junit] Testcase: testConstructor took 0.062 sec
[java] [junit] Testcase: testSetGet took 0 sec
[java] [junit] Running org.jboss.soa.esb.addressing.helpers.tests.HTTPUnitTest
[java] [junit] Tests run: 2, Failures: 0, Errors: 0, Time elapsed: 0.234 sec
[java] [junit] Testsuite: org.jboss.soa.esb.addressing.helpers.tests.HTTPUnitTest
[java] [junit] Tests run: 2, Failures: 0, Errors: 0, Time elapsed: 0.234 sec
[java] [junit] ------------- Standard Output ---------------
[java] [junit] EMMA: collecting runtime coverage data ...
[java] [junit] ------------- ---------------- ---------------
[java] [junit] Testcase: testConstructor took 0.063 sec
[java] [junit] Testcase: testSetGet took 0 sec
[java] [junit] Running org.jboss.soa.esb.addressing.helpers.tests.JDBCUnitTest
[java] [junit] Tests run: 2, Failures: 0, Errors: 0, Time elapsed: 0.281 sec
[java] [junit] Testsuite: org.jboss.soa.esb.addressing.helpers.tests.JDBCUnitTest
[java] [junit] Tests run: 2, Failures: 0, Errors: 0, Time elapsed: 0.281 sec
[java] [junit] ------------- Standard Output ---------------
[java] [junit] EMMA: collecting runtime coverage data ...
[java] [junit] ------------- ---------------- ---------------
[java] [junit] Testcase: testConstructor took 0.078 sec
[java] [junit] Testcase: testSetGet took 0 sec
[java] [junit] Running org.jboss.soa.esb.addressing.helpers.tests.JMSUnitTest
[java] [junit] Tests run: 2, Failures: 0, Errors: 0, Time elapsed: 0.25 sec
[java] [junit] Testsuite: org.jboss.soa.esb.addressing.helpers.tests.JMSUnitTest
[java] [junit] Tests run: 2, Failures: 0, Errors: 0, Time elapsed: 0.25 sec
[java] [junit] ------------- Standard Output ---------------
[java] [junit] EMMA: collecting runtime coverage data ...
[java] [junit] ------------- ---------------- ---------------
[java] [junit] Testcase: testConstructor took 0.078 sec
[java] [junit] Testcase: testSetGet took 0 sec
[java] [junit] Running org.jboss.soa.esb.addressing.tests.CallUnitTest
[java] [junit] Tests run: 9, Failures: 0, Errors: 0, Time elapsed: 0.265 sec
[java] [junit] Testsuite: org.jboss.soa.esb.addressing.tests.CallUnitTest
[java] [junit] Tests run: 9, Failures: 0, Errors: 0, Time elapsed: 0.265 sec
[java] [junit] ------------- Standard Output ---------------
[java] [junit] EMMA: collecting runtime coverage data ...
[java] [junit] ------------- ---------------- ---------------
[java] [junit] Testcase: testConstructor took 0.062 sec
[java] [junit] Testcase: testEPRConstructor took 0 sec
[java] [junit] Testcase: testSetGetTo took 0 sec
[java] [junit] Testcase: testSetGetFrom took 0 sec
[java] [junit] Testcase: testSetGetReplyTo took 0 sec
[java] [junit] Testcase: testSetGetFaultTo took 0 sec
[java] [junit] Testcase: testSetGetRelatesTo took 0 sec
[java] [junit] Testcase: testSetGetAction took 0 sec
[java] [junit] Testcase: testSetGetMessageID took 0 sec
[java] [junit] Running org.jboss.soa.esb.addressing.tests.EPRUnitTest
[java] [junit] Tests run: 7, Failures: 0, Errors: 0, Time elapsed: 0.078 sec
[java] [junit] Testsuite: org.jboss.soa.esb.addressing.tests.EPRUnitTest
[java] [junit] Tests run: 7, Failures: 0, Errors: 0, Time elapsed: 0.078 sec
[java] [junit] ------------- Standard Output ---------------
[java] [junit] EMMA: collecting runtime coverage data ...
[java] [junit] ------------- ---------------- ---------------
[java] [junit] Testcase: testConstructor took 0.047 sec
[java] [junit] Testcase: testPortReferenceConstructor took 0 sec
[java] [junit] Testcase: testURIConstructor took 0 sec
[java] [junit] Testcase: testGetAddr took 0 sec
[java] [junit] Testcase: testSetAddr took 0 sec
[java] [junit] Testcase: testToFromXML took 0.015 sec
[java] [junit] Testcase: testEquals took 0 sec
[java] [junit] Running org.jboss.soa.esb.addressing.util.tests.EPRHelperUnitTest
[java] [junit] Tests run: 1, Failures: 0, Errors: 0, Time elapsed: 0.094 sec
[java] [junit] Testsuite: org.jboss.soa.esb.addressing.util.tests.EPRHelperUnitTest
[java] [junit] Tests run: 1, Failures: 0, Errors: 0, Time elapsed: 0.094 sec
[java] [junit] ------------- Standard Output ---------------
[java] [junit] EMMA: collecting runtime coverage data ...
[java] [junit] ------------- ---------------- ---------------
[java] [junit] Testcase: testToFromXMLString took 0.078 sec
[java] [junit] Running org.jboss.soa.esb.addressing.util.tests.EPRManagerUnitTest
[java] [junit] Tests run: 3, Failures: 0, Errors: 0, Time elapsed: 0.094 sec
[java] [junit] Testsuite: org.jboss.soa.esb.addressing.util.tests.EPRManagerUnitTest
[java] [junit] Tests run: 3, Failures: 0, Errors: 0, Time elapsed: 0.094 sec
[java] [junit] ------------- Standard Output ---------------
[java] [junit] EMMA: collecting runtime coverage data ...
[java] [junit] ------------- ---------------- ---------------
[java] [junit] Testcase: testCreate took 0.063 sec
[java] [junit] Testcase: testInputOutput took 0.031 sec
[java] [junit] Testcase: testSpecificInputOutput took 0 sec
[java] [junit] Running org.jboss.soa.esb.command.InMemoryCommandQueueUnitTest
[java] [junit] Tests run: 3, Failures: 0, Errors: 0, Time elapsed: 0.734 sec
[java] [junit] Testsuite: org.jboss.soa.esb.command.InMemoryCommandQueueUnitTest
[java] [junit] Tests run: 3, Failures: 0, Errors: 0, Time elapsed: 0.734 sec
[java] [junit] ------------- Standard Output ---------------
[java] [junit] EMMA: collecting runtime coverage data ...
[java] [junit] ------------- ---------------- ---------------
[java] [junit] Testcase: test_args took 0.188 sec
[java] [junit] Testcase: test_queue_open_close took 0 sec
[java] [junit] Testcase: test_queue_receive took 0.359 sec
[java] [junit] Running org.jboss.soa.esb.common.tests.propertymanager.PropertyManagerUnitTest
[java] [junit] Tests run: 1, Failures: 0, Errors: 0, Time elapsed: 0.031 sec
[java] [junit] Testsuite: org.jboss.soa.esb.common.tests.propertymanager.PropertyManagerUnitTest
[java] [junit] Tests run: 1, Failures: 0, Errors: 0, Time elapsed: 0.031 sec
[java] [junit] ------------- Standard Output ---------------
[java] [junit] Properties loaded (jbossesb-test-properties.xml):
[java] [junit] org.jboss.soa.esb.jndi.server.context.factory=foobar
[java] [junit] org.jboss.soa.esb.objStore.configFile=file:config.xml
[java] [junit] Properties loaded (jbossesb-test-properties.xml):
[java] [junit] org.jboss.soa.esb.mail.smtp.host=thishost
[java] [junit] Properties loaded (jbossesb-test-properties.xml):
[java] [junit] org.jboss.soa.esb.jndi.server.context.factory=foobar
[java] [junit] org.jboss.soa.esb.objStore.configFile=file:config.xml
[java] [junit] Properties loaded (jbossesb-test-properties.xml):
[java] [junit] org.jboss.soa.esb.mail.smtp.host=thishost
[java] [junit] ------------- ---------------- ---------------
[java] [junit] Testcase: testPropertyManager took 0.031 sec
[java] [junit] Running org.jboss.soa.esb.helpers.AppServerContextUnitTest
[java] [junit] Tests run: 1, Failures: 0, Errors: 1, Time elapsed: 53.531 sec
[java] [junit] Testsuite: org.jboss.soa.esb.helpers.AppServerContextUnitTest
[java] [junit] Tests run: 1, Failures: 0, Errors: 1, Time elapsed: 53.531 sec
[java] [junit] ------------- Standard Output ---------------
[java] [junit] EMMA: collecting runtime coverage data ...
[java] [junit] ------------- ---------------- ---------------
[java] [junit] Testcase: test_AppServerContext took 53.5 sec
[java] [junit] Caused an ERROR
[java] [junit] java.lang.StackOverflowError
[java] [junit] java.lang.ClassCastException: java.lang.StackOverflowError
[java] [junit] at org.jboss.ha.framework.server.HARMIServerImpl.invoke(HARMIServerImpl.java:222)
[java] [junit] at sun.rmi.server.UnicastServerRef.dispatch(UnicastServerRef.java:294)
[java] [junit] at sun.rmi.transport.Transport$1.run(Transport.java:153)
[java] [junit] at java.security.AccessController.doPrivileged(Native Method)
[java] [junit] at sun.rmi.transport.Transport.serviceCall(Transport.java:149)
[java] [junit] at sun.rmi.transport.tcp.TCPTransport.handleMessages(TCPTransport.java:466)
[java] [junit] at sun.rmi.transport.tcp.TCPTransport$ConnectionHandler.run(TCPTransport.java:707)
[java] [junit] at java.lang.Thread.run(Thread.java:595)
[java] [junit] at sun.rmi.transport.StreamRemoteCall.exceptionReceivedFromServer(StreamRemoteCall.java:247)
[java] [junit] at sun.rmi.transport.StreamRemoteCall.executeCall(StreamRemoteCall.java:223)
[java] [junit] at sun.rmi.server.UnicastRef.invoke(UnicastRef.java:126)
[java] [junit] at org.jboss.ha.framework.server.HARMIServerImpl_Stub.invoke(Unknown Source)
[java] [junit] at org.jboss.ha.framework.interfaces.HARMIClient.invokeRemote(HARMIClient.java:172)
[java] [junit] at org.jboss.ha.framework.interfaces.HARMIClient.invoke(HARMIClient.java:267)
[java] [junit] at $Proxy0.list(Unknown Source)
[java] [junit] at org.jnp.interfaces.NamingContext.list(NamingContext.java:800)
[java] [junit] at org.jnp.interfaces.NamingContext.list(NamingContext.java:786)
[java] [junit] at javax.naming.InitialContext.list(InitialContext.java:395)
[java] [junit] at org.jboss.soa.esb.helpers.NamingContext.getServerContext(NamingContext.java:66)
[java] [junit] at org.jboss.soa.esb.helpers.AppServerContextUnitTest.test_AppServerContext(AppServerContextUnitTest.java:47)
[java] BUILD FAILED
[java] C:\cygwin\home\hudson\hudson_workspace\workspace\jboss-esb-windows\trunk\product\build.xml:161: The following error occurred while executing this line:
[java] C:\cygwin\home\hudson\hudson_workspace\workspace\jboss-esb-windows\trunk\product\rosetta\build.xml:86: The following error occurred while executing this line:
[java] C:\cygwin\home\hudson\hudson_workspace\workspace\jboss-esb-windows\trunk\product\rosetta\tests\build.xml:166: The following error occurred while executing this line:
[java] C:\cygwin\home\hudson\hudson_workspace\workspace\jboss-esb-windows\trunk\product\rosetta\tests\build.xml:190: Test org.jboss.soa.esb.helpers.AppServerContextUnitTest failed
[java] Total time: 2 minutes 33 seconds
[java] Java Result: 1
esb.init-app-server:
esb.init-esb-server:
esb.init-ftp-server:
esb.init:
stop-server:
[echo] Stopping local ESB server
[java] Shutdown message has been posted to the server.
[java] Server shutdown may take a while - check logfiles for completion
[echo] Waiting for ESB server to stop...
BUILD FAILED
C:\cygwin\home\hudson\hudson_workspace\workspace\jboss-esb-windows\trunk\integration-build.xml:5: The following error occurred while executing this line:
C:\cygwin\home\hudson\hudson_workspace\workspace\jboss-esb-windows\trunk\product\build.xml:463: Product Unit Test failure
Total time: 3 minutes 5 seconds
Recording test results
17 years, 6 months
[JBoss Builds] Build failed in Hudson: jboss-esb-linux #634
by jboss-qa-internal@redhat.com
See http://dev45.qa.atl.jboss.com:8585/hudson/job/jboss-esb-linux/634/changes
Changes:
[tcunning] bug:JBESB-925
Remove readme.txt - there's a top level readme.
------------------------------------------
[...truncated 4404 lines...]
[java] [junit] Tests run: 2, Failures: 0, Errors: 0, Time elapsed: 1.148 sec
[java] [junit] Testsuite: org.jboss.soa.esb.actions.scripting.GroovyActionProcessorUnitTest
[java] [junit] Tests run: 2, Failures: 0, Errors: 0, Time elapsed: 1.148 sec
[java] [junit] ------------- Standard Output ---------------
[java] [junit] EMMA: collecting runtime coverage data ...
[java] [junit] ------------- ---------------- ---------------
[java] [junit] Testcase: test_script_file took 0.891 sec
[java] [junit] Testcase: test_script_inlined took 0.095 sec
[java] [junit] Running org.jboss.soa.esb.actions.templates.MockActionUnitTest
[java] [junit] Tests run: 2, Failures: 0, Errors: 0, Time elapsed: 0.534 sec
[java] [junit] Testsuite: org.jboss.soa.esb.actions.templates.MockActionUnitTest
[java] [junit] Tests run: 2, Failures: 0, Errors: 0, Time elapsed: 0.534 sec
[java] [junit] ------------- Standard Output ---------------
[java] [junit] EMMA: collecting runtime coverage data ...
[java] [junit] ------------- ---------------- ---------------
[java] [junit] Testcase: testMockAction took 0.348 sec
[java] [junit] Testcase: testMockComposer took 0.009 sec
[java] [junit] Running org.jboss.soa.esb.actions.templating.StringTemplateProcessorUnitTest
[java] [junit] Tests run: 1, Failures: 0, Errors: 0, Time elapsed: 0.574 sec
[java] [junit] Testsuite: org.jboss.soa.esb.actions.templating.StringTemplateProcessorUnitTest
[java] [junit] Tests run: 1, Failures: 0, Errors: 0, Time elapsed: 0.574 sec
[java] [junit] ------------- Standard Output ---------------
[java] [junit] EMMA: collecting runtime coverage data ...
[java] [junit] ------------- ---------------- ---------------
[java] [junit] Testcase: testProcessor took 0.345 sec
[java] [junit] Running org.jboss.soa.esb.addressing.eprs.tests.DefaultFileReplyToEprUnitTest
[java] [junit] Tests run: 1, Failures: 0, Errors: 0, Time elapsed: 0.35 sec
[java] [junit] Testsuite: org.jboss.soa.esb.addressing.eprs.tests.DefaultFileReplyToEprUnitTest
[java] [junit] Tests run: 1, Failures: 0, Errors: 0, Time elapsed: 0.35 sec
[java] [junit] ------------- Standard Output ---------------
[java] [junit] EMMA: collecting runtime coverage data ...
[java] [junit] ------------- ---------------- ---------------
[java] [junit] Testcase: unknown took 0.333 sec
[java] [junit] Running org.jboss.soa.esb.addressing.eprs.tests.DefaultFtpReplyToEprIntegrationTest
[java] [junit] Tests run: 1, Failures: 0, Errors: 0, Time elapsed: 1.65 sec
[java] [junit] Testsuite: org.jboss.soa.esb.addressing.eprs.tests.DefaultFtpReplyToEprIntegrationTest
[java] [junit] Tests run: 1, Failures: 0, Errors: 0, Time elapsed: 1.65 sec
[java] [junit] ------------- Standard Output ---------------
[java] [junit] EMMA: collecting runtime coverage data ...
[java] [junit] ------------- ---------------- ---------------
[java] [junit] Testcase: unknown took 1.634 sec
[java] [junit] Running org.jboss.soa.esb.addressing.eprs.tests.DefaultJdbcReplyToEprUnitTest
[java] [junit] Tests run: 1, Failures: 0, Errors: 0, Time elapsed: 0.753 sec
[java] [junit] Testsuite: org.jboss.soa.esb.addressing.eprs.tests.DefaultJdbcReplyToEprUnitTest
[java] [junit] Tests run: 1, Failures: 0, Errors: 0, Time elapsed: 0.753 sec
[java] [junit] ------------- Standard Output ---------------
[java] [junit] EMMA: collecting runtime coverage data ...
[java] [junit] ------------- ---------------- ---------------
[java] [junit] Testcase: unknown took 0.198 sec
[java] [junit] Running org.jboss.soa.esb.addressing.helpers.tests.EmailUnitTest
[java] [junit] Tests run: 2, Failures: 0, Errors: 0, Time elapsed: 0.368 sec
[java] [junit] Testsuite: org.jboss.soa.esb.addressing.helpers.tests.EmailUnitTest
[java] [junit] Tests run: 2, Failures: 0, Errors: 0, Time elapsed: 0.368 sec
[java] [junit] ------------- Standard Output ---------------
[java] [junit] EMMA: collecting runtime coverage data ...
[java] [junit] ------------- ---------------- ---------------
[java] [junit] Testcase: testConstructor took 0.076 sec
[java] [junit] Testcase: testSetGet took 0.001 sec
[java] [junit] Running org.jboss.soa.esb.addressing.helpers.tests.FTPUnitTest
[java] [junit] Tests run: 2, Failures: 0, Errors: 0, Time elapsed: 0.363 sec
[java] [junit] Testsuite: org.jboss.soa.esb.addressing.helpers.tests.FTPUnitTest
[java] [junit] Tests run: 2, Failures: 0, Errors: 0, Time elapsed: 0.363 sec
[java] [junit] ------------- Standard Output ---------------
[java] [junit] EMMA: collecting runtime coverage data ...
[java] [junit] ------------- ---------------- ---------------
[java] [junit] Testcase: testConstructor took 0.077 sec
[java] [junit] Testcase: testSetGet took 0.002 sec
[java] [junit] Running org.jboss.soa.esb.addressing.helpers.tests.HTTPUnitTest
[java] [junit] Tests run: 2, Failures: 0, Errors: 0, Time elapsed: 0.348 sec
[java] [junit] Testsuite: org.jboss.soa.esb.addressing.helpers.tests.HTTPUnitTest
[java] [junit] Tests run: 2, Failures: 0, Errors: 0, Time elapsed: 0.348 sec
[java] [junit] ------------- Standard Output ---------------
[java] [junit] EMMA: collecting runtime coverage data ...
[java] [junit] ------------- ---------------- ---------------
[java] [junit] Testcase: testConstructor took 0.077 sec
[java] [junit] Testcase: testSetGet took 0.001 sec
[java] [junit] Running org.jboss.soa.esb.addressing.helpers.tests.JDBCUnitTest
[java] [junit] Tests run: 2, Failures: 0, Errors: 0, Time elapsed: 0.281 sec
[java] [junit] Testsuite: org.jboss.soa.esb.addressing.helpers.tests.JDBCUnitTest
[java] [junit] Tests run: 2, Failures: 0, Errors: 0, Time elapsed: 0.281 sec
[java] [junit] ------------- Standard Output ---------------
[java] [junit] EMMA: collecting runtime coverage data ...
[java] [junit] ------------- ---------------- ---------------
[java] [junit] Testcase: testConstructor took 0.084 sec
[java] [junit] Testcase: testSetGet took 0 sec
[java] [junit] Running org.jboss.soa.esb.addressing.helpers.tests.JMSUnitTest
[java] [junit] Tests run: 2, Failures: 0, Errors: 0, Time elapsed: 0.324 sec
[java] [junit] Testsuite: org.jboss.soa.esb.addressing.helpers.tests.JMSUnitTest
[java] [junit] Tests run: 2, Failures: 0, Errors: 0, Time elapsed: 0.324 sec
[java] [junit] ------------- Standard Output ---------------
[java] [junit] EMMA: collecting runtime coverage data ...
[java] [junit] ------------- ---------------- ---------------
[java] [junit] Testcase: testConstructor took 0.07 sec
[java] [junit] Testcase: testSetGet took 0 sec
[java] [junit] Running org.jboss.soa.esb.addressing.tests.CallUnitTest
[java] [junit] Tests run: 9, Failures: 0, Errors: 0, Time elapsed: 0.371 sec
[java] [junit] Testsuite: org.jboss.soa.esb.addressing.tests.CallUnitTest
[java] [junit] Tests run: 9, Failures: 0, Errors: 0, Time elapsed: 0.371 sec
[java] [junit] ------------- Standard Output ---------------
[java] [junit] EMMA: collecting runtime coverage data ...
[java] [junit] ------------- ---------------- ---------------
[java] [junit] Testcase: testConstructor took 0.076 sec
[java] [junit] Testcase: testEPRConstructor took 0.003 sec
[java] [junit] Testcase: testSetGetTo took 0 sec
[java] [junit] Testcase: testSetGetFrom took 0 sec
[java] [junit] Testcase: testSetGetReplyTo took 0 sec
[java] [junit] Testcase: testSetGetFaultTo took 0 sec
[java] [junit] Testcase: testSetGetRelatesTo took 0 sec
[java] [junit] Testcase: testSetGetAction took 0 sec
[java] [junit] Testcase: testSetGetMessageID took 0 sec
[java] [junit] Running org.jboss.soa.esb.addressing.tests.EPRUnitTest
[java] [junit] Tests run: 7, Failures: 0, Errors: 0, Time elapsed: 0.153 sec
[java] [junit] Testsuite: org.jboss.soa.esb.addressing.tests.EPRUnitTest
[java] [junit] Tests run: 7, Failures: 0, Errors: 0, Time elapsed: 0.153 sec
[java] [junit] ------------- Standard Output ---------------
[java] [junit] EMMA: collecting runtime coverage data ...
[java] [junit] ------------- ---------------- ---------------
[java] [junit] Testcase: testConstructor took 0.113 sec
[java] [junit] Testcase: testPortReferenceConstructor took 0 sec
[java] [junit] Testcase: testURIConstructor took 0.002 sec
[java] [junit] Testcase: testGetAddr took 0 sec
[java] [junit] Testcase: testSetAddr took 0 sec
[java] [junit] Testcase: testToFromXML took 0.015 sec
[java] [junit] Testcase: testEquals took 0 sec
[java] [junit] Running org.jboss.soa.esb.addressing.util.tests.EPRHelperUnitTest
[java] [junit] Tests run: 1, Failures: 0, Errors: 0, Time elapsed: 0.09 sec
[java] [junit] Testsuite: org.jboss.soa.esb.addressing.util.tests.EPRHelperUnitTest
[java] [junit] Tests run: 1, Failures: 0, Errors: 0, Time elapsed: 0.09 sec
[java] [junit] ------------- Standard Output ---------------
[java] [junit] EMMA: collecting runtime coverage data ...
[java] [junit] ------------- ---------------- ---------------
[java] [junit] Testcase: testToFromXMLString took 0.079 sec
[java] [junit] Running org.jboss.soa.esb.addressing.util.tests.EPRManagerUnitTest
[java] [junit] Tests run: 3, Failures: 0, Errors: 0, Time elapsed: 0.173 sec
[java] [junit] Testsuite: org.jboss.soa.esb.addressing.util.tests.EPRManagerUnitTest
[java] [junit] Tests run: 3, Failures: 0, Errors: 0, Time elapsed: 0.173 sec
[java] [junit] ------------- Standard Output ---------------
[java] [junit] EMMA: collecting runtime coverage data ...
[java] [junit] ------------- ---------------- ---------------
[java] [junit] Testcase: testCreate took 0.055 sec
[java] [junit] Testcase: testInputOutput took 0.067 sec
[java] [junit] Testcase: testSpecificInputOutput took 0.043 sec
[java] [junit] Running org.jboss.soa.esb.command.InMemoryCommandQueueUnitTest
[java] [junit] Tests run: 3, Failures: 0, Errors: 0, Time elapsed: 1.059 sec
[java] [junit] Testsuite: org.jboss.soa.esb.command.InMemoryCommandQueueUnitTest
[java] [junit] Tests run: 3, Failures: 0, Errors: 0, Time elapsed: 1.059 sec
[java] [junit] ------------- Standard Output ---------------
[java] [junit] EMMA: collecting runtime coverage data ...
[java] [junit] ------------- ---------------- ---------------
[java] [junit] Testcase: test_args took 0.266 sec
[java] [junit] Testcase: test_queue_open_close took 0 sec
[java] [junit] Testcase: test_queue_receive took 0.621 sec
[java] [junit] Running org.jboss.soa.esb.common.tests.propertymanager.PropertyManagerUnitTest
[java] [junit] Tests run: 1, Failures: 0, Errors: 0, Time elapsed: 0.047 sec
[java] [junit] Testsuite: org.jboss.soa.esb.common.tests.propertymanager.PropertyManagerUnitTest
[java] [junit] Tests run: 1, Failures: 0, Errors: 0, Time elapsed: 0.047 sec
[java] [junit] ------------- Standard Output ---------------
[java] [junit] Properties loaded (jbossesb-test-properties.xml):
[java] [junit] org.jboss.soa.esb.jndi.server.context.factory=foobar
[java] [junit] org.jboss.soa.esb.objStore.configFile=file:config.xml
[java] [junit] Properties loaded (jbossesb-test-properties.xml):
[java] [junit] org.jboss.soa.esb.mail.smtp.host=thishost
[java] [junit] Properties loaded (jbossesb-test-properties.xml):
[java] [junit] org.jboss.soa.esb.jndi.server.context.factory=foobar
[java] [junit] org.jboss.soa.esb.objStore.configFile=file:config.xml
[java] [junit] Properties loaded (jbossesb-test-properties.xml):
[java] [junit] org.jboss.soa.esb.mail.smtp.host=thishost
[java] [junit] ------------- ---------------- ---------------
[java] [junit] Testcase: testPropertyManager took 0.04 sec
[java] [junit] Running org.jboss.soa.esb.helpers.AppServerContextUnitTest
[java] [junit] Tests run: 1, Failures: 0, Errors: 1, Time elapsed: 52.992 sec
[java] [junit] Testsuite: org.jboss.soa.esb.helpers.AppServerContextUnitTest
[java] [junit] Tests run: 1, Failures: 0, Errors: 1, Time elapsed: 52.992 sec
[java] [junit] ------------- Standard Output ---------------
[java] [junit] EMMA: collecting runtime coverage data ...
[java] [junit] ------------- ---------------- ---------------
[java] [junit] Testcase: test_AppServerContext took 52.974 sec
[java] [junit] Caused an ERROR
[java] [junit] java.lang.StackOverflowError
[java] [junit] java.lang.ClassCastException: java.lang.StackOverflowError
[java] [junit] at org.jboss.ha.framework.server.HARMIServerImpl.invoke(HARMIServerImpl.java:222)
[java] [junit] at sun.rmi.server.UnicastServerRef.dispatch(UnicastServerRef.java:294)
[java] [junit] at sun.rmi.transport.Transport$1.run(Transport.java:153)
[java] [junit] at java.security.AccessController.doPrivileged(Native Method)
[java] [junit] at sun.rmi.transport.Transport.serviceCall(Transport.java:149)
[java] [junit] at sun.rmi.transport.tcp.TCPTransport.handleMessages(TCPTransport.java:466)
[java] [junit] at sun.rmi.transport.tcp.TCPTransport$ConnectionHandler.run(TCPTransport.java:707)
[java] [junit] at java.lang.Thread.run(Thread.java:595)
[java] [junit] at sun.rmi.transport.StreamRemoteCall.exceptionReceivedFromServer(StreamRemoteCall.java:247)
[java] [junit] at sun.rmi.transport.StreamRemoteCall.executeCall(StreamRemoteCall.java:223)
[java] [junit] at sun.rmi.server.UnicastRef.invoke(UnicastRef.java:126)
[java] [junit] at org.jboss.ha.framework.server.HARMIServerImpl_Stub.invoke(Unknown Source)
[java] [junit] at org.jboss.ha.framework.interfaces.HARMIClient.invokeRemote(HARMIClient.java:172)
[java] [junit] at org.jboss.ha.framework.interfaces.HARMIClient.invoke(HARMIClient.java:267)
[java] [junit] at $Proxy0.list(Unknown Source)
[java] [junit] at org.jnp.interfaces.NamingContext.list(NamingContext.java:800)
[java] [junit] at org.jnp.interfaces.NamingContext.list(NamingContext.java:786)
[java] [junit] at javax.naming.InitialContext.list(InitialContext.java:395)
[java] [junit] at org.jboss.soa.esb.helpers.NamingContext.getServerContext(NamingContext.java:66)
[java] [junit] at org.jboss.soa.esb.helpers.AppServerContextUnitTest.test_AppServerContext(AppServerContextUnitTest.java:47)
[java] BUILD FAILED
[java] /qa/services/hudson/hudson_workspace/workspace/jboss-esb-linux/trunk/product/build.xml:161: The following error occurred while executing this line:
[java] /qa/services/hudson/hudson_workspace/workspace/jboss-esb-linux/trunk/product/rosetta/build.xml:86: The following error occurred while executing this line:
[java] /qa/services/hudson/hudson_workspace/workspace/jboss-esb-linux/trunk/product/rosetta/tests/build.xml:166: The following error occurred while executing this line:
[java] /qa/services/hudson/hudson_workspace/workspace/jboss-esb-linux/trunk/product/rosetta/tests/build.xml:190: Test org.jboss.soa.esb.helpers.AppServerContextUnitTest failed
[java] Total time: 2 minutes 50 seconds
[java] Java Result: 1
esb.init-app-server:
esb.init-esb-server:
esb.init-ftp-server:
esb.init:
stop-server:
[echo] Stopping local ESB server
[java] Shutdown message has been posted to the server.
[java] Server shutdown may take a while - check logfiles for completion
[echo] Waiting for ESB server to stop...
BUILD FAILED
/qa/services/hudson/hudson_workspace/workspace/jboss-esb-linux/trunk/integration-build.xml:5: The following error occurred while executing this line:
/qa/services/hudson/hudson_workspace/workspace/jboss-esb-linux/trunk/product/build.xml:463: Product Unit Test failure
Total time: 3 minutes 37 seconds
Recording test results
Recording Emma reports trunk/product/build/tests/coverage/coverage.xml
17 years, 6 months
[JBoss Builds] Build failed in Hudson: jboss-esb-linux #633
by jboss-qa-internal@redhat.com
See http://dev45.qa.atl.jboss.com:8585/hudson/job/jboss-esb-linux/633/changes
Changes:
[tcunning] bug:JBESB-988
Typo that put two dynamicrouter_2_out entries in jbmq-queue-service.xml
------------------------------------------
[...truncated 4405 lines...]
[java] [junit] Tests run: 2, Failures: 0, Errors: 0, Time elapsed: 1.145 sec
[java] [junit] Testsuite: org.jboss.soa.esb.actions.scripting.GroovyActionProcessorUnitTest
[java] [junit] Tests run: 2, Failures: 0, Errors: 0, Time elapsed: 1.145 sec
[java] [junit] ------------- Standard Output ---------------
[java] [junit] EMMA: collecting runtime coverage data ...
[java] [junit] ------------- ---------------- ---------------
[java] [junit] Testcase: test_script_file took 0.826 sec
[java] [junit] Testcase: test_script_inlined took 0.104 sec
[java] [junit] Running org.jboss.soa.esb.actions.templates.MockActionUnitTest
[java] [junit] Tests run: 2, Failures: 0, Errors: 0, Time elapsed: 0.618 sec
[java] [junit] Testsuite: org.jboss.soa.esb.actions.templates.MockActionUnitTest
[java] [junit] Tests run: 2, Failures: 0, Errors: 0, Time elapsed: 0.618 sec
[java] [junit] ------------- Standard Output ---------------
[java] [junit] EMMA: collecting runtime coverage data ...
[java] [junit] ------------- ---------------- ---------------
[java] [junit] Testcase: testMockAction took 0.358 sec
[java] [junit] Testcase: testMockComposer took 0.015 sec
[java] [junit] Running org.jboss.soa.esb.actions.templating.StringTemplateProcessorUnitTest
[java] [junit] Tests run: 1, Failures: 0, Errors: 0, Time elapsed: 0.606 sec
[java] [junit] Testsuite: org.jboss.soa.esb.actions.templating.StringTemplateProcessorUnitTest
[java] [junit] Tests run: 1, Failures: 0, Errors: 0, Time elapsed: 0.606 sec
[java] [junit] ------------- Standard Output ---------------
[java] [junit] EMMA: collecting runtime coverage data ...
[java] [junit] ------------- ---------------- ---------------
[java] [junit] Testcase: testProcessor took 0.416 sec
[java] [junit] Running org.jboss.soa.esb.addressing.eprs.tests.DefaultFileReplyToEprUnitTest
[java] [junit] Tests run: 1, Failures: 0, Errors: 0, Time elapsed: 0.339 sec
[java] [junit] Testsuite: org.jboss.soa.esb.addressing.eprs.tests.DefaultFileReplyToEprUnitTest
[java] [junit] Tests run: 1, Failures: 0, Errors: 0, Time elapsed: 0.339 sec
[java] [junit] ------------- Standard Output ---------------
[java] [junit] EMMA: collecting runtime coverage data ...
[java] [junit] ------------- ---------------- ---------------
[java] [junit] Testcase: unknown took 0.295 sec
[java] [junit] Running org.jboss.soa.esb.addressing.eprs.tests.DefaultFtpReplyToEprIntegrationTest
[java] [junit] Tests run: 1, Failures: 0, Errors: 0, Time elapsed: 2.078 sec
[java] [junit] Testsuite: org.jboss.soa.esb.addressing.eprs.tests.DefaultFtpReplyToEprIntegrationTest
[java] [junit] Tests run: 1, Failures: 0, Errors: 0, Time elapsed: 2.078 sec
[java] [junit] ------------- Standard Output ---------------
[java] [junit] EMMA: collecting runtime coverage data ...
[java] [junit] ------------- ---------------- ---------------
[java] [junit] Testcase: unknown took 2.062 sec
[java] [junit] Running org.jboss.soa.esb.addressing.eprs.tests.DefaultJdbcReplyToEprUnitTest
[java] [junit] Tests run: 1, Failures: 0, Errors: 0, Time elapsed: 0.756 sec
[java] [junit] Testsuite: org.jboss.soa.esb.addressing.eprs.tests.DefaultJdbcReplyToEprUnitTest
[java] [junit] Tests run: 1, Failures: 0, Errors: 0, Time elapsed: 0.756 sec
[java] [junit] ------------- Standard Output ---------------
[java] [junit] EMMA: collecting runtime coverage data ...
[java] [junit] ------------- ---------------- ---------------
[java] [junit] Testcase: unknown took 0.238 sec
[java] [junit] Running org.jboss.soa.esb.addressing.helpers.tests.EmailUnitTest
[java] [junit] Tests run: 2, Failures: 0, Errors: 0, Time elapsed: 0.302 sec
[java] [junit] Testsuite: org.jboss.soa.esb.addressing.helpers.tests.EmailUnitTest
[java] [junit] Tests run: 2, Failures: 0, Errors: 0, Time elapsed: 0.302 sec
[java] [junit] ------------- Standard Output ---------------
[java] [junit] EMMA: collecting runtime coverage data ...
[java] [junit] ------------- ---------------- ---------------
[java] [junit] Testcase: testConstructor took 0.059 sec
[java] [junit] Testcase: testSetGet took 0.001 sec
[java] [junit] Running org.jboss.soa.esb.addressing.helpers.tests.FTPUnitTest
[java] [junit] Tests run: 2, Failures: 0, Errors: 0, Time elapsed: 0.224 sec
[java] [junit] Testsuite: org.jboss.soa.esb.addressing.helpers.tests.FTPUnitTest
[java] [junit] Tests run: 2, Failures: 0, Errors: 0, Time elapsed: 0.224 sec
[java] [junit] ------------- Standard Output ---------------
[java] [junit] EMMA: collecting runtime coverage data ...
[java] [junit] ------------- ---------------- ---------------
[java] [junit] Testcase: testConstructor took 0.058 sec
[java] [junit] Testcase: testSetGet took 0.003 sec
[java] [junit] Running org.jboss.soa.esb.addressing.helpers.tests.HTTPUnitTest
[java] [junit] Tests run: 2, Failures: 0, Errors: 0, Time elapsed: 0.239 sec
[java] [junit] Testsuite: org.jboss.soa.esb.addressing.helpers.tests.HTTPUnitTest
[java] [junit] Tests run: 2, Failures: 0, Errors: 0, Time elapsed: 0.239 sec
[java] [junit] ------------- Standard Output ---------------
[java] [junit] EMMA: collecting runtime coverage data ...
[java] [junit] ------------- ---------------- ---------------
[java] [junit] Testcase: testConstructor took 0.064 sec
[java] [junit] Testcase: testSetGet took 0.001 sec
[java] [junit] Running org.jboss.soa.esb.addressing.helpers.tests.JDBCUnitTest
[java] [junit] Tests run: 2, Failures: 0, Errors: 0, Time elapsed: 0.243 sec
[java] [junit] Testsuite: org.jboss.soa.esb.addressing.helpers.tests.JDBCUnitTest
[java] [junit] Tests run: 2, Failures: 0, Errors: 0, Time elapsed: 0.243 sec
[java] [junit] ------------- Standard Output ---------------
[java] [junit] EMMA: collecting runtime coverage data ...
[java] [junit] ------------- ---------------- ---------------
[java] [junit] Testcase: testConstructor took 0.069 sec
[java] [junit] Testcase: testSetGet took 0 sec
[java] [junit] Running org.jboss.soa.esb.addressing.helpers.tests.JMSUnitTest
[java] [junit] Tests run: 2, Failures: 0, Errors: 0, Time elapsed: 0.288 sec
[java] [junit] Testsuite: org.jboss.soa.esb.addressing.helpers.tests.JMSUnitTest
[java] [junit] Tests run: 2, Failures: 0, Errors: 0, Time elapsed: 0.288 sec
[java] [junit] ------------- Standard Output ---------------
[java] [junit] EMMA: collecting runtime coverage data ...
[java] [junit] ------------- ---------------- ---------------
[java] [junit] Testcase: testConstructor took 0.061 sec
[java] [junit] Testcase: testSetGet took 0.001 sec
[java] [junit] Running org.jboss.soa.esb.addressing.tests.CallUnitTest
[java] [junit] Tests run: 9, Failures: 0, Errors: 0, Time elapsed: 0.233 sec
[java] [junit] Testsuite: org.jboss.soa.esb.addressing.tests.CallUnitTest
[java] [junit] Tests run: 9, Failures: 0, Errors: 0, Time elapsed: 0.233 sec
[java] [junit] ------------- Standard Output ---------------
[java] [junit] EMMA: collecting runtime coverage data ...
[java] [junit] ------------- ---------------- ---------------
[java] [junit] Testcase: testConstructor took 0.056 sec
[java] [junit] Testcase: testEPRConstructor took 0.002 sec
[java] [junit] Testcase: testSetGetTo took 0 sec
[java] [junit] Testcase: testSetGetFrom took 0.001 sec
[java] [junit] Testcase: testSetGetReplyTo took 0 sec
[java] [junit] Testcase: testSetGetFaultTo took 0 sec
[java] [junit] Testcase: testSetGetRelatesTo took 0 sec
[java] [junit] Testcase: testSetGetAction took 0 sec
[java] [junit] Testcase: testSetGetMessageID took 0 sec
[java] [junit] Running org.jboss.soa.esb.addressing.tests.EPRUnitTest
[java] [junit] Tests run: 7, Failures: 0, Errors: 0, Time elapsed: 0.076 sec
[java] [junit] Testsuite: org.jboss.soa.esb.addressing.tests.EPRUnitTest
[java] [junit] Tests run: 7, Failures: 0, Errors: 0, Time elapsed: 0.076 sec
[java] [junit] ------------- Standard Output ---------------
[java] [junit] EMMA: collecting runtime coverage data ...
[java] [junit] ------------- ---------------- ---------------
[java] [junit] Testcase: testConstructor took 0.055 sec
[java] [junit] Testcase: testPortReferenceConstructor took 0 sec
[java] [junit] Testcase: testURIConstructor took 0.001 sec
[java] [junit] Testcase: testGetAddr took 0 sec
[java] [junit] Testcase: testSetAddr took 0 sec
[java] [junit] Testcase: testToFromXML took 0.011 sec
[java] [junit] Testcase: testEquals took 0 sec
[java] [junit] Running org.jboss.soa.esb.addressing.util.tests.EPRHelperUnitTest
[java] [junit] Tests run: 1, Failures: 0, Errors: 0, Time elapsed: 0.099 sec
[java] [junit] Testsuite: org.jboss.soa.esb.addressing.util.tests.EPRHelperUnitTest
[java] [junit] Tests run: 1, Failures: 0, Errors: 0, Time elapsed: 0.099 sec
[java] [junit] ------------- Standard Output ---------------
[java] [junit] EMMA: collecting runtime coverage data ...
[java] [junit] ------------- ---------------- ---------------
[java] [junit] Testcase: testToFromXMLString took 0.088 sec
[java] [junit] Running org.jboss.soa.esb.addressing.util.tests.EPRManagerUnitTest
[java] [junit] Tests run: 3, Failures: 0, Errors: 0, Time elapsed: 0.17 sec
[java] [junit] Testsuite: org.jboss.soa.esb.addressing.util.tests.EPRManagerUnitTest
[java] [junit] Tests run: 3, Failures: 0, Errors: 0, Time elapsed: 0.17 sec
[java] [junit] ------------- Standard Output ---------------
[java] [junit] EMMA: collecting runtime coverage data ...
[java] [junit] ------------- ---------------- ---------------
[java] [junit] Testcase: testCreate took 0.056 sec
[java] [junit] Testcase: testInputOutput took 0.062 sec
[java] [junit] Testcase: testSpecificInputOutput took 0.044 sec
[java] [junit] Running org.jboss.soa.esb.command.InMemoryCommandQueueUnitTest
[java] [junit] Tests run: 3, Failures: 0, Errors: 0, Time elapsed: 1.063 sec
[java] [junit] Testsuite: org.jboss.soa.esb.command.InMemoryCommandQueueUnitTest
[java] [junit] Tests run: 3, Failures: 0, Errors: 0, Time elapsed: 1.063 sec
[java] [junit] ------------- Standard Output ---------------
[java] [junit] EMMA: collecting runtime coverage data ...
[java] [junit] ------------- ---------------- ---------------
[java] [junit] Testcase: test_args took 0.267 sec
[java] [junit] Testcase: test_queue_open_close took 0 sec
[java] [junit] Testcase: test_queue_receive took 0.617 sec
[java] [junit] Running org.jboss.soa.esb.common.tests.propertymanager.PropertyManagerUnitTest
[java] [junit] Tests run: 1, Failures: 0, Errors: 0, Time elapsed: 0.079 sec
[java] [junit] Testsuite: org.jboss.soa.esb.common.tests.propertymanager.PropertyManagerUnitTest
[java] [junit] Tests run: 1, Failures: 0, Errors: 0, Time elapsed: 0.079 sec
[java] [junit] ------------- Standard Output ---------------
[java] [junit] Properties loaded (jbossesb-test-properties.xml):
[java] [junit] org.jboss.soa.esb.jndi.server.context.factory=foobar
[java] [junit] org.jboss.soa.esb.objStore.configFile=file:config.xml
[java] [junit] Properties loaded (jbossesb-test-properties.xml):
[java] [junit] org.jboss.soa.esb.mail.smtp.host=thishost
[java] [junit] Properties loaded (jbossesb-test-properties.xml):
[java] [junit] org.jboss.soa.esb.jndi.server.context.factory=foobar
[java] [junit] org.jboss.soa.esb.objStore.configFile=file:config.xml
[java] [junit] Properties loaded (jbossesb-test-properties.xml):
[java] [junit] org.jboss.soa.esb.mail.smtp.host=thishost
[java] [junit] ------------- ---------------- ---------------
[java] [junit] Testcase: testPropertyManager took 0.069 sec
[java] [junit] Running org.jboss.soa.esb.helpers.AppServerContextUnitTest
[java] [junit] Tests run: 1, Failures: 0, Errors: 1, Time elapsed: 48.383 sec
[java] [junit] Testsuite: org.jboss.soa.esb.helpers.AppServerContextUnitTest
[java] [junit] Tests run: 1, Failures: 0, Errors: 1, Time elapsed: 48.383 sec
[java] [junit] ------------- Standard Output ---------------
[java] [junit] EMMA: collecting runtime coverage data ...
[java] [junit] ------------- ---------------- ---------------
[java] [junit] Testcase: test_AppServerContext took 48.365 sec
[java] [junit] Caused an ERROR
[java] [junit] java.lang.StackOverflowError
[java] [junit] java.lang.ClassCastException: java.lang.StackOverflowError
[java] [junit] at org.jboss.ha.framework.server.HARMIServerImpl.invoke(HARMIServerImpl.java:222)
[java] [junit] at sun.rmi.server.UnicastServerRef.dispatch(UnicastServerRef.java:294)
[java] [junit] at sun.rmi.transport.Transport$1.run(Transport.java:153)
[java] [junit] at java.security.AccessController.doPrivileged(Native Method)
[java] [junit] at sun.rmi.transport.Transport.serviceCall(Transport.java:149)
[java] [junit] at sun.rmi.transport.tcp.TCPTransport.handleMessages(TCPTransport.java:466)
[java] [junit] at sun.rmi.transport.tcp.TCPTransport$ConnectionHandler.run(TCPTransport.java:707)
[java] [junit] at java.lang.Thread.run(Thread.java:595)
[java] [junit] at sun.rmi.transport.StreamRemoteCall.exceptionReceivedFromServer(StreamRemoteCall.java:247)
[java] [junit] at sun.rmi.transport.StreamRemoteCall.executeCall(StreamRemoteCall.java:223)
[java] [junit] at sun.rmi.server.UnicastRef.invoke(UnicastRef.java:126)
[java] [junit] at org.jboss.ha.framework.server.HARMIServerImpl_Stub.invoke(Unknown Source)
[java] [junit] at org.jboss.ha.framework.interfaces.HARMIClient.invokeRemote(HARMIClient.java:172)
[java] [junit] at org.jboss.ha.framework.interfaces.HARMIClient.invoke(HARMIClient.java:267)
[java] [junit] at $Proxy0.list(Unknown Source)
[java] [junit] at org.jnp.interfaces.NamingContext.list(NamingContext.java:800)
[java] [junit] at org.jnp.interfaces.NamingContext.list(NamingContext.java:786)
[java] [junit] at javax.naming.InitialContext.list(InitialContext.java:395)
[java] [junit] at org.jboss.soa.esb.helpers.NamingContext.getServerContext(NamingContext.java:66)
[java] [junit] at org.jboss.soa.esb.helpers.AppServerContextUnitTest.test_AppServerContext(AppServerContextUnitTest.java:47)
[java] BUILD FAILED
[java] /qa/services/hudson/hudson_workspace/workspace/jboss-esb-linux/trunk/product/build.xml:161: The following error occurred while executing this line:
[java] /qa/services/hudson/hudson_workspace/workspace/jboss-esb-linux/trunk/product/rosetta/build.xml:86: The following error occurred while executing this line:
[java] /qa/services/hudson/hudson_workspace/workspace/jboss-esb-linux/trunk/product/rosetta/tests/build.xml:166: The following error occurred while executing this line:
[java] /qa/services/hudson/hudson_workspace/workspace/jboss-esb-linux/trunk/product/rosetta/tests/build.xml:190: Test org.jboss.soa.esb.helpers.AppServerContextUnitTest failed
[java] Total time: 2 minutes 43 seconds
[java] Java Result: 1
esb.init-app-server:
esb.init-esb-server:
esb.init-ftp-server:
esb.init:
stop-server:
[echo] Stopping local ESB server
[java] Shutdown message has been posted to the server.
[java] Server shutdown may take a while - check logfiles for completion
[echo] Waiting for ESB server to stop...
BUILD FAILED
/qa/services/hudson/hudson_workspace/workspace/jboss-esb-linux/trunk/integration-build.xml:5: The following error occurred while executing this line:
/qa/services/hudson/hudson_workspace/workspace/jboss-esb-linux/trunk/product/build.xml:463: Product Unit Test failure
Total time: 3 minutes 36 seconds
Recording test results
Recording Emma reports trunk/product/build/tests/coverage/coverage.xml
17 years, 6 months
[JBoss Builds] Build failed in Hudson: jboss-esb-windows #534
by jboss-qa-internal@redhat.com
See http://dev45.qa.atl.jboss.com:8585/hudson/job/jboss-esb-windows/534/changes
Changes:
[kevin.conner(a)jboss.com] Fixed ReceiveJMSMessage and readme: JBESB-975
[tcunning] bug:JBESB-988
Typo that put two dynamicrouter_2_out entries in jbmq-queue-service.xml
------------------------------------------
[...truncated 4317 lines...]
[java] [junit] Running org.jboss.soa.esb.actions.scripting.GroovyActionProcessorUnitTest
[java] [junit] Tests run: 2, Failures: 0, Errors: 0, Time elapsed: 1.11 sec
[java] [junit] Testsuite: org.jboss.soa.esb.actions.scripting.GroovyActionProcessorUnitTest
[java] [junit] Tests run: 2, Failures: 0, Errors: 0, Time elapsed: 1.11 sec
[java] [junit] ------------- Standard Output ---------------
[java] [junit] EMMA: collecting runtime coverage data ...
[java] [junit] ------------- ---------------- ---------------
[java] [junit] Testcase: test_script_file took 0.75 sec
[java] [junit] Testcase: test_script_inlined took 0.172 sec
[java] [junit] Running org.jboss.soa.esb.actions.templates.MockActionUnitTest
[java] [junit] Tests run: 2, Failures: 0, Errors: 0, Time elapsed: 0.532 sec
[java] [junit] Testsuite: org.jboss.soa.esb.actions.templates.MockActionUnitTest
[java] [junit] Tests run: 2, Failures: 0, Errors: 0, Time elapsed: 0.532 sec
[java] [junit] ------------- Standard Output ---------------
[java] [junit] EMMA: collecting runtime coverage data ...
[java] [junit] ------------- ---------------- ---------------
[java] [junit] Testcase: testMockAction took 0.313 sec
[java] [junit] Testcase: testMockComposer took 0 sec
[java] [junit] Running org.jboss.soa.esb.actions.templating.StringTemplateProcessorUnitTest
[java] [junit] Tests run: 1, Failures: 0, Errors: 0, Time elapsed: 0.625 sec
[java] [junit] Testsuite: org.jboss.soa.esb.actions.templating.StringTemplateProcessorUnitTest
[java] [junit] Tests run: 1, Failures: 0, Errors: 0, Time elapsed: 0.625 sec
[java] [junit] ------------- Standard Output ---------------
[java] [junit] EMMA: collecting runtime coverage data ...
[java] [junit] ------------- ---------------- ---------------
[java] [junit] Testcase: testProcessor took 0.391 sec
[java] [junit] Running org.jboss.soa.esb.addressing.eprs.tests.DefaultFileReplyToEprUnitTest
[java] [junit] Tests run: 1, Failures: 0, Errors: 0, Time elapsed: 0.422 sec
[java] [junit] Testsuite: org.jboss.soa.esb.addressing.eprs.tests.DefaultFileReplyToEprUnitTest
[java] [junit] Tests run: 1, Failures: 0, Errors: 0, Time elapsed: 0.422 sec
[java] [junit] ------------- Standard Output ---------------
[java] [junit] EMMA: collecting runtime coverage data ...
[java] [junit] ------------- ---------------- ---------------
[java] [junit] Testcase: unknown took 0.406 sec
[java] [junit] Running org.jboss.soa.esb.addressing.eprs.tests.DefaultFtpReplyToEprIntegrationTest
[java] [junit] Tests run: 1, Failures: 0, Errors: 0, Time elapsed: 1.484 sec
[java] [junit] Testsuite: org.jboss.soa.esb.addressing.eprs.tests.DefaultFtpReplyToEprIntegrationTest
[java] [junit] Tests run: 1, Failures: 0, Errors: 0, Time elapsed: 1.484 sec
[java] [junit] ------------- Standard Output ---------------
[java] [junit] EMMA: collecting runtime coverage data ...
[java] [junit] ------------- ---------------- ---------------
[java] [junit] Testcase: unknown took 1.469 sec
[java] [junit] Running org.jboss.soa.esb.addressing.eprs.tests.DefaultJdbcReplyToEprUnitTest
[java] [junit] Tests run: 1, Failures: 0, Errors: 0, Time elapsed: 0.781 sec
[java] [junit] Testsuite: org.jboss.soa.esb.addressing.eprs.tests.DefaultJdbcReplyToEprUnitTest
[java] [junit] Tests run: 1, Failures: 0, Errors: 0, Time elapsed: 0.781 sec
[java] [junit] ------------- Standard Output ---------------
[java] [junit] EMMA: collecting runtime coverage data ...
[java] [junit] ------------- ---------------- ---------------
[java] [junit] Testcase: unknown took 0.218 sec
[java] [junit] Running org.jboss.soa.esb.addressing.helpers.tests.EmailUnitTest
[java] [junit] Tests run: 2, Failures: 0, Errors: 0, Time elapsed: 0.25 sec
[java] [junit] Testsuite: org.jboss.soa.esb.addressing.helpers.tests.EmailUnitTest
[java] [junit] Tests run: 2, Failures: 0, Errors: 0, Time elapsed: 0.25 sec
[java] [junit] ------------- Standard Output ---------------
[java] [junit] EMMA: collecting runtime coverage data ...
[java] [junit] ------------- ---------------- ---------------
[java] [junit] Testcase: testConstructor took 0.063 sec
[java] [junit] Testcase: testSetGet took 0 sec
[java] [junit] Running org.jboss.soa.esb.addressing.helpers.tests.FTPUnitTest
[java] [junit] Tests run: 2, Failures: 0, Errors: 0, Time elapsed: 0.25 sec
[java] [junit] Testsuite: org.jboss.soa.esb.addressing.helpers.tests.FTPUnitTest
[java] [junit] Tests run: 2, Failures: 0, Errors: 0, Time elapsed: 0.25 sec
[java] [junit] ------------- Standard Output ---------------
[java] [junit] EMMA: collecting runtime coverage data ...
[java] [junit] ------------- ---------------- ---------------
[java] [junit] Testcase: testConstructor took 0.078 sec
[java] [junit] Testcase: testSetGet took 0 sec
[java] [junit] Running org.jboss.soa.esb.addressing.helpers.tests.HTTPUnitTest
[java] [junit] Tests run: 2, Failures: 0, Errors: 0, Time elapsed: 0.235 sec
[java] [junit] Testsuite: org.jboss.soa.esb.addressing.helpers.tests.HTTPUnitTest
[java] [junit] Tests run: 2, Failures: 0, Errors: 0, Time elapsed: 0.235 sec
[java] [junit] ------------- Standard Output ---------------
[java] [junit] EMMA: collecting runtime coverage data ...
[java] [junit] ------------- ---------------- ---------------
[java] [junit] Testcase: testConstructor took 0.063 sec
[java] [junit] Testcase: testSetGet took 0 sec
[java] [junit] Running org.jboss.soa.esb.addressing.helpers.tests.JDBCUnitTest
[java] [junit] Tests run: 2, Failures: 0, Errors: 0, Time elapsed: 0.25 sec
[java] [junit] Testsuite: org.jboss.soa.esb.addressing.helpers.tests.JDBCUnitTest
[java] [junit] Tests run: 2, Failures: 0, Errors: 0, Time elapsed: 0.25 sec
[java] [junit] ------------- Standard Output ---------------
[java] [junit] EMMA: collecting runtime coverage data ...
[java] [junit] ------------- ---------------- ---------------
[java] [junit] Testcase: testConstructor took 0.047 sec
[java] [junit] Testcase: testSetGet took 0.016 sec
[java] [junit] Running org.jboss.soa.esb.addressing.helpers.tests.JMSUnitTest
[java] [junit] Tests run: 2, Failures: 0, Errors: 0, Time elapsed: 0.219 sec
[java] [junit] Testsuite: org.jboss.soa.esb.addressing.helpers.tests.JMSUnitTest
[java] [junit] Tests run: 2, Failures: 0, Errors: 0, Time elapsed: 0.219 sec
[java] [junit] ------------- Standard Output ---------------
[java] [junit] EMMA: collecting runtime coverage data ...
[java] [junit] ------------- ---------------- ---------------
[java] [junit] Testcase: testConstructor took 0.047 sec
[java] [junit] Testcase: testSetGet took 0 sec
[java] [junit] Running org.jboss.soa.esb.addressing.tests.CallUnitTest
[java] [junit] Tests run: 9, Failures: 0, Errors: 0, Time elapsed: 0.328 sec
[java] [junit] Testsuite: org.jboss.soa.esb.addressing.tests.CallUnitTest
[java] [junit] Tests run: 9, Failures: 0, Errors: 0, Time elapsed: 0.328 sec
[java] [junit] ------------- Standard Output ---------------
[java] [junit] EMMA: collecting runtime coverage data ...
[java] [junit] ------------- ---------------- ---------------
[java] [junit] Testcase: testConstructor took 0.062 sec
[java] [junit] Testcase: testEPRConstructor took 0 sec
[java] [junit] Testcase: testSetGetTo took 0 sec
[java] [junit] Testcase: testSetGetFrom took 0 sec
[java] [junit] Testcase: testSetGetReplyTo took 0 sec
[java] [junit] Testcase: testSetGetFaultTo took 0 sec
[java] [junit] Testcase: testSetGetRelatesTo took 0 sec
[java] [junit] Testcase: testSetGetAction took 0 sec
[java] [junit] Testcase: testSetGetMessageID took 0 sec
[java] [junit] Running org.jboss.soa.esb.addressing.tests.EPRUnitTest
[java] [junit] Tests run: 7, Failures: 0, Errors: 0, Time elapsed: 0.109 sec
[java] [junit] Testsuite: org.jboss.soa.esb.addressing.tests.EPRUnitTest
[java] [junit] Tests run: 7, Failures: 0, Errors: 0, Time elapsed: 0.109 sec
[java] [junit] ------------- Standard Output ---------------
[java] [junit] EMMA: collecting runtime coverage data ...
[java] [junit] ------------- ---------------- ---------------
[java] [junit] Testcase: testConstructor took 0.078 sec
[java] [junit] Testcase: testPortReferenceConstructor took 0 sec
[java] [junit] Testcase: testURIConstructor took 0 sec
[java] [junit] Testcase: testGetAddr took 0 sec
[java] [junit] Testcase: testSetAddr took 0 sec
[java] [junit] Testcase: testToFromXML took 0.016 sec
[java] [junit] Testcase: testEquals took 0 sec
[java] [junit] Running org.jboss.soa.esb.addressing.util.tests.EPRHelperUnitTest
[java] [junit] Tests run: 1, Failures: 0, Errors: 0, Time elapsed: 0.093 sec
[java] [junit] Testsuite: org.jboss.soa.esb.addressing.util.tests.EPRHelperUnitTest
[java] [junit] Tests run: 1, Failures: 0, Errors: 0, Time elapsed: 0.093 sec
[java] [junit] ------------- Standard Output ---------------
[java] [junit] EMMA: collecting runtime coverage data ...
[java] [junit] ------------- ---------------- ---------------
[java] [junit] Testcase: testToFromXMLString took 0.093 sec
[java] [junit] Running org.jboss.soa.esb.addressing.util.tests.EPRManagerUnitTest
[java] [junit] Tests run: 3, Failures: 0, Errors: 0, Time elapsed: 0.094 sec
[java] [junit] Testsuite: org.jboss.soa.esb.addressing.util.tests.EPRManagerUnitTest
[java] [junit] Tests run: 3, Failures: 0, Errors: 0, Time elapsed: 0.094 sec
[java] [junit] ------------- Standard Output ---------------
[java] [junit] EMMA: collecting runtime coverage data ...
[java] [junit] ------------- ---------------- ---------------
[java] [junit] Testcase: testCreate took 0.047 sec
[java] [junit] Testcase: testInputOutput took 0.032 sec
[java] [junit] Testcase: testSpecificInputOutput took 0 sec
[java] [junit] Running org.jboss.soa.esb.command.InMemoryCommandQueueUnitTest
[java] [junit] Tests run: 3, Failures: 0, Errors: 0, Time elapsed: 0.765 sec
[java] [junit] Testsuite: org.jboss.soa.esb.command.InMemoryCommandQueueUnitTest
[java] [junit] Tests run: 3, Failures: 0, Errors: 0, Time elapsed: 0.765 sec
[java] [junit] ------------- Standard Output ---------------
[java] [junit] EMMA: collecting runtime coverage data ...
[java] [junit] ------------- ---------------- ---------------
[java] [junit] Testcase: test_args took 0.187 sec
[java] [junit] Testcase: test_queue_open_close took 0 sec
[java] [junit] Testcase: test_queue_receive took 0.375 sec
[java] [junit] Running org.jboss.soa.esb.common.tests.propertymanager.PropertyManagerUnitTest
[java] [junit] Tests run: 1, Failures: 0, Errors: 0, Time elapsed: 0.031 sec
[java] [junit] Testsuite: org.jboss.soa.esb.common.tests.propertymanager.PropertyManagerUnitTest
[java] [junit] Tests run: 1, Failures: 0, Errors: 0, Time elapsed: 0.031 sec
[java] [junit] ------------- Standard Output ---------------
[java] [junit] Properties loaded (jbossesb-test-properties.xml):
[java] [junit] org.jboss.soa.esb.jndi.server.context.factory=foobar
[java] [junit] org.jboss.soa.esb.objStore.configFile=file:config.xml
[java] [junit] Properties loaded (jbossesb-test-properties.xml):
[java] [junit] org.jboss.soa.esb.mail.smtp.host=thishost
[java] [junit] Properties loaded (jbossesb-test-properties.xml):
[java] [junit] org.jboss.soa.esb.jndi.server.context.factory=foobar
[java] [junit] org.jboss.soa.esb.objStore.configFile=file:config.xml
[java] [junit] Properties loaded (jbossesb-test-properties.xml):
[java] [junit] org.jboss.soa.esb.mail.smtp.host=thishost
[java] [junit] ------------- ---------------- ---------------
[java] [junit] Testcase: testPropertyManager took 0.031 sec
[java] [junit] Running org.jboss.soa.esb.helpers.AppServerContextUnitTest
[java] [junit] Tests run: 1, Failures: 0, Errors: 1, Time elapsed: 52.812 sec
[java] [junit] Testsuite: org.jboss.soa.esb.helpers.AppServerContextUnitTest
[java] [junit] Tests run: 1, Failures: 0, Errors: 1, Time elapsed: 52.812 sec
[java] [junit] ------------- Standard Output ---------------
[java] [junit] EMMA: collecting runtime coverage data ...
[java] [junit] ------------- ---------------- ---------------
[java] [junit] Testcase: test_AppServerContext took 52.781 sec
[java] [junit] Caused an ERROR
[java] [junit] java.lang.StackOverflowError
[java] [junit] java.lang.ClassCastException: java.lang.StackOverflowError
[java] [junit] at org.jboss.ha.framework.server.HARMIServerImpl.invoke(HARMIServerImpl.java:222)
[java] [junit] at sun.rmi.server.UnicastServerRef.dispatch(UnicastServerRef.java:294)
[java] [junit] at sun.rmi.transport.Transport$1.run(Transport.java:153)
[java] [junit] at java.security.AccessController.doPrivileged(Native Method)
[java] [junit] at sun.rmi.transport.Transport.serviceCall(Transport.java:149)
[java] [junit] at sun.rmi.transport.tcp.TCPTransport.handleMessages(TCPTransport.java:466)
[java] [junit] at sun.rmi.transport.tcp.TCPTransport$ConnectionHandler.run(TCPTransport.java:707)
[java] [junit] at java.lang.Thread.run(Thread.java:595)
[java] [junit] at sun.rmi.transport.StreamRemoteCall.exceptionReceivedFromServer(StreamRemoteCall.java:247)
[java] [junit] at sun.rmi.transport.StreamRemoteCall.executeCall(StreamRemoteCall.java:223)
[java] [junit] at sun.rmi.server.UnicastRef.invoke(UnicastRef.java:126)
[java] [junit] at org.jboss.ha.framework.server.HARMIServerImpl_Stub.invoke(Unknown Source)
[java] [junit] at org.jboss.ha.framework.interfaces.HARMIClient.invokeRemote(HARMIClient.java:172)
[java] [junit] at org.jboss.ha.framework.interfaces.HARMIClient.invoke(HARMIClient.java:267)
[java] [junit] at $Proxy0.list(Unknown Source)
[java] [junit] at org.jnp.interfaces.NamingContext.list(NamingContext.java:800)
[java] [junit] at org.jnp.interfaces.NamingContext.list(NamingContext.java:786)
[java] [junit] at javax.naming.InitialContext.list(InitialContext.java:395)
[java] [junit] at org.jboss.soa.esb.helpers.NamingContext.getServerContext(NamingContext.java:66)
[java] [junit] at org.jboss.soa.esb.helpers.AppServerContextUnitTest.test_AppServerContext(AppServerContextUnitTest.java:47)
[java] BUILD FAILED
[java] C:\cygwin\home\hudson\hudson_workspace\workspace\jboss-esb-windows\trunk\product\build.xml:161: The following error occurred while executing this line:
[java] C:\cygwin\home\hudson\hudson_workspace\workspace\jboss-esb-windows\trunk\product\rosetta\build.xml:86: The following error occurred while executing this line:
[java] C:\cygwin\home\hudson\hudson_workspace\workspace\jboss-esb-windows\trunk\product\rosetta\tests\build.xml:166: The following error occurred while executing this line:
[java] C:\cygwin\home\hudson\hudson_workspace\workspace\jboss-esb-windows\trunk\product\rosetta\tests\build.xml:190: Test org.jboss.soa.esb.helpers.AppServerContextUnitTest failed
[java] Total time: 2 minutes 32 seconds
[java] Java Result: 1
esb.init-app-server:
esb.init-esb-server:
esb.init-ftp-server:
esb.init:
stop-server:
[echo] Stopping local ESB server
[java] Shutdown message has been posted to the server.
[java] Server shutdown may take a while - check logfiles for completion
[echo] Waiting for ESB server to stop...
BUILD FAILED
C:\cygwin\home\hudson\hudson_workspace\workspace\jboss-esb-windows\trunk\integration-build.xml:5: The following error occurred while executing this line:
C:\cygwin\home\hudson\hudson_workspace\workspace\jboss-esb-windows\trunk\product\build.xml:463: Product Unit Test failure
Total time: 3 minutes 4 seconds
Recording test results
17 years, 6 months
[JBoss Builds] Build failed in Hudson: jboss-esb-linux #632
by jboss-qa-internal@redhat.com
See http://dev45.qa.atl.jboss.com:8585/hudson/job/jboss-esb-linux/632/changes
Changes:
[kevin.conner(a)jboss.com] Fixed ReceiveJMSMessage and readme: JBESB-975
------------------------------------------
[...truncated 4405 lines...]
[java] [junit] Tests run: 2, Failures: 0, Errors: 0, Time elapsed: 1.246 sec
[java] [junit] Testsuite: org.jboss.soa.esb.actions.scripting.GroovyActionProcessorUnitTest
[java] [junit] Tests run: 2, Failures: 0, Errors: 0, Time elapsed: 1.246 sec
[java] [junit] ------------- Standard Output ---------------
[java] [junit] EMMA: collecting runtime coverage data ...
[java] [junit] ------------- ---------------- ---------------
[java] [junit] Testcase: test_script_file took 0.954 sec
[java] [junit] Testcase: test_script_inlined took 0.11 sec
[java] [junit] Running org.jboss.soa.esb.actions.templates.MockActionUnitTest
[java] [junit] Tests run: 2, Failures: 0, Errors: 0, Time elapsed: 0.553 sec
[java] [junit] Testsuite: org.jboss.soa.esb.actions.templates.MockActionUnitTest
[java] [junit] Tests run: 2, Failures: 0, Errors: 0, Time elapsed: 0.553 sec
[java] [junit] ------------- Standard Output ---------------
[java] [junit] EMMA: collecting runtime coverage data ...
[java] [junit] ------------- ---------------- ---------------
[java] [junit] Testcase: testMockAction took 0.37 sec
[java] [junit] Testcase: testMockComposer took 0.01 sec
[java] [junit] Running org.jboss.soa.esb.actions.templating.StringTemplateProcessorUnitTest
[java] [junit] Tests run: 1, Failures: 0, Errors: 0, Time elapsed: 0.578 sec
[java] [junit] Testsuite: org.jboss.soa.esb.actions.templating.StringTemplateProcessorUnitTest
[java] [junit] Tests run: 1, Failures: 0, Errors: 0, Time elapsed: 0.578 sec
[java] [junit] ------------- Standard Output ---------------
[java] [junit] EMMA: collecting runtime coverage data ...
[java] [junit] ------------- ---------------- ---------------
[java] [junit] Testcase: testProcessor took 0.401 sec
[java] [junit] Running org.jboss.soa.esb.addressing.eprs.tests.DefaultFileReplyToEprUnitTest
[java] [junit] Tests run: 1, Failures: 0, Errors: 0, Time elapsed: 0.344 sec
[java] [junit] Testsuite: org.jboss.soa.esb.addressing.eprs.tests.DefaultFileReplyToEprUnitTest
[java] [junit] Tests run: 1, Failures: 0, Errors: 0, Time elapsed: 0.344 sec
[java] [junit] ------------- Standard Output ---------------
[java] [junit] EMMA: collecting runtime coverage data ...
[java] [junit] ------------- ---------------- ---------------
[java] [junit] Testcase: unknown took 0.314 sec
[java] [junit] Running org.jboss.soa.esb.addressing.eprs.tests.DefaultFtpReplyToEprIntegrationTest
[java] [junit] Tests run: 1, Failures: 0, Errors: 0, Time elapsed: 1.72 sec
[java] [junit] Testsuite: org.jboss.soa.esb.addressing.eprs.tests.DefaultFtpReplyToEprIntegrationTest
[java] [junit] Tests run: 1, Failures: 0, Errors: 0, Time elapsed: 1.72 sec
[java] [junit] ------------- Standard Output ---------------
[java] [junit] EMMA: collecting runtime coverage data ...
[java] [junit] ------------- ---------------- ---------------
[java] [junit] Testcase: unknown took 1.704 sec
[java] [junit] Running org.jboss.soa.esb.addressing.eprs.tests.DefaultJdbcReplyToEprUnitTest
[java] [junit] Tests run: 1, Failures: 0, Errors: 0, Time elapsed: 0.808 sec
[java] [junit] Testsuite: org.jboss.soa.esb.addressing.eprs.tests.DefaultJdbcReplyToEprUnitTest
[java] [junit] Tests run: 1, Failures: 0, Errors: 0, Time elapsed: 0.808 sec
[java] [junit] ------------- Standard Output ---------------
[java] [junit] EMMA: collecting runtime coverage data ...
[java] [junit] ------------- ---------------- ---------------
[java] [junit] Testcase: unknown took 0.183 sec
[java] [junit] Running org.jboss.soa.esb.addressing.helpers.tests.EmailUnitTest
[java] [junit] Tests run: 2, Failures: 0, Errors: 0, Time elapsed: 0.355 sec
[java] [junit] Testsuite: org.jboss.soa.esb.addressing.helpers.tests.EmailUnitTest
[java] [junit] Tests run: 2, Failures: 0, Errors: 0, Time elapsed: 0.355 sec
[java] [junit] ------------- Standard Output ---------------
[java] [junit] EMMA: collecting runtime coverage data ...
[java] [junit] ------------- ---------------- ---------------
[java] [junit] Testcase: testConstructor took 0.071 sec
[java] [junit] Testcase: testSetGet took 0 sec
[java] [junit] Running org.jboss.soa.esb.addressing.helpers.tests.FTPUnitTest
[java] [junit] Tests run: 2, Failures: 0, Errors: 0, Time elapsed: 0.334 sec
[java] [junit] Testsuite: org.jboss.soa.esb.addressing.helpers.tests.FTPUnitTest
[java] [junit] Tests run: 2, Failures: 0, Errors: 0, Time elapsed: 0.334 sec
[java] [junit] ------------- Standard Output ---------------
[java] [junit] EMMA: collecting runtime coverage data ...
[java] [junit] ------------- ---------------- ---------------
[java] [junit] Testcase: testConstructor took 0.066 sec
[java] [junit] Testcase: testSetGet took 0.002 sec
[java] [junit] Running org.jboss.soa.esb.addressing.helpers.tests.HTTPUnitTest
[java] [junit] Tests run: 2, Failures: 0, Errors: 0, Time elapsed: 0.37 sec
[java] [junit] Testsuite: org.jboss.soa.esb.addressing.helpers.tests.HTTPUnitTest
[java] [junit] Tests run: 2, Failures: 0, Errors: 0, Time elapsed: 0.37 sec
[java] [junit] ------------- Standard Output ---------------
[java] [junit] EMMA: collecting runtime coverage data ...
[java] [junit] ------------- ---------------- ---------------
[java] [junit] Testcase: testConstructor took 0.075 sec
[java] [junit] Testcase: testSetGet took 0.001 sec
[java] [junit] Running org.jboss.soa.esb.addressing.helpers.tests.JDBCUnitTest
[java] [junit] Tests run: 2, Failures: 0, Errors: 0, Time elapsed: 0.355 sec
[java] [junit] Testsuite: org.jboss.soa.esb.addressing.helpers.tests.JDBCUnitTest
[java] [junit] Tests run: 2, Failures: 0, Errors: 0, Time elapsed: 0.355 sec
[java] [junit] ------------- Standard Output ---------------
[java] [junit] EMMA: collecting runtime coverage data ...
[java] [junit] ------------- ---------------- ---------------
[java] [junit] Testcase: testConstructor took 0.1 sec
[java] [junit] Testcase: testSetGet took 0.001 sec
[java] [junit] Running org.jboss.soa.esb.addressing.helpers.tests.JMSUnitTest
[java] [junit] Tests run: 2, Failures: 0, Errors: 0, Time elapsed: 0.298 sec
[java] [junit] Testsuite: org.jboss.soa.esb.addressing.helpers.tests.JMSUnitTest
[java] [junit] Tests run: 2, Failures: 0, Errors: 0, Time elapsed: 0.298 sec
[java] [junit] ------------- Standard Output ---------------
[java] [junit] EMMA: collecting runtime coverage data ...
[java] [junit] ------------- ---------------- ---------------
[java] [junit] Testcase: testConstructor took 0.062 sec
[java] [junit] Testcase: testSetGet took 0 sec
[java] [junit] Running org.jboss.soa.esb.addressing.tests.CallUnitTest
[java] [junit] Tests run: 9, Failures: 0, Errors: 0, Time elapsed: 0.324 sec
[java] [junit] Testsuite: org.jboss.soa.esb.addressing.tests.CallUnitTest
[java] [junit] Tests run: 9, Failures: 0, Errors: 0, Time elapsed: 0.324 sec
[java] [junit] ------------- Standard Output ---------------
[java] [junit] EMMA: collecting runtime coverage data ...
[java] [junit] ------------- ---------------- ---------------
[java] [junit] Testcase: testConstructor took 0.072 sec
[java] [junit] Testcase: testEPRConstructor took 0.005 sec
[java] [junit] Testcase: testSetGetTo took 0 sec
[java] [junit] Testcase: testSetGetFrom took 0 sec
[java] [junit] Testcase: testSetGetReplyTo took 0 sec
[java] [junit] Testcase: testSetGetFaultTo took 0 sec
[java] [junit] Testcase: testSetGetRelatesTo took 0 sec
[java] [junit] Testcase: testSetGetAction took 0 sec
[java] [junit] Testcase: testSetGetMessageID took 0 sec
[java] [junit] Running org.jboss.soa.esb.addressing.tests.EPRUnitTest
[java] [junit] Tests run: 7, Failures: 0, Errors: 0, Time elapsed: 0.161 sec
[java] [junit] Testsuite: org.jboss.soa.esb.addressing.tests.EPRUnitTest
[java] [junit] Tests run: 7, Failures: 0, Errors: 0, Time elapsed: 0.161 sec
[java] [junit] ------------- Standard Output ---------------
[java] [junit] EMMA: collecting runtime coverage data ...
[java] [junit] ------------- ---------------- ---------------
[java] [junit] Testcase: testConstructor took 0.112 sec
[java] [junit] Testcase: testPortReferenceConstructor took 0 sec
[java] [junit] Testcase: testURIConstructor took 0.003 sec
[java] [junit] Testcase: testGetAddr took 0 sec
[java] [junit] Testcase: testSetAddr took 0 sec
[java] [junit] Testcase: testToFromXML took 0.032 sec
[java] [junit] Testcase: testEquals took 0.001 sec
[java] [junit] Running org.jboss.soa.esb.addressing.util.tests.EPRHelperUnitTest
[java] [junit] Tests run: 1, Failures: 0, Errors: 0, Time elapsed: 0.187 sec
[java] [junit] Testsuite: org.jboss.soa.esb.addressing.util.tests.EPRHelperUnitTest
[java] [junit] Tests run: 1, Failures: 0, Errors: 0, Time elapsed: 0.187 sec
[java] [junit] ------------- Standard Output ---------------
[java] [junit] EMMA: collecting runtime coverage data ...
[java] [junit] ------------- ---------------- ---------------
[java] [junit] Testcase: testToFromXMLString took 0.174 sec
[java] [junit] Running org.jboss.soa.esb.addressing.util.tests.EPRManagerUnitTest
[java] [junit] Tests run: 3, Failures: 0, Errors: 0, Time elapsed: 0.206 sec
[java] [junit] Testsuite: org.jboss.soa.esb.addressing.util.tests.EPRManagerUnitTest
[java] [junit] Tests run: 3, Failures: 0, Errors: 0, Time elapsed: 0.206 sec
[java] [junit] ------------- Standard Output ---------------
[java] [junit] EMMA: collecting runtime coverage data ...
[java] [junit] ------------- ---------------- ---------------
[java] [junit] Testcase: testCreate took 0.089 sec
[java] [junit] Testcase: testInputOutput took 0.065 sec
[java] [junit] Testcase: testSpecificInputOutput took 0.035 sec
[java] [junit] Running org.jboss.soa.esb.command.InMemoryCommandQueueUnitTest
[java] [junit] Tests run: 3, Failures: 0, Errors: 0, Time elapsed: 1.071 sec
[java] [junit] Testsuite: org.jboss.soa.esb.command.InMemoryCommandQueueUnitTest
[java] [junit] Tests run: 3, Failures: 0, Errors: 0, Time elapsed: 1.071 sec
[java] [junit] ------------- Standard Output ---------------
[java] [junit] EMMA: collecting runtime coverage data ...
[java] [junit] ------------- ---------------- ---------------
[java] [junit] Testcase: test_args took 0.267 sec
[java] [junit] Testcase: test_queue_open_close took 0 sec
[java] [junit] Testcase: test_queue_receive took 0.622 sec
[java] [junit] Running org.jboss.soa.esb.common.tests.propertymanager.PropertyManagerUnitTest
[java] [junit] Tests run: 1, Failures: 0, Errors: 0, Time elapsed: 0.332 sec
[java] [junit] Testsuite: org.jboss.soa.esb.common.tests.propertymanager.PropertyManagerUnitTest
[java] [junit] Tests run: 1, Failures: 0, Errors: 0, Time elapsed: 0.332 sec
[java] [junit] ------------- Standard Output ---------------
[java] [junit] Properties loaded (jbossesb-test-properties.xml):
[java] [junit] org.jboss.soa.esb.jndi.server.context.factory=foobar
[java] [junit] org.jboss.soa.esb.objStore.configFile=file:config.xml
[java] [junit] Properties loaded (jbossesb-test-properties.xml):
[java] [junit] org.jboss.soa.esb.mail.smtp.host=thishost
[java] [junit] Properties loaded (jbossesb-test-properties.xml):
[java] [junit] org.jboss.soa.esb.jndi.server.context.factory=foobar
[java] [junit] org.jboss.soa.esb.objStore.configFile=file:config.xml
[java] [junit] Properties loaded (jbossesb-test-properties.xml):
[java] [junit] org.jboss.soa.esb.mail.smtp.host=thishost
[java] [junit] ------------- ---------------- ---------------
[java] [junit] Testcase: testPropertyManager took 0.324 sec
[java] [junit] Running org.jboss.soa.esb.helpers.AppServerContextUnitTest
[java] [junit] Tests run: 1, Failures: 0, Errors: 1, Time elapsed: 55.165 sec
[java] [junit] Testsuite: org.jboss.soa.esb.helpers.AppServerContextUnitTest
[java] [junit] Tests run: 1, Failures: 0, Errors: 1, Time elapsed: 55.165 sec
[java] [junit] ------------- Standard Output ---------------
[java] [junit] EMMA: collecting runtime coverage data ...
[java] [junit] ------------- ---------------- ---------------
[java] [junit] Testcase: test_AppServerContext took 55.144 sec
[java] [junit] Caused an ERROR
[java] [junit] java.lang.StackOverflowError
[java] [junit] java.lang.ClassCastException: java.lang.StackOverflowError
[java] [junit] at org.jboss.ha.framework.server.HARMIServerImpl.invoke(HARMIServerImpl.java:222)
[java] [junit] at sun.rmi.server.UnicastServerRef.dispatch(UnicastServerRef.java:294)
[java] [junit] at sun.rmi.transport.Transport$1.run(Transport.java:153)
[java] [junit] at java.security.AccessController.doPrivileged(Native Method)
[java] [junit] at sun.rmi.transport.Transport.serviceCall(Transport.java:149)
[java] [junit] at sun.rmi.transport.tcp.TCPTransport.handleMessages(TCPTransport.java:466)
[java] [junit] at sun.rmi.transport.tcp.TCPTransport$ConnectionHandler.run(TCPTransport.java:707)
[java] [junit] at java.lang.Thread.run(Thread.java:595)
[java] [junit] at sun.rmi.transport.StreamRemoteCall.exceptionReceivedFromServer(StreamRemoteCall.java:247)
[java] [junit] at sun.rmi.transport.StreamRemoteCall.executeCall(StreamRemoteCall.java:223)
[java] [junit] at sun.rmi.server.UnicastRef.invoke(UnicastRef.java:126)
[java] [junit] at org.jboss.ha.framework.server.HARMIServerImpl_Stub.invoke(Unknown Source)
[java] [junit] at org.jboss.ha.framework.interfaces.HARMIClient.invokeRemote(HARMIClient.java:172)
[java] [junit] at org.jboss.ha.framework.interfaces.HARMIClient.invoke(HARMIClient.java:267)
[java] [junit] at $Proxy0.list(Unknown Source)
[java] [junit] at org.jnp.interfaces.NamingContext.list(NamingContext.java:800)
[java] [junit] at org.jnp.interfaces.NamingContext.list(NamingContext.java:786)
[java] [junit] at javax.naming.InitialContext.list(InitialContext.java:395)
[java] [junit] at org.jboss.soa.esb.helpers.NamingContext.getServerContext(NamingContext.java:66)
[java] [junit] at org.jboss.soa.esb.helpers.AppServerContextUnitTest.test_AppServerContext(AppServerContextUnitTest.java:47)
[java] BUILD FAILED
[java] /qa/services/hudson/hudson_workspace/workspace/jboss-esb-linux/trunk/product/build.xml:161: The following error occurred while executing this line:
[java] /qa/services/hudson/hudson_workspace/workspace/jboss-esb-linux/trunk/product/rosetta/build.xml:86: The following error occurred while executing this line:
[java] /qa/services/hudson/hudson_workspace/workspace/jboss-esb-linux/trunk/product/rosetta/tests/build.xml:166: The following error occurred while executing this line:
[java] /qa/services/hudson/hudson_workspace/workspace/jboss-esb-linux/trunk/product/rosetta/tests/build.xml:190: Test org.jboss.soa.esb.helpers.AppServerContextUnitTest failed
[java] Total time: 2 minutes 56 seconds
[java] Java Result: 1
esb.init-app-server:
esb.init-esb-server:
esb.init-ftp-server:
esb.init:
stop-server:
[echo] Stopping local ESB server
[java] Shutdown message has been posted to the server.
[java] Server shutdown may take a while - check logfiles for completion
[echo] Waiting for ESB server to stop...
BUILD FAILED
/qa/services/hudson/hudson_workspace/workspace/jboss-esb-linux/trunk/integration-build.xml:5: The following error occurred while executing this line:
/qa/services/hudson/hudson_workspace/workspace/jboss-esb-linux/trunk/product/build.xml:463: Product Unit Test failure
Total time: 3 minutes 49 seconds
Recording test results
Recording Emma reports trunk/product/build/tests/coverage/coverage.xml
17 years, 6 months