Build failed in Hudson: JBoss-AS-5.0.x #950
by jboss-qa-internal@redhat.com
See https://hudson.jboss.org/hudson/job/JBoss-AS-5.0.x/950/changes
Changes:
[dimitris(a)jboss.org] onto microcontainer 2.0.0.Beta10
------------------------------------------
[...truncated 22355 lines...]
[get-lgpl] last modified = Mon Apr 09 12:21:59 EDT 2007
[get-nekohtml] Getting: http://repository.jboss.com/licenses/nekohtml.txt
[get-nekohtml] To: /qa/services/hudson/hudson_workspace/workspace/JBoss-AS-5.0.x/trunk/build/../thirdparty/licenses/nekohtml.txt
[get-nekohtml] .
[get-nekohtml] last modified = Mon Apr 09 12:21:59 EDT 2007
[get-apache-2.0] Getting: http://repository.jboss.com/licenses/apache-2.0.txt
[get-apache-2.0] To: /qa/services/hudson/hudson_workspace/workspace/JBoss-AS-5.0.x/trunk/build/../thirdparty/licenses/apache-2.0.txt
[get-apache-2.0] ....
[get-apache-2.0] last modified = Mon Apr 09 12:21:59 EDT 2007
[get-sun-xacml] Getting: http://repository.jboss.com/licenses/sun-xacml.txt
[get-sun-xacml] To: /qa/services/hudson/hudson_workspace/workspace/JBoss-AS-5.0.x/trunk/build/../thirdparty/licenses/sun-xacml.txt
[get-sun-xacml] .
[get-sun-xacml] last modified = Mon Apr 09 12:21:59 EDT 2007
[get-oswego] Getting: http://repository.jboss.com/licenses/oswego.txt
[get-oswego] To: /qa/services/hudson/hudson_workspace/workspace/JBoss-AS-5.0.x/trunk/build/../thirdparty/licenses/oswego.txt
[get-oswego] .
[get-oswego] last modified = Mon Apr 09 12:21:59 EDT 2007
[get-xdoclet] Getting: http://repository.jboss.com/licenses/xdoclet.txt
[get-xdoclet] To: /qa/services/hudson/hudson_workspace/workspace/JBoss-AS-5.0.x/trunk/build/../thirdparty/licenses/xdoclet.txt
[get-xdoclet] .
[get-xdoclet] last modified = Mon Apr 09 12:21:59 EDT 2007
[get-easymock] Getting: http://repository.jboss.com/licenses/easymock.txt
[get-easymock] To: /qa/services/hudson/hudson_workspace/workspace/JBoss-AS-5.0.x/trunk/build/../thirdparty/licenses/easymock.txt
[get-easymock] .
[get-easymock] last modified = Mon Apr 09 12:21:59 EDT 2007
[get-dom4j] Getting: http://repository.jboss.com/licenses/dom4j.txt
[get-dom4j] To: /qa/services/hudson/hudson_workspace/workspace/JBoss-AS-5.0.x/trunk/build/../thirdparty/licenses/dom4j.txt
[get-dom4j] .
[get-dom4j] last modified = Mon Apr 09 12:21:59 EDT 2007
[get-sleepycat] Getting: http://repository.jboss.com/licenses/sleepycat.txt
[get-sleepycat] To: /qa/services/hudson/hudson_workspace/workspace/JBoss-AS-5.0.x/trunk/build/../thirdparty/licenses/sleepycat.txt
[get-sleepycat] .
[get-sleepycat] last modified = Mon Apr 09 12:21:59 EDT 2007
[get-antlr] Getting: http://repository.jboss.com/licenses/antlr.txt
[get-antlr] To: /qa/services/hudson/hudson_workspace/workspace/JBoss-AS-5.0.x/trunk/build/../thirdparty/licenses/antlr.txt
[get-antlr] .
[get-antlr] last modified = Mon Apr 09 12:21:59 EDT 2007
[get-license-info.xml] Getting: http://repository.jboss.com/licenses/license-info.xml
[get-license-info.xml] To: /qa/services/hudson/hudson_workspace/workspace/JBoss-AS-5.0.x/trunk/build/../thirdparty/licenses/license-info.xml
[get-license-info.xml] .....
[get-license-info.xml] last modified = Mon Apr 09 12:21:59 EDT 2007
[mkdir] Created dir: /qa/services/hudson/hudson_workspace/workspace/JBoss-AS-5.0.x/trunk/thirdparty/apache-maven-ant-tasks
[get] Getting: http://repository.jboss.com/apache-maven-ant-tasks/2.0.8/component-info.xml
[get] To: /qa/services/hudson/hudson_workspace/workspace/JBoss-AS-5.0.x/trunk/thirdparty/apache-maven-ant-tasks/component-info.xml
[synchronizeinfo] .
[get] last modified = Tue Jan 22 11:16:43 EST 2008
[mkdir] Created dir: /qa/services/hudson/hudson_workspace/workspace/JBoss-AS-5.0.x/trunk/thirdparty/httpunit
[get] Getting: http://repository.jboss.com/httpunit/1.6/component-info.xml
[get] To: /qa/services/hudson/hudson_workspace/workspace/JBoss-AS-5.0.x/trunk/thirdparty/httpunit/component-info.xml
[synchronizeinfo] .
[get] last modified = Mon Apr 09 12:19:42 EDT 2007
[synchronizeinfo] [0]: apache-maven-ant-tasks
[synchronizeinfo] [1]: httpunit
synchronize.main:
synchronize.apache-maven-ant-tasks:
[get] Getting: http://repository.jboss.com/apache-maven-ant-tasks/2.0.8/component-info.xml
[get] To: /qa/services/hudson/hudson_workspace/workspace/JBoss-AS-5.0.x/trunk/thirdparty/apache-maven-ant-tasks/component-info.xml
[get] local file date : Tue Jan 22 11:16:43 EST 2008
[get] Not modified - so not downloaded
synchronize.apache-maven-ant-tasks.maven-ant-tasks.jar:
[mkdir] Created dir: /qa/services/hudson/hudson_workspace/workspace/JBoss-AS-5.0.x/trunk/thirdparty/apache-maven-ant-tasks/lib
[get] Getting: http://repository.jboss.com/apache-maven-ant-tasks/2.0.8/lib/maven-ant-ta...
[get] To: /qa/services/hudson/hudson_workspace/workspace/JBoss-AS-5.0.x/trunk/thirdparty/apache-maven-ant-tasks/lib/maven-ant-tasks.jar
[get] ....................................................
[get] ....................................................
[get] ....................................................
[get] ....................................................
[get] ....................................................
[get] ....................................................
[get] ....................................................
[get] ....................................................
[get] ....................................................
[get] ....................................................
[get] ....................................................
[get] ....................................................
[get] ...........
[get] last modified = Tue Jan 22 11:16:43 EST 2008
synchronize.httpunit:
[get] Getting: http://repository.jboss.com/httpunit/1.6/component-info.xml
[get] To: /qa/services/hudson/hudson_workspace/workspace/JBoss-AS-5.0.x/trunk/thirdparty/httpunit/component-info.xml
[get] local file date : Mon Apr 09 12:19:42 EDT 2007
[get] Not modified - so not downloaded
synchronize.httpunit.httpunit.jar:
[mkdir] Created dir: /qa/services/hudson/hudson_workspace/workspace/JBoss-AS-5.0.x/trunk/thirdparty/httpunit/lib
[get] Getting: http://repository.jboss.com/httpunit/1.6/lib/httpunit.jar
[get] To: /qa/services/hudson/hudson_workspace/workspace/JBoss-AS-5.0.x/trunk/thirdparty/httpunit/lib/httpunit.jar
[get] ....................................................
[get] ....................................................
[get] ....................................................
[get] ....................................................
[get] ....................................................
[get] .........
[get] last modified = Mon Apr 09 12:19:42 EDT 2007
synchronize.components:
synchronize:
generate-lib-file:
_buildmagic:init:
Trying to override old definition of task property
_buildmagic:init:local-properties:
[copy] Copying 1 file to /qa/services/hudson/hudson_workspace/workspace/JBoss-AS-5.0.x/trunk/build
_buildmagic:init:buildlog:
configure:
[echo] groups: default
[echo] modules: main,bootstrap,j2se,mbeans,jmx,system,system-jmx,naming,security,server,deployment,jbossas/remoting,jmx-remoting,jbossas/jmx-remoting,messaging,jbossmq,cluster,varia,iiop,aspects,profileservice,connector,management,ejb3,tomcat,webservices,hibernate-int,console,spring-int
init:
_buildmagic:modules:most:
======================================================================
== Executing 'most' in module 'main'...
==
_buildmagic:init:
configure:
[echo] Classpath = /qa/services/hudson/hudson_workspace/workspace/JBoss-AS-5.0.x/trunk/thirdparty/gnu-getopt/lib/getopt.jar
_default:task-init:
init:
_buildmagic:build-bypass-checker:
_buildmagic:build-bypass-notice:
_buildmagic:build-bypass-check:
jars:
_buildmagic:init:
init:
_default:compile-classes:
[mkdir] Created dir: /qa/services/hudson/hudson_workspace/workspace/JBoss-AS-5.0.x/trunk/main/output/classes
[mkdir] Created dir: /qa/services/hudson/hudson_workspace/workspace/JBoss-AS-5.0.x/trunk/main/output/gen-src
[javac] Compiling 9 source files to /qa/services/hudson/hudson_workspace/workspace/JBoss-AS-5.0.x/trunk/main/output/classes
[execmodules] /qa/services/hudson/hudson_workspace/workspace/JBoss-AS-5.0.x/trunk/main/src/main/org/jboss/system/ORBSingleton.java:172: warning: [deprecation] create_recursive_sequence_tc(int,int) in org.omg.CORBA.ORB has been deprecated
[execmodules] public TypeCode create_recursive_sequence_tc(int bound, int offset)
[execmodules] ^
[execmodules] /qa/services/hudson/hudson_workspace/workspace/JBoss-AS-5.0.x/trunk/main/src/main/org/jboss/system/ORBSingleton.java:172: warning: [deprecation] create_recursive_sequence_tc(int,int) in org.omg.CORBA.ORB has been deprecated
[execmodules] public TypeCode create_recursive_sequence_tc(int bound, int offset)
[execmodules] ^
[execmodules] /qa/services/hudson/hudson_workspace/workspace/JBoss-AS-5.0.x/trunk/main/src/main/org/jboss/system/ORBSingleton.java:285: warning: [deprecation] get_current() in org.omg.CORBA.ORB has been deprecated
[execmodules] public Current get_current()
[execmodules] ^
[execmodules] 3 warnings
_default:compile-resources:
[mkdir] Created dir: /qa/services/hudson/hudson_workspace/workspace/JBoss-AS-5.0.x/trunk/main/output/resources
[copy] Copying 4 files to /qa/services/hudson/hudson_workspace/workspace/JBoss-AS-5.0.x/trunk/main/output/resources
_default:compile-etc:
[mkdir] Created dir: /qa/services/hudson/hudson_workspace/workspace/JBoss-AS-5.0.x/trunk/main/output/etc
[copy] Copying 2 files to /qa/services/hudson/hudson_workspace/workspace/JBoss-AS-5.0.x/trunk/main/output/etc
_default:compile-bin:
[mkdir] Created dir: /qa/services/hudson/hudson_workspace/workspace/JBoss-AS-5.0.x/trunk/main/output/bin
[copy] Copying 6 files to /qa/services/hudson/hudson_workspace/workspace/JBoss-AS-5.0.x/trunk/main/output/bin
_buildmagic:init:
init:
_default:fix-bin:
compile:
[mkdir] Created dir: /qa/services/hudson/hudson_workspace/workspace/JBoss-AS-5.0.x/trunk/main/output/lib
module-jars:
[jar] Building jar: /qa/services/hudson/hudson_workspace/workspace/JBoss-AS-5.0.x/trunk/main/output/lib/log4j-boot.jar
[jar] Building jar: /qa/services/hudson/hudson_workspace/workspace/JBoss-AS-5.0.x/trunk/main/output/lib/jboss-main.jar
[jar] Building jar: /qa/services/hudson/hudson_workspace/workspace/JBoss-AS-5.0.x/trunk/main/output/lib/jboss-main-client.jar
[jar] Building jar: /qa/services/hudson/hudson_workspace/workspace/JBoss-AS-5.0.x/trunk/main/output/lib/run.jar
[touch] Creating /qa/services/hudson/hudson_workspace/workspace/JBoss-AS-5.0.x/trunk/main/output/build-marker
most:
==
== Finished with 'most' in module 'main'.
======================================================================
_module-main-most:
_module-main-most:
[mkdir] Created dir: /qa/services/hudson/hudson_workspace/workspace/JBoss-AS-5.0.x/trunk/build/output/jboss-5.0.0.Beta4/lib
[copy] Copying 2 files to /qa/services/hudson/hudson_workspace/workspace/JBoss-AS-5.0.x/trunk/build/output/jboss-5.0.0.Beta4/lib
[mkdir] Created dir: /qa/services/hudson/hudson_workspace/workspace/JBoss-AS-5.0.x/trunk/build/output/jboss-5.0.0.Beta4/client
[copy] Copying 1 file to /qa/services/hudson/hudson_workspace/workspace/JBoss-AS-5.0.x/trunk/build/output/jboss-5.0.0.Beta4/client
[mkdir] Created dir: /qa/services/hudson/hudson_workspace/workspace/JBoss-AS-5.0.x/trunk/build/output/jboss-5.0.0.Beta4/bin
[copy] Copying 7 files to /qa/services/hudson/hudson_workspace/workspace/JBoss-AS-5.0.x/trunk/build/output/jboss-5.0.0.Beta4/bin
[copy] Copying 1 file to /qa/services/hudson/hudson_workspace/workspace/JBoss-AS-5.0.x/trunk/build/output/jboss-5.0.0.Beta4/lib
[copy] Copying 1 file to /qa/services/hudson/hudson_workspace/workspace/JBoss-AS-5.0.x/trunk/build/output/jboss-5.0.0.Beta4/server/all/lib
[copy] Copying 1 file to /qa/services/hudson/hudson_workspace/workspace/JBoss-AS-5.0.x/trunk/build/output/jboss-5.0.0.Beta4/server/all/lib
[copy] Copying 2 files to /qa/services/hudson/hudson_workspace/workspace/JBoss-AS-5.0.x/trunk/build/output/jboss-5.0.0.Beta4/client
======================================================================
== Executing 'most' in module 'bootstrap'...
==
_buildmagic:init:
configure:
Overriding previous definition of reference to jboss.test.classpath
_default:task-init:
init:
_buildmagic:build-bypass-checker:
_buildmagic:build-bypass-notice:
_buildmagic:build-bypass-check:
jars:
_buildmagic:init:
init:
_default:compile-classes:
[mkdir] Created dir: /qa/services/hudson/hudson_workspace/workspace/JBoss-AS-5.0.x/trunk/bootstrap/output/classes
[mkdir] Created dir: /qa/services/hudson/hudson_workspace/workspace/JBoss-AS-5.0.x/trunk/bootstrap/output/gen-src
[javac] Compiling 5 source files to /qa/services/hudson/hudson_workspace/workspace/JBoss-AS-5.0.x/trunk/bootstrap/output/classes
An exception has occurred in the compiler (1.5.0_12). Please file a bug at the Java Developer Connection (http://java.sun.com/webapps/bugreport) after checking the Bug Parade for duplicates. Include your program and the following diagnostic in your report. Thank you.
com.sun.tools.javac.code.Symbol$CompletionFailure: file javax/xml/bind/annotation/XmlNsForm.class not found
BUILD FAILED
/qa/services/hudson/hudson_workspace/workspace/JBoss-AS-5.0.x/trunk/tools/etc/buildmagic/buildmagic.ent:442: Compile failed; see the compiler error output for details.
Total time: 39 seconds
Deleting old artifacts from #948
Recording fingerprints
Build was marked for publishing on https://hudson.jboss.org/hudson/
finished: FAILURE
17 years, 1 month
Build failed in Hudson: JBoss-AS-5.0.x-TestSuite-sun15 #333
by jboss-qa-internal@redhat.com
See https://hudson.jboss.org/hudson/job/JBoss-AS-5.0.x-TestSuite-sun15/333/ch...
Changes:
[dimitris(a)jboss.org] onto microcontainer 2.0.0.Beta10
[adrian(a)jboss.org] [JBAS-5171] - Redundant == true :-)
[adrian(a)jboss.org] [JBAS-5171] - Always enforce transaction affinity for local transactions
------------------------------------------
[...truncated 22401 lines...]
[get-nekohtml] Getting: http://repository.jboss.com/licenses/nekohtml.txt
[get-nekohtml] To: /qa/services/hudson/hudson_workspace/workspace/JBoss-AS-5.0.x-TestSuite-sun15/trunk/build/../thirdparty/licenses/nekohtml.txt
[get-nekohtml] .
[get-nekohtml] last modified = Mon Apr 09 12:21:59 EDT 2007
[get-apache-2.0] Getting: http://repository.jboss.com/licenses/apache-2.0.txt
[get-apache-2.0] To: /qa/services/hudson/hudson_workspace/workspace/JBoss-AS-5.0.x-TestSuite-sun15/trunk/build/../thirdparty/licenses/apache-2.0.txt
[get-apache-2.0] ........
[get-apache-2.0] last modified = Mon Apr 09 12:21:59 EDT 2007
[get-sun-xacml] Getting: http://repository.jboss.com/licenses/sun-xacml.txt
[get-sun-xacml] To: /qa/services/hudson/hudson_workspace/workspace/JBoss-AS-5.0.x-TestSuite-sun15/trunk/build/../thirdparty/licenses/sun-xacml.txt
[get-sun-xacml] .
[get-sun-xacml] last modified = Mon Apr 09 12:21:59 EDT 2007
[get-oswego] Getting: http://repository.jboss.com/licenses/oswego.txt
[get-oswego] To: /qa/services/hudson/hudson_workspace/workspace/JBoss-AS-5.0.x-TestSuite-sun15/trunk/build/../thirdparty/licenses/oswego.txt
[get-oswego] .
[get-oswego] last modified = Mon Apr 09 12:21:59 EDT 2007
[get-xdoclet] Getting: http://repository.jboss.com/licenses/xdoclet.txt
[get-xdoclet] To: /qa/services/hudson/hudson_workspace/workspace/JBoss-AS-5.0.x-TestSuite-sun15/trunk/build/../thirdparty/licenses/xdoclet.txt
[get-xdoclet] .
[get-xdoclet] last modified = Mon Apr 09 12:21:59 EDT 2007
[get-easymock] Getting: http://repository.jboss.com/licenses/easymock.txt
[get-easymock] To: /qa/services/hudson/hudson_workspace/workspace/JBoss-AS-5.0.x-TestSuite-sun15/trunk/build/../thirdparty/licenses/easymock.txt
[get-easymock] .
[get-easymock] last modified = Mon Apr 09 12:21:59 EDT 2007
[get-dom4j] Getting: http://repository.jboss.com/licenses/dom4j.txt
[get-dom4j] To: /qa/services/hudson/hudson_workspace/workspace/JBoss-AS-5.0.x-TestSuite-sun15/trunk/build/../thirdparty/licenses/dom4j.txt
[get-dom4j] .
[get-dom4j] last modified = Mon Apr 09 12:21:59 EDT 2007
[get-sleepycat] Getting: http://repository.jboss.com/licenses/sleepycat.txt
[get-sleepycat] To: /qa/services/hudson/hudson_workspace/workspace/JBoss-AS-5.0.x-TestSuite-sun15/trunk/build/../thirdparty/licenses/sleepycat.txt
[get-sleepycat] .
[get-sleepycat] last modified = Mon Apr 09 12:21:59 EDT 2007
[get-antlr] Getting: http://repository.jboss.com/licenses/antlr.txt
[get-antlr] To: /qa/services/hudson/hudson_workspace/workspace/JBoss-AS-5.0.x-TestSuite-sun15/trunk/build/../thirdparty/licenses/antlr.txt
[get-antlr] .
[get-antlr] last modified = Mon Apr 09 12:21:59 EDT 2007
[get-license-info.xml] Getting: http://repository.jboss.com/licenses/license-info.xml
[get-license-info.xml] To: /qa/services/hudson/hudson_workspace/workspace/JBoss-AS-5.0.x-TestSuite-sun15/trunk/build/../thirdparty/licenses/license-info.xml
[get-license-info.xml] ........
[get-license-info.xml] last modified = Mon Apr 09 12:21:59 EDT 2007
[mkdir] Created dir: /qa/services/hudson/hudson_workspace/workspace/JBoss-AS-5.0.x-TestSuite-sun15/trunk/thirdparty/apache-maven-ant-tasks
[get] Getting: http://repository.jboss.com/apache-maven-ant-tasks/2.0.8/component-info.xml
[get] To: /qa/services/hudson/hudson_workspace/workspace/JBoss-AS-5.0.x-TestSuite-sun15/trunk/thirdparty/apache-maven-ant-tasks/component-info.xml
[synchronizeinfo] .
[get] last modified = Tue Jan 22 11:16:43 EST 2008
[mkdir] Created dir: /qa/services/hudson/hudson_workspace/workspace/JBoss-AS-5.0.x-TestSuite-sun15/trunk/thirdparty/httpunit
[get] Getting: http://repository.jboss.com/httpunit/1.6/component-info.xml
[get] To: /qa/services/hudson/hudson_workspace/workspace/JBoss-AS-5.0.x-TestSuite-sun15/trunk/thirdparty/httpunit/component-info.xml
[synchronizeinfo] .
[get] last modified = Mon Apr 09 12:19:42 EDT 2007
[synchronizeinfo] [0]: apache-maven-ant-tasks
[synchronizeinfo] [1]: httpunit
synchronize.main:
synchronize.apache-maven-ant-tasks:
[get] Getting: http://repository.jboss.com/apache-maven-ant-tasks/2.0.8/component-info.xml
[get] To: /qa/services/hudson/hudson_workspace/workspace/JBoss-AS-5.0.x-TestSuite-sun15/trunk/thirdparty/apache-maven-ant-tasks/component-info.xml
[get] local file date : Tue Jan 22 11:16:43 EST 2008
[get] Not modified - so not downloaded
synchronize.apache-maven-ant-tasks.maven-ant-tasks.jar:
[mkdir] Created dir: /qa/services/hudson/hudson_workspace/workspace/JBoss-AS-5.0.x-TestSuite-sun15/trunk/thirdparty/apache-maven-ant-tasks/lib
[get] Getting: http://repository.jboss.com/apache-maven-ant-tasks/2.0.8/lib/maven-ant-ta...
[get] To: /qa/services/hudson/hudson_workspace/workspace/JBoss-AS-5.0.x-TestSuite-sun15/trunk/thirdparty/apache-maven-ant-tasks/lib/maven-ant-tasks.jar
[get] ....................................................
[get] ....................................................
[get] ....................................................
[get] ....................................................
[get] ....................................................
[get] ....................................................
[get] ....................................................
[get] ....................................................
[get] ....................................................
[get] ....................................................
[get] ....................................................
[get] ....................................................
[get] ......................
[get] last modified = Tue Jan 22 11:16:43 EST 2008
synchronize.httpunit:
[get] Getting: http://repository.jboss.com/httpunit/1.6/component-info.xml
[get] To: /qa/services/hudson/hudson_workspace/workspace/JBoss-AS-5.0.x-TestSuite-sun15/trunk/thirdparty/httpunit/component-info.xml
[get] local file date : Mon Apr 09 12:19:42 EDT 2007
[get] Not modified - so not downloaded
synchronize.httpunit.httpunit.jar:
[mkdir] Created dir: /qa/services/hudson/hudson_workspace/workspace/JBoss-AS-5.0.x-TestSuite-sun15/trunk/thirdparty/httpunit/lib
[get] Getting: http://repository.jboss.com/httpunit/1.6/lib/httpunit.jar
[get] To: /qa/services/hudson/hudson_workspace/workspace/JBoss-AS-5.0.x-TestSuite-sun15/trunk/thirdparty/httpunit/lib/httpunit.jar
[get] ....................................................
[get] ....................................................
[get] ....................................................
[get] ....................................................
[get] ....................................................
[get] .................
[get] last modified = Mon Apr 09 12:19:42 EDT 2007
synchronize.components:
synchronize:
generate-lib-file:
_buildmagic:init:
Trying to override old definition of task property
_buildmagic:init:local-properties:
[copy] Copying 1 file to /qa/services/hudson/hudson_workspace/workspace/JBoss-AS-5.0.x-TestSuite-sun15/trunk/build
_buildmagic:init:buildlog:
configure:
[echo] groups: default
[echo] modules: main,bootstrap,j2se,mbeans,jmx,system,system-jmx,naming,security,server,deployment,jbossas/remoting,jmx-remoting,jbossas/jmx-remoting,messaging,jbossmq,cluster,varia,iiop,aspects,profileservice,connector,management,ejb3,tomcat,webservices,hibernate-int,console,spring-int
init:
_buildmagic:modules:most:
======================================================================
== Executing 'most' in module 'main'...
==
_buildmagic:init:
configure:
[echo] Classpath = /qa/services/hudson/hudson_workspace/workspace/JBoss-AS-5.0.x-TestSuite-sun15/trunk/thirdparty/gnu-getopt/lib/getopt.jar
_default:task-init:
init:
_buildmagic:build-bypass-checker:
_buildmagic:build-bypass-notice:
_buildmagic:build-bypass-check:
jars:
_buildmagic:init:
init:
_default:compile-classes:
[mkdir] Created dir: /qa/services/hudson/hudson_workspace/workspace/JBoss-AS-5.0.x-TestSuite-sun15/trunk/main/output/classes
[mkdir] Created dir: /qa/services/hudson/hudson_workspace/workspace/JBoss-AS-5.0.x-TestSuite-sun15/trunk/main/output/gen-src
[javac] Compiling 9 source files to /qa/services/hudson/hudson_workspace/workspace/JBoss-AS-5.0.x-TestSuite-sun15/trunk/main/output/classes
[execmodules] /qa/services/hudson/hudson_workspace/workspace/JBoss-AS-5.0.x-TestSuite-sun15/trunk/main/src/main/org/jboss/system/ORBSingleton.java:172: warning: [deprecation] create_recursive_sequence_tc(int,int) in org.omg.CORBA.ORB has been deprecated
[execmodules] public TypeCode create_recursive_sequence_tc(int bound, int offset)
[execmodules] ^
[execmodules] /qa/services/hudson/hudson_workspace/workspace/JBoss-AS-5.0.x-TestSuite-sun15/trunk/main/src/main/org/jboss/system/ORBSingleton.java:172: warning: [deprecation] create_recursive_sequence_tc(int,int) in org.omg.CORBA.ORB has been deprecated
[execmodules] public TypeCode create_recursive_sequence_tc(int bound, int offset)
[execmodules] ^
[execmodules] /qa/services/hudson/hudson_workspace/workspace/JBoss-AS-5.0.x-TestSuite-sun15/trunk/main/src/main/org/jboss/system/ORBSingleton.java:285: warning: [deprecation] get_current() in org.omg.CORBA.ORB has been deprecated
[execmodules] public Current get_current()
[execmodules] ^
[execmodules] 3 warnings
_default:compile-resources:
[mkdir] Created dir: /qa/services/hudson/hudson_workspace/workspace/JBoss-AS-5.0.x-TestSuite-sun15/trunk/main/output/resources
[copy] Copying 4 files to /qa/services/hudson/hudson_workspace/workspace/JBoss-AS-5.0.x-TestSuite-sun15/trunk/main/output/resources
_default:compile-etc:
[mkdir] Created dir: /qa/services/hudson/hudson_workspace/workspace/JBoss-AS-5.0.x-TestSuite-sun15/trunk/main/output/etc
[copy] Copying 2 files to /qa/services/hudson/hudson_workspace/workspace/JBoss-AS-5.0.x-TestSuite-sun15/trunk/main/output/etc
_default:compile-bin:
[mkdir] Created dir: /qa/services/hudson/hudson_workspace/workspace/JBoss-AS-5.0.x-TestSuite-sun15/trunk/main/output/bin
[copy] Copying 6 files to /qa/services/hudson/hudson_workspace/workspace/JBoss-AS-5.0.x-TestSuite-sun15/trunk/main/output/bin
_buildmagic:init:
init:
_default:fix-bin:
compile:
[mkdir] Created dir: /qa/services/hudson/hudson_workspace/workspace/JBoss-AS-5.0.x-TestSuite-sun15/trunk/main/output/lib
module-jars:
[jar] Building jar: /qa/services/hudson/hudson_workspace/workspace/JBoss-AS-5.0.x-TestSuite-sun15/trunk/main/output/lib/log4j-boot.jar
[jar] Building jar: /qa/services/hudson/hudson_workspace/workspace/JBoss-AS-5.0.x-TestSuite-sun15/trunk/main/output/lib/jboss-main.jar
[jar] Building jar: /qa/services/hudson/hudson_workspace/workspace/JBoss-AS-5.0.x-TestSuite-sun15/trunk/main/output/lib/jboss-main-client.jar
[jar] Building jar: /qa/services/hudson/hudson_workspace/workspace/JBoss-AS-5.0.x-TestSuite-sun15/trunk/main/output/lib/run.jar
[touch] Creating /qa/services/hudson/hudson_workspace/workspace/JBoss-AS-5.0.x-TestSuite-sun15/trunk/main/output/build-marker
most:
==
== Finished with 'most' in module 'main'.
======================================================================
_module-main-most:
_module-main-most:
[mkdir] Created dir: /qa/services/hudson/hudson_workspace/workspace/JBoss-AS-5.0.x-TestSuite-sun15/trunk/build/output/jboss-5.0.0.Beta4/lib
[copy] Copying 2 files to /qa/services/hudson/hudson_workspace/workspace/JBoss-AS-5.0.x-TestSuite-sun15/trunk/build/output/jboss-5.0.0.Beta4/lib
[mkdir] Created dir: /qa/services/hudson/hudson_workspace/workspace/JBoss-AS-5.0.x-TestSuite-sun15/trunk/build/output/jboss-5.0.0.Beta4/client
[copy] Copying 1 file to /qa/services/hudson/hudson_workspace/workspace/JBoss-AS-5.0.x-TestSuite-sun15/trunk/build/output/jboss-5.0.0.Beta4/client
[mkdir] Created dir: /qa/services/hudson/hudson_workspace/workspace/JBoss-AS-5.0.x-TestSuite-sun15/trunk/build/output/jboss-5.0.0.Beta4/bin
[copy] Copying 7 files to /qa/services/hudson/hudson_workspace/workspace/JBoss-AS-5.0.x-TestSuite-sun15/trunk/build/output/jboss-5.0.0.Beta4/bin
[copy] Copying 1 file to /qa/services/hudson/hudson_workspace/workspace/JBoss-AS-5.0.x-TestSuite-sun15/trunk/build/output/jboss-5.0.0.Beta4/lib
[copy] Copying 1 file to /qa/services/hudson/hudson_workspace/workspace/JBoss-AS-5.0.x-TestSuite-sun15/trunk/build/output/jboss-5.0.0.Beta4/server/all/lib
[copy] Copying 1 file to /qa/services/hudson/hudson_workspace/workspace/JBoss-AS-5.0.x-TestSuite-sun15/trunk/build/output/jboss-5.0.0.Beta4/server/all/lib
[copy] Copying 2 files to /qa/services/hudson/hudson_workspace/workspace/JBoss-AS-5.0.x-TestSuite-sun15/trunk/build/output/jboss-5.0.0.Beta4/client
======================================================================
== Executing 'most' in module 'bootstrap'...
==
_buildmagic:init:
configure:
Overriding previous definition of reference to jboss.test.classpath
_default:task-init:
init:
_buildmagic:build-bypass-checker:
_buildmagic:build-bypass-notice:
_buildmagic:build-bypass-check:
jars:
_buildmagic:init:
init:
_default:compile-classes:
[mkdir] Created dir: /qa/services/hudson/hudson_workspace/workspace/JBoss-AS-5.0.x-TestSuite-sun15/trunk/bootstrap/output/classes
[mkdir] Created dir: /qa/services/hudson/hudson_workspace/workspace/JBoss-AS-5.0.x-TestSuite-sun15/trunk/bootstrap/output/gen-src
[javac] Compiling 5 source files to /qa/services/hudson/hudson_workspace/workspace/JBoss-AS-5.0.x-TestSuite-sun15/trunk/bootstrap/output/classes
An exception has occurred in the compiler (1.5.0_12). Please file a bug at the Java Developer Connection (http://java.sun.com/webapps/bugreport) after checking the Bug Parade for duplicates. Include your program and the following diagnostic in your report. Thank you.
com.sun.tools.javac.code.Symbol$CompletionFailure: file javax/xml/bind/annotation/XmlNsForm.class not found
BUILD FAILED
/qa/services/hudson/hudson_workspace/workspace/JBoss-AS-5.0.x-TestSuite-sun15/trunk/tools/etc/buildmagic/buildmagic.ent:442: Compile failed; see the compiler error output for details.
Total time: 45 seconds
[JBoss-AS-5.0.x-TestSuite-sun15] $ bash -xe /tmp/hudson45454.sh
+ kill 1643
Recording test results
Build was marked for publishing on https://hudson.jboss.org/hudson/
finished: FAILURE
17 years, 1 month
Build failed in Hudson: JBoss-AS-5.0.x-TestSuite-sun15 #332
by jboss-qa-internal@redhat.com
See https://hudson.jboss.org/hudson/job/JBoss-AS-5.0.x-TestSuite-sun15/332/ch...
Changes:
[scott.stark(a)jboss.org] Set the Id Revision keywords
[scott.stark(a)jboss.org] Checkpoint the security integration work
[bstansberry(a)jboss.com] [JBAS-5155] Upgrade to jboss-ha-server-api 1.0.0.BETA3
[bstansberry(a)jboss.com] [JBAS-5155] Use 1.0.0.BETA jboss-ha-server-api.jar
------------------------------------------
[...truncated 27394 lines...]
[copy] Copying 9 files to /qa/services/hudson/hudson_workspace/workspace/JBoss-AS-5.0.x-TestSuite-sun15/trunk/testsuite/output/lib/scopedB.ear/scopedB.jar
[copy] Copying 2 files to /qa/services/hudson/hudson_workspace/workspace/JBoss-AS-5.0.x-TestSuite-sun15/trunk/testsuite/output/lib/scopedB.ear
_jars-security:
[jar] Building jar: /qa/services/hudson/hudson_workspace/workspace/JBoss-AS-5.0.x-TestSuite-sun15/trunk/testsuite/output/lib/caller-info.jar
[jar] Building jar: /qa/services/hudson/hudson_workspace/workspace/JBoss-AS-5.0.x-TestSuite-sun15/trunk/testsuite/output/lib/subject-context.jar
[war] Building war: /qa/services/hudson/hudson_workspace/workspace/JBoss-AS-5.0.x-TestSuite-sun15/trunk/testsuite/output/lib/subject-context.war
[ear] Building ear: /qa/services/hudson/hudson_workspace/workspace/JBoss-AS-5.0.x-TestSuite-sun15/trunk/testsuite/output/lib/subject-context.ear
[jar] Building jar: /qa/services/hudson/hudson_workspace/workspace/JBoss-AS-5.0.x-TestSuite-sun15/trunk/testsuite/output/lib/security-client.jar
[jar] Building jar: /qa/services/hudson/hudson_workspace/workspace/JBoss-AS-5.0.x-TestSuite-sun15/trunk/testsuite/output/lib/security-spec.sar
[jar] Building jar: /qa/services/hudson/hudson_workspace/workspace/JBoss-AS-5.0.x-TestSuite-sun15/trunk/testsuite/output/lib/security-spec.jar
[jar] Building jar: /qa/services/hudson/hudson_workspace/workspace/JBoss-AS-5.0.x-TestSuite-sun15/trunk/testsuite/output/lib/security-srp.sar
[jar] Building jar: /qa/services/hudson/hudson_workspace/workspace/JBoss-AS-5.0.x-TestSuite-sun15/trunk/testsuite/output/lib/security-srp.jar
[jar] Building jar: /qa/services/hudson/hudson_workspace/workspace/JBoss-AS-5.0.x-TestSuite-sun15/trunk/testsuite/output/lib/https-service.sar
[jar] Building jar: /qa/services/hudson/hudson_workspace/workspace/JBoss-AS-5.0.x-TestSuite-sun15/trunk/testsuite/output/lib/security-proxy.jar
[jar] Building jar: /qa/services/hudson/hudson_workspace/workspace/JBoss-AS-5.0.x-TestSuite-sun15/trunk/testsuite/output/lib/securitymgr-ejb.jar
[jar] Building jar: /qa/services/hudson/hudson_workspace/workspace/JBoss-AS-5.0.x-TestSuite-sun15/trunk/testsuite/output/lib/securitymgr-tests.jar
[war] Building war: /qa/services/hudson/hudson_workspace/workspace/JBoss-AS-5.0.x-TestSuite-sun15/trunk/testsuite/output/lib/custom-principal.war
[jar] Building jar: /qa/services/hudson/hudson_workspace/workspace/JBoss-AS-5.0.x-TestSuite-sun15/trunk/testsuite/output/lib/security-jaas.sar
[war] Building war: /qa/services/hudson/hudson_workspace/workspace/JBoss-AS-5.0.x-TestSuite-sun15/trunk/testsuite/output/lib/security-jaas.war
[jar] Building jar: /qa/services/hudson/hudson_workspace/workspace/JBoss-AS-5.0.x-TestSuite-sun15/trunk/testsuite/output/lib/security-jaas.jar
[ear] Building ear: /qa/services/hudson/hudson_workspace/workspace/JBoss-AS-5.0.x-TestSuite-sun15/trunk/testsuite/output/lib/security-jaas.ear
[jar] Building jar: /qa/services/hudson/hudson_workspace/workspace/JBoss-AS-5.0.x-TestSuite-sun15/trunk/testsuite/output/lib/security-incpt.jar
[war] Building war: /qa/services/hudson/hudson_workspace/workspace/JBoss-AS-5.0.x-TestSuite-sun15/trunk/testsuite/output/lib/web-constraints.war
[jar] Building jar: /qa/services/hudson/hudson_workspace/workspace/JBoss-AS-5.0.x-TestSuite-sun15/trunk/testsuite/output/lib/client-login-tests.jar
[jar] Building jar: /qa/services/hudson/hudson_workspace/workspace/JBoss-AS-5.0.x-TestSuite-sun15/trunk/testsuite/output/lib/missing-methods-unchecked.jar
[jar] Building jar: /qa/services/hudson/hudson_workspace/workspace/JBoss-AS-5.0.x-TestSuite-sun15/trunk/testsuite/output/lib/missing-methods-excluded.jar
[jar] Building jar: /qa/services/hudson/hudson_workspace/workspace/JBoss-AS-5.0.x-TestSuite-sun15/trunk/testsuite/output/lib/security-jacc-callerinrole.jar
[war] Building war: /qa/services/hudson/hudson_workspace/workspace/JBoss-AS-5.0.x-TestSuite-sun15/trunk/testsuite/output/lib/deepcopy.war
[ear] Building ear: /qa/services/hudson/hudson_workspace/workspace/JBoss-AS-5.0.x-TestSuite-sun15/trunk/testsuite/output/lib/deepcopy.ear
[jar] Building jar: /qa/services/hudson/hudson_workspace/workspace/JBoss-AS-5.0.x-TestSuite-sun15/trunk/testsuite/output/lib/xacml-ejb.jar
[jar] Building jar: /qa/services/hudson/hudson_workspace/workspace/JBoss-AS-5.0.x-TestSuite-sun15/trunk/testsuite/output/lib/jmxinvoker-authorization-test.jar
[jar] Building MANIFEST-only jar: /qa/services/hudson/hudson_workspace/workspace/JBoss-AS-5.0.x-TestSuite-sun15/trunk/testsuite/output/lib/opends-integration.jar
[jar] Building jar: /qa/services/hudson/hudson_workspace/workspace/JBoss-AS-5.0.x-TestSuite-sun15/trunk/testsuite/output/lib/opends.sar
_jars-securitymgr:
[mkdir] Created dir: /qa/services/hudson/hudson_workspace/workspace/JBoss-AS-5.0.x-TestSuite-sun15/trunk/testsuite/output/lib/securitymgr
[jar] Building jar: /qa/services/hudson/hudson_workspace/workspace/JBoss-AS-5.0.x-TestSuite-sun15/trunk/testsuite/output/lib/securitymgr/packed.war
[unzip] Expanding: /qa/services/hudson/hudson_workspace/workspace/JBoss-AS-5.0.x-TestSuite-sun15/trunk/testsuite/output/lib/securitymgr/packed.war into /qa/services/hudson/hudson_workspace/workspace/JBoss-AS-5.0.x-TestSuite-sun15/trunk/testsuite/output/lib/securitymgr/unpacked.war
_jars-security-spi:
[jar] Building jar: /qa/services/hudson/hudson_workspace/workspace/JBoss-AS-5.0.x-TestSuite-sun15/trunk/testsuite/output/lib/web-role-map.war
[jar] Building jar: /qa/services/hudson/hudson_workspace/workspace/JBoss-AS-5.0.x-TestSuite-sun15/trunk/testsuite/output/lib/deployment-rolemapping.jar
[war] Building war: /qa/services/hudson/hudson_workspace/workspace/JBoss-AS-5.0.x-TestSuite-sun15/trunk/testsuite/output/lib/deployment-rolemapping.war
[jar] Building jar: /qa/services/hudson/hudson_workspace/workspace/JBoss-AS-5.0.x-TestSuite-sun15/trunk/testsuite/output/lib/deployment-rolemapping.ear
_jars-session:
[jar] Building jar: /qa/services/hudson/hudson_workspace/workspace/JBoss-AS-5.0.x-TestSuite-sun15/trunk/testsuite/output/lib/test-session-remove.jar
_jars-spring:
[jar] Building jar: /qa/services/hudson/hudson_workspace/workspace/JBoss-AS-5.0.x-TestSuite-sun15/trunk/testsuite/output/lib/spring-beans.jar
[jar] Building jar: /qa/services/hudson/hudson_workspace/workspace/JBoss-AS-5.0.x-TestSuite-sun15/trunk/testsuite/output/lib/spring-ejb.jar
[mkdir] Created dir: /qa/services/hudson/hudson_workspace/workspace/JBoss-AS-5.0.x-TestSuite-sun15/trunk/testsuite/output/lib/spring-ear.ear
[copy] Copying 3 files to /qa/services/hudson/hudson_workspace/workspace/JBoss-AS-5.0.x-TestSuite-sun15/trunk/testsuite/output/lib/spring-ear.ear
[mkdir] Created dir: /qa/services/hudson/hudson_workspace/workspace/JBoss-AS-5.0.x-TestSuite-sun15/trunk/testsuite/output/lib/spring-ear.ear/lib
[copy] Copying 1 file to /qa/services/hudson/hudson_workspace/workspace/JBoss-AS-5.0.x-TestSuite-sun15/trunk/testsuite/output/lib/spring-ear.ear/lib
[copy] Copying 1 file to /qa/services/hudson/hudson_workspace/workspace/JBoss-AS-5.0.x-TestSuite-sun15/trunk/testsuite/output/lib
_jars-testbean:
[jar] Building jar: /qa/services/hudson/hudson_workspace/workspace/JBoss-AS-5.0.x-TestSuite-sun15/trunk/testsuite/output/lib/testbeantest.jar
[jar] Building jar: /qa/services/hudson/hudson_workspace/workspace/JBoss-AS-5.0.x-TestSuite-sun15/trunk/testsuite/output/lib/testbean.jar
[jar] Building jar: /qa/services/hudson/hudson_workspace/workspace/JBoss-AS-5.0.x-TestSuite-sun15/trunk/testsuite/output/lib/testbean2.jar
_jars-testbeancluster:
[copy] Copying 1 file to /qa/services/hudson/hudson_workspace/workspace/JBoss-AS-5.0.x-TestSuite-sun15/trunk/testsuite/output/lib
[jar] Building jar: /qa/services/hudson/hudson_workspace/workspace/JBoss-AS-5.0.x-TestSuite-sun15/trunk/testsuite/output/lib/testbeancluster.jar
[jar] Building jar: /qa/services/hudson/hudson_workspace/workspace/JBoss-AS-5.0.x-TestSuite-sun15/trunk/testsuite/output/lib/sfsb-passexp.jar
[jar] Building jar: /qa/services/hudson/hudson_workspace/workspace/JBoss-AS-5.0.x-TestSuite-sun15/trunk/testsuite/output/lib/sfsb-passexp.sar
[jar] Building jar: /qa/services/hudson/hudson_workspace/workspace/JBoss-AS-5.0.x-TestSuite-sun15/trunk/testsuite/output/lib/test-cif.jar
[ear] Building ear: /qa/services/hudson/hudson_workspace/workspace/JBoss-AS-5.0.x-TestSuite-sun15/trunk/testsuite/output/lib/test-cif.ear
[jar] Building jar: /qa/services/hudson/hudson_workspace/workspace/JBoss-AS-5.0.x-TestSuite-sun15/trunk/testsuite/output/lib/test-retry.jar
[ear] Building ear: /qa/services/hudson/hudson_workspace/workspace/JBoss-AS-5.0.x-TestSuite-sun15/trunk/testsuite/output/lib/test-retry.ear
[jar] Building jar: /qa/services/hudson/hudson_workspace/workspace/JBoss-AS-5.0.x-TestSuite-sun15/trunk/testsuite/output/lib/pooledha.jar
_jars-threading:
[jar] Building jar: /qa/services/hudson/hudson_workspace/workspace/JBoss-AS-5.0.x-TestSuite-sun15/trunk/testsuite/output/lib/threadingMBean.jar
[jar] Building jar: /qa/services/hudson/hudson_workspace/workspace/JBoss-AS-5.0.x-TestSuite-sun15/trunk/testsuite/output/lib/threadingBean.jar
_jars-timer:
[zip] Building zip: /qa/services/hudson/hudson_workspace/workspace/JBoss-AS-5.0.x-TestSuite-sun15/trunk/testsuite/output/lib/ejb-timer.jar
[zip] Building zip: /qa/services/hudson/hudson_workspace/workspace/JBoss-AS-5.0.x-TestSuite-sun15/trunk/testsuite/output/lib/ejb-timer.war
[jar] Building jar: /qa/services/hudson/hudson_workspace/workspace/JBoss-AS-5.0.x-TestSuite-sun15/trunk/testsuite/output/lib/ejb-timer.sar
[zip] Building zip: /qa/services/hudson/hudson_workspace/workspace/JBoss-AS-5.0.x-TestSuite-sun15/trunk/testsuite/output/lib/ejb-timer.ear
[jar] Building jar: /qa/services/hudson/hudson_workspace/workspace/JBoss-AS-5.0.x-TestSuite-sun15/trunk/testsuite/output/lib/transactional-timer-test.jar
_jars-tm:
[jar] Building jar: /qa/services/hudson/hudson_workspace/workspace/JBoss-AS-5.0.x-TestSuite-sun15/trunk/testsuite/output/lib/tmtest.sar
[jar] Building jar: /qa/services/hudson/hudson_workspace/workspace/JBoss-AS-5.0.x-TestSuite-sun15/trunk/testsuite/output/lib/mttest.sar
[jar] Building jar: /qa/services/hudson/hudson_workspace/workspace/JBoss-AS-5.0.x-TestSuite-sun15/trunk/testsuite/output/lib/txtimeouttest.jar
[jar] Building jar: /qa/services/hudson/hudson_workspace/workspace/JBoss-AS-5.0.x-TestSuite-sun15/trunk/testsuite/output/lib/bmtcleanuptest.jar
[jar] Building jar: /qa/services/hudson/hudson_workspace/workspace/JBoss-AS-5.0.x-TestSuite-sun15/trunk/testsuite/output/lib/webbmtcleanuptest.war
[jar] Building jar: /qa/services/hudson/hudson_workspace/workspace/JBoss-AS-5.0.x-TestSuite-sun15/trunk/testsuite/output/lib/webbmtcleanuptest.sar
[jar] Building jar: /qa/services/hudson/hudson_workspace/workspace/JBoss-AS-5.0.x-TestSuite-sun15/trunk/testsuite/output/lib/transaction-test.jar
_jars-txiiop:
[jar] Building jar: /qa/services/hudson/hudson_workspace/workspace/JBoss-AS-5.0.x-TestSuite-sun15/trunk/testsuite/output/lib/txiioptest.jar
[jar] Building jar: /qa/services/hudson/hudson_workspace/workspace/JBoss-AS-5.0.x-TestSuite-sun15/trunk/testsuite/output/lib/txiiop.jar
_jars-txtimer:
[jar] Building jar: /qa/services/hudson/hudson_workspace/workspace/JBoss-AS-5.0.x-TestSuite-sun15/trunk/testsuite/output/lib/ejb-txtimer.jar
[jar] Building jar: /qa/services/hudson/hudson_workspace/workspace/JBoss-AS-5.0.x-TestSuite-sun15/trunk/testsuite/output/lib/ejb-txtimer-scoped.jar
_jars-util:
[jar] Building jar: /qa/services/hudson/hudson_workspace/workspace/JBoss-AS-5.0.x-TestSuite-sun15/trunk/testsuite/output/lib/scheduler.jar
[jar] Building jar: /qa/services/hudson/hudson_workspace/workspace/JBoss-AS-5.0.x-TestSuite-sun15/trunk/testsuite/output/lib/scheduler.sar
[ear] Building ear: /qa/services/hudson/hudson_workspace/workspace/JBoss-AS-5.0.x-TestSuite-sun15/trunk/testsuite/output/lib/scheduler.ear
_jars-web:
[war] Building war: /qa/services/hudson/hudson_workspace/workspace/JBoss-AS-5.0.x-TestSuite-sun15/trunk/testsuite/output/lib/altdd.war
[ear] Building ear: /qa/services/hudson/hudson_workspace/workspace/JBoss-AS-5.0.x-TestSuite-sun15/trunk/testsuite/output/lib/altdd-web.ear
[jar] Building jar: /qa/services/hudson/hudson_workspace/workspace/JBoss-AS-5.0.x-TestSuite-sun15/trunk/testsuite/output/lib/jbosstest-web-ejbs.jar
[jar] Building jar: /qa/services/hudson/hudson_workspace/workspace/JBoss-AS-5.0.x-TestSuite-sun15/trunk/testsuite/output/lib/jbosstest-web-util2.jar
[jar] Building jar: /qa/services/hudson/hudson_workspace/workspace/JBoss-AS-5.0.x-TestSuite-sun15/trunk/testsuite/output/lib/jbosstest-web-util.jar
[jar] Building jar: /qa/services/hudson/hudson_workspace/workspace/JBoss-AS-5.0.x-TestSuite-sun15/trunk/testsuite/output/lib/lib/util.jar
[mkdir] Created dir: /qa/services/hudson/hudson_workspace/workspace/JBoss-AS-5.0.x-TestSuite-sun15/trunk/testsuite/output/lib/websubdir
[jar] Building jar: /qa/services/hudson/hudson_workspace/workspace/JBoss-AS-5.0.x-TestSuite-sun15/trunk/testsuite/output/lib/websubdir/relative.jar
[war] Building war: /qa/services/hudson/hudson_workspace/workspace/JBoss-AS-5.0.x-TestSuite-sun15/trunk/testsuite/output/lib/manifest-web.war
[ear] Building ear: /qa/services/hudson/hudson_workspace/workspace/JBoss-AS-5.0.x-TestSuite-sun15/trunk/testsuite/output/lib/manifest-web.ear
[war] Building war: /qa/services/hudson/hudson_workspace/workspace/JBoss-AS-5.0.x-TestSuite-sun15/trunk/testsuite/output/lib/root-web.war
[mkdir] Created dir: /qa/services/hudson/hudson_workspace/workspace/JBoss-AS-5.0.x-TestSuite-sun15/trunk/testsuite/output/lib/wars
[war] Building war: /qa/services/hudson/hudson_workspace/workspace/JBoss-AS-5.0.x-TestSuite-sun15/trunk/testsuite/output/lib/wars/notjbosstest-web.war
[jar] Building jar: /qa/services/hudson/hudson_workspace/workspace/JBoss-AS-5.0.x-TestSuite-sun15/trunk/testsuite/output/lib/jbosstest-web-libservlet.jar
[jar] Building jar: /qa/services/hudson/hudson_workspace/workspace/JBoss-AS-5.0.x-TestSuite-sun15/trunk/testsuite/output/lib/resources.jar
[war] Building war: /qa/services/hudson/hudson_workspace/workspace/JBoss-AS-5.0.x-TestSuite-sun15/trunk/testsuite/output/lib/jbosstest-web.war
[war] Building war: /qa/services/hudson/hudson_workspace/workspace/JBoss-AS-5.0.x-TestSuite-sun15/trunk/testsuite/output/lib/jbosstest-ctx-destroy.war
[copy] Copying 1 file to /qa/services/hudson/hudson_workspace/workspace/JBoss-AS-5.0.x-TestSuite-sun15/trunk/testsuite/output/lib/lib
[war] Building war: /qa/services/hudson/hudson_workspace/workspace/JBoss-AS-5.0.x-TestSuite-sun15/trunk/testsuite/output/lib/jbosstest-webctx.war
[war] Building war: /qa/services/hudson/hudson_workspace/workspace/JBoss-AS-5.0.x-TestSuite-sun15/trunk/testsuite/output/lib/bad-web.war
[war] Building war: /qa/services/hudson/hudson_workspace/workspace/JBoss-AS-5.0.x-TestSuite-sun15/trunk/testsuite/output/lib/good-web.war
[ear] Building ear: /qa/services/hudson/hudson_workspace/workspace/JBoss-AS-5.0.x-TestSuite-sun15/trunk/testsuite/output/lib/jbosstest-web.ear
[ear] Building ear: /qa/services/hudson/hudson_workspace/workspace/JBoss-AS-5.0.x-TestSuite-sun15/trunk/testsuite/output/lib/jbosstest-web2.ear
[ear] Building ear: /qa/services/hudson/hudson_workspace/workspace/JBoss-AS-5.0.x-TestSuite-sun15/trunk/testsuite/output/lib/jbosstest-bad.ear
[ear] Building ear: /qa/services/hudson/hudson_workspace/workspace/JBoss-AS-5.0.x-TestSuite-sun15/trunk/testsuite/output/lib/jbosstest-good.ear
[war] Building war: /qa/services/hudson/hudson_workspace/workspace/JBoss-AS-5.0.x-TestSuite-sun15/trunk/testsuite/output/lib/form-auth.war
[zip] Building zip: /qa/services/hudson/hudson_workspace/workspace/JBoss-AS-5.0.x-TestSuite-sun15/trunk/testsuite/output/lib/form-auth.ear
[war] Building war: /qa/services/hudson/hudson_workspace/workspace/JBoss-AS-5.0.x-TestSuite-sun15/trunk/testsuite/output/lib/jaspi-form-auth.war
[zip] Building zip: /qa/services/hudson/hudson_workspace/workspace/JBoss-AS-5.0.x-TestSuite-sun15/trunk/testsuite/output/lib/jaspi-form-auth.ear
[war] Building war: /qa/services/hudson/hudson_workspace/workspace/JBoss-AS-5.0.x-TestSuite-sun15/trunk/testsuite/output/lib/clientcert-auth.war
[war] Building war: /qa/services/hudson/hudson_workspace/workspace/JBoss-AS-5.0.x-TestSuite-sun15/trunk/testsuite/output/lib/sso-form-auth.war
[war] Building war: /qa/services/hudson/hudson_workspace/workspace/JBoss-AS-5.0.x-TestSuite-sun15/trunk/testsuite/output/lib/sso-form-auth-clustered.war
[war] Building war: /qa/services/hudson/hudson_workspace/workspace/JBoss-AS-5.0.x-TestSuite-sun15/trunk/testsuite/output/lib/sso-expire.war
[ear] Building ear: /qa/services/hudson/hudson_workspace/workspace/JBoss-AS-5.0.x-TestSuite-sun15/trunk/testsuite/output/lib/web-sso.ear
[ear] Building ear: /qa/services/hudson/hudson_workspace/workspace/JBoss-AS-5.0.x-TestSuite-sun15/trunk/testsuite/output/lib/web-sso-clustered.ear
[war] Building war: /qa/services/hudson/hudson_workspace/workspace/JBoss-AS-5.0.x-TestSuite-sun15/trunk/testsuite/output/lib/custom-errors.war
[war] Building war: /qa/services/hudson/hudson_workspace/workspace/JBoss-AS-5.0.x-TestSuite-sun15/trunk/testsuite/output/lib/error-producer.war
[war] Building war: /qa/services/hudson/hudson_workspace/workspace/JBoss-AS-5.0.x-TestSuite-sun15/trunk/testsuite/output/lib/userinrole.war
[war] Building war: /qa/services/hudson/hudson_workspace/workspace/JBoss-AS-5.0.x-TestSuite-sun15/trunk/testsuite/output/lib/userinrole1.war
[war] Building war: /qa/services/hudson/hudson_workspace/workspace/JBoss-AS-5.0.x-TestSuite-sun15/trunk/testsuite/output/lib/userinrole2.war
[zip] Building zip: /qa/services/hudson/hudson_workspace/workspace/JBoss-AS-5.0.x-TestSuite-sun15/trunk/testsuite/output/lib/userinrole.ear
[jar] Building jar: /qa/services/hudson/hudson_workspace/workspace/JBoss-AS-5.0.x-TestSuite-sun15/trunk/testsuite/output/lib/header-auth.jar
[war] Building war: /qa/services/hudson/hudson_workspace/workspace/JBoss-AS-5.0.x-TestSuite-sun15/trunk/testsuite/output/lib/auth-ext-header-web.war
[war] Building war: /qa/services/hudson/hudson_workspace/workspace/JBoss-AS-5.0.x-TestSuite-sun15/trunk/testsuite/output/lib/jbosssx-jaspi-web.war
[war] Building war: /qa/services/hudson/hudson_workspace/workspace/JBoss-AS-5.0.x-TestSuite-sun15/trunk/testsuite/output/lib/xacml-requestattrib.war
[war] Building war: /qa/services/hudson/hudson_workspace/workspace/JBoss-AS-5.0.x-TestSuite-sun15/trunk/testsuite/output/lib/xacml-subjectrole.war
[war] Building war: /qa/services/hudson/hudson_workspace/workspace/JBoss-AS-5.0.x-TestSuite-sun15/trunk/testsuite/output/lib/header-form-auth.war
[zip] Building zip: /qa/services/hudson/hudson_workspace/workspace/JBoss-AS-5.0.x-TestSuite-sun15/trunk/testsuite/output/lib/header-form-auth.ear
[war] Building war: /qa/services/hudson/hudson_workspace/workspace/JBoss-AS-5.0.x-TestSuite-sun15/trunk/testsuite/output/lib/generic-header-auth.war
[zip] Building zip: /qa/services/hudson/hudson_workspace/workspace/JBoss-AS-5.0.x-TestSuite-sun15/trunk/testsuite/output/lib/generic-header-auth.ear
[war] Building war: /qa/services/hudson/hudson_workspace/workspace/JBoss-AS-5.0.x-TestSuite-sun15/trunk/testsuite/output/lib/simple-xmlonly.war
[war] Building war: /qa/services/hudson/hudson_workspace/workspace/JBoss-AS-5.0.x-TestSuite-sun15/trunk/testsuite/output/lib/simple-annonly.war
[jar] Building jar: /qa/services/hudson/hudson_workspace/workspace/JBoss-AS-5.0.x-TestSuite-sun15/trunk/testsuite/output/lib/simple-mock.beans
[war] Building war: /qa/services/hudson/hudson_workspace/workspace/JBoss-AS-5.0.x-TestSuite-sun15/trunk/testsuite/output/lib/root-context.war
[war] Building war: /qa/services/hudson/hudson_workspace/workspace/JBoss-AS-5.0.x-TestSuite-sun15/trunk/testsuite/output/lib/programmaticweblogin.war
[zip] Building zip: /qa/services/hudson/hudson_workspace/workspace/JBoss-AS-5.0.x-TestSuite-sun15/trunk/testsuite/output/lib/programmaticweblogin.ear
[war] Building war: /qa/services/hudson/hudson_workspace/workspace/JBoss-AS-5.0.x-TestSuite-sun15/trunk/testsuite/output/lib/class-loading.war
_jars-webservice:
[echo] Using target node: 10.18.96.175
[copy] Copying 26 files to /qa/services/hudson/hudson_workspace/workspace/JBoss-AS-5.0.x-TestSuite-sun15/trunk/testsuite/output/resources/webservice
[copy] Copying 2 files to /qa/services/hudson/hudson_workspace/workspace/JBoss-AS-5.0.x-TestSuite-sun15/trunk/testsuite/output/resources/webservice
[jar] Building jar: /qa/services/hudson/hudson_workspace/workspace/JBoss-AS-5.0.x-TestSuite-sun15/trunk/testsuite/output/lib/ws4ee-admindevel.jar
[jar] Building jar: /qa/services/hudson/hudson_workspace/workspace/JBoss-AS-5.0.x-TestSuite-sun15/trunk/testsuite/output/lib/ws4ee-admindevel-client.jar
[jar] Building jar: /qa/services/hudson/hudson_workspace/workspace/JBoss-AS-5.0.x-TestSuite-sun15/trunk/testsuite/output/lib/ws4ee-jbws309.jar
[jar] Building jar: /qa/services/hudson/hudson_workspace/workspace/JBoss-AS-5.0.x-TestSuite-sun15/trunk/testsuite/output/lib/ws4ee-jbws309-client.jar
[war] Building war: /qa/services/hudson/hudson_workspace/workspace/JBoss-AS-5.0.x-TestSuite-sun15/trunk/testsuite/output/lib/jaxws-jbws1124.war
_jars-ws:
[war] Building war: /qa/services/hudson/hudson_workspace/workspace/JBoss-AS-5.0.x-TestSuite-sun15/trunk/testsuite/output/lib/jaxws-webserviceref.war
[jar] Building jar: /qa/services/hudson/hudson_workspace/workspace/JBoss-AS-5.0.x-TestSuite-sun15/trunk/testsuite/output/lib/jaxws-webserviceref-client.jar
[war] Building war: /qa/services/hudson/hudson_workspace/workspace/JBoss-AS-5.0.x-TestSuite-sun15/trunk/testsuite/output/lib/jaxws-webserviceref-servlet-client.war
[jar] Building jar: /qa/services/hudson/hudson_workspace/workspace/JBoss-AS-5.0.x-TestSuite-sun15/trunk/testsuite/output/lib/jaxws-webserviceref-ejb3-client.jar
_jars-xa:
[jar] Building jar: /qa/services/hudson/hudson_workspace/workspace/JBoss-AS-5.0.x-TestSuite-sun15/trunk/testsuite/output/lib/xatestclient.jar
[jar] Building jar: /qa/services/hudson/hudson_workspace/workspace/JBoss-AS-5.0.x-TestSuite-sun15/trunk/testsuite/output/lib/xatest.jar
_jars-xslt:
[jar] Building jar: /qa/services/hudson/hudson_workspace/workspace/JBoss-AS-5.0.x-TestSuite-sun15/trunk/testsuite/output/lib/xalan-check-default.sar
[jar] Building jar: /qa/services/hudson/hudson_workspace/workspace/JBoss-AS-5.0.x-TestSuite-sun15/trunk/testsuite/output/lib/xalan-check-scoped.sar
_jars-byvalue:
[jar] Building jar: /qa/services/hudson/hudson_workspace/workspace/JBoss-AS-5.0.x-TestSuite-sun15/trunk/testsuite/output/lib/jar-byvalue.jar
jars:
tests:
Overriding previous definition of reference to apache.commons.classpath
Overriding previous definition of reference to sax.classpath
Overriding previous definition of reference to xdoclet.task.classpath
Overriding previous definition of reference to gjt.jpl-util.classpath
Overriding previous definition of reference to opennms.joesnmp.classpath
Overriding previous definition of reference to jacorb.idl.classpath
Overriding previous definition of reference to sleepycat.classpath
Overriding previous definition of reference to apache.tomcat55.classpath
Overriding previous definition of reference to trove.classpath
Overriding previous definition of reference to qdox.classpath
Overriding previous definition of reference to javassist.classpath
Overriding previous definition of reference to hibernate3.classpath
Overriding previous definition of reference to odmg.classpath
Overriding previous definition of reference to cglib.classpath
Overriding previous definition of reference to ejb3-persistence.classpath
Overriding previous definition of reference to spring.classpath
Overriding previous definition of reference to apache.ant.classpath
Overriding previous definition of reference to jboss.test.classpath
jboss-minimal-tests:
[server:start] Starting server "minimal" with command:
[server:start] /qa/tools/opt/jdk1.5.0_12/bin/java -cp /qa/services/hudson/hudson_workspace/workspace/JBoss-AS-5.0.x-TestSuite-sun15/trunk/build/output/jboss-5.0.0.Beta4/bin/run.jar:/qa/tools/opt/jdk1.5.0_12/lib/tools.jar -Dsun.lang.ClassLoader.allowArraySyntax=true org.jboss.Main -c minimal -b 10.18.96.175 -u 227.43.0.144
[server:start] Failed to start server "minimal" before timeout. Destroying the process.
BUILD FAILED
/qa/services/hudson/hudson_workspace/workspace/JBoss-AS-5.0.x-TestSuite-sun15/trunk/testsuite/build.xml:880: The following error occurred while executing this line:
/qa/services/hudson/hudson_workspace/workspace/JBoss-AS-5.0.x-TestSuite-sun15/trunk/testsuite/build.xml:912: Error starting server "minimal": Server failed to start; see logs.
Total time: 5 minutes 8 seconds
+ BSTATUS=1
+ [[ 1 -ne 0 ]]
+ kill-jboss
++ uname -s
+ [[ Linux == \L\i\n\u\x ]]
+ ps -eaf --columns 2200
+ grep run.jar
+ grep -v grep
+ awk '{ print $2; }'
+ xargs kill
+ sleep 10
+ ps -eaf --columns 2200
+ grep run.jar
+ grep -v grep
+ awk '{ print $2; }'
+ xargs kill -9
usage: kill [ -s signal | -p ] [ -a ] pid ...
kill -l [ signal ]
+ return 0
+ exit 1
[JBoss-AS-5.0.x-TestSuite-sun15] $ bash -xe /tmp/hudson59737.sh
+ kill 25429
Recording test results
Build was marked for publishing on https://hudson.jboss.org/hudson/
finished: FAILURE
17 years, 1 month