JBoss-AS-4.2.x-TestSuite-jrockit15 - Build # 198 - Unstable!
by jboss-qa-internal@redhat.com
JBoss-AS-4.2.x-TestSuite-jrockit15 - Build # 198 - Unstable:
Check console output at null/job/JBoss-AS-4.2.x-TestSuite-jrockit15/198 to view the results.
Modifications since last build:
[adrian(a)jboss.org] [JBAS-6381] - Temporary workaround for ConcurrentModificationException
16 years, 1 month
Build failed in Hudson: jboss-aop-head-jbossas-5.0.0.GA #7
by jboss-qa-internal@redhat.com
See http://hudson.qa.jboss.com/hudson/job/jboss-aop-head-jbossas-5.0.0.GA/7/c...
Changes:
[pgier] [JBBUILD-511] Add the eula back to the resources for the jar.
------------------------------------------
[...truncated 28369 lines...]
+ echo -e 'GET / HTTP/1.0\nConnection: close\n\n'
+ sleep 5
+ telnet localhost 8080
+ TELNET=22602
+ wait 22602
+ grep -q '^HTTP/.* 200 OK$'
+ kill 22603
+ (( 120 > 1007 - 987 ))
+ echo -e 'GET / HTTP/1.0\nConnection: close\n\n'
+ sleep 5
+ telnet localhost 8080
+ grep -q '^HTTP/.* 200 OK$'
+ TELNET=22625
+ wait 22625
+ kill 22627
+ (( 120 > 1012 - 987 ))
+ echo -e 'GET / HTTP/1.0\nConnection: close\n\n'
+ sleep 5
+ telnet localhost 8080
+ TELNET=22632
+ grep -q '^HTTP/.* 200 OK$'
+ wait 22632
+ kill 22634
+ (( 120 > 1017 - 987 ))
+ grep -q '^HTTP/.* 200 OK$'
+ echo -e 'GET / HTTP/1.0\nConnection: close\n\n'
+ sleep 5
+ telnet localhost 8080
+ TELNET=22661
+ wait 22661
+ kill 22662
+ (( 120 > 1022 - 987 ))
+ echo -e 'GET / HTTP/1.0\nConnection: close\n\n'
+ sleep 5
+ telnet localhost 8080
+ grep -q '^HTTP/.* 200 OK$'
+ TELNET=22667
+ wait 22667
+ kill 22669
+ (( 120 > 1027 - 987 ))
+ echo -e 'GET / HTTP/1.0\nConnection: close\n\n'
+ sleep 5
+ telnet localhost 8080
+ TELNET=22736
+ wait 22736
+ grep -q '^HTTP/.* 200 OK$'
+ kill 22737
+ (( 120 > 1032 - 987 ))
+ echo -e 'GET / HTTP/1.0\nConnection: close\n\n'
+ sleep 5
+ telnet localhost 8080
+ TELNET=22752
+ grep -q '^HTTP/.* 200 OK$'
+ wait 22752
+ kill 22753
+ (( 120 > 1037 - 987 ))
+ echo -e 'GET / HTTP/1.0\nConnection: close\n\n'
+ sleep 5
+ grep -q '^HTTP/.* 200 OK$'
+ telnet localhost 8080
+ TELNET=22784
+ wait 22784
+ kill 22786
+ (( 120 > 1042 - 987 ))
+ grep -q '^HTTP/.* 200 OK$'
+ echo -e 'GET / HTTP/1.0\nConnection: close\n\n'
+ sleep 5
+ telnet localhost 8080
+ TELNET=22846
+ wait 22846
+ kill 22847
+ (( 120 > 1047 - 987 ))
+ echo -e 'GET / HTTP/1.0\nConnection: close\n\n'
+ sleep 5
+ telnet localhost 8080
+ TELNET=22892
+ grep -q '^HTTP/.* 200 OK$'
+ wait 22892
+ kill 22893
+ (( 120 > 1052 - 987 ))
+ echo -e 'GET / HTTP/1.0\nConnection: close\n\n'
+ sleep 5
+ telnet localhost 8080
+ TELNET=22920
+ wait 22920
+ grep -q '^HTTP/.* 200 OK$'
+ kill 22921
+ exit 0
+ echo Server started successfully.
Server started successfully.
+ cd http://hudson.qa.jboss.com/hudson/job/jboss-aop-head-jbossas-5.0.0.GA/ws/...
+ bash build.sh test -Dtest=aop
Searching for build.xml ...
Buildfile: http://hudson.qa.jboss.com/hudson/job/jboss-aop-head-jbossas-5.0.0.GA/ws/...
test:
[mkdir] Created dir: http://hudson.qa.jboss.com/hudson/job/jboss-aop-head-jbossas-5.0.0.GA/ws/...
[junit] Running org.jboss.test.aop.test.AOPUnitTestCase
[junit] Tests run: 0, Failures: 0, Errors: 1, Time elapsed: 4.585 sec
[junit] Test org.jboss.test.aop.test.AOPUnitTestCase FAILED
[junit] Running org.jboss.test.aop.test.AnnotatedTestCase
[junit] Tests run: 0, Failures: 0, Errors: 1, Time elapsed: 1.405 sec
[junit] Test org.jboss.test.aop.test.AnnotatedTestCase FAILED
[junit] Running org.jboss.test.aop.test.DeployersInitialTestCase
[junit] Tests run: 2, Failures: 0, Errors: 1, Time elapsed: 65.7 sec
[junit] Test org.jboss.test.aop.test.DeployersInitialTestCase FAILED
[junit] Running org.jboss.test.aop.test.ExtenderTestCase
[junit] Tests run: 1, Failures: 0, Errors: 0, Time elapsed: 3.39 sec
[junit] Running org.jboss.test.aop.test.JMXUnitTestCase
[junit] Tests run: 1, Failures: 0, Errors: 0, Time elapsed: 64.475 sec
[junit] Running org.jboss.test.aop.test.MicrocontainerDefaultAnnotationUnitTestCase
[junit] Tests run: 2, Failures: 0, Errors: 2, Time elapsed: 0.916 sec
[junit] Test org.jboss.test.aop.test.MicrocontainerDefaultAnnotationUnitTestCase FAILED
[junit] Running org.jboss.test.aop.test.MicrocontainerJMXUnitTestCase
[junit] Tests run: 5, Failures: 0, Errors: 5, Time elapsed: 1.506 sec
[junit] Test org.jboss.test.aop.test.MicrocontainerJMXUnitTestCase FAILED
[junit] Running org.jboss.test.aop.test.NotWovenScopedDependencyUnitTestCase
[junit] Tests run: 2, Failures: 0, Errors: 2, Time elapsed: 3.83 sec
[junit] Test org.jboss.test.aop.test.NotWovenScopedDependencyUnitTestCase FAILED
[junit] Running org.jboss.test.aop.test.ObservableUnitTestCase
[junit] Tests run: 0, Failures: 0, Errors: 1, Time elapsed: 2.387 sec
[junit] Test org.jboss.test.aop.test.ObservableUnitTestCase FAILED
[junit] Running org.jboss.test.aop.test.ProxyCacheTestCase
[junit] Tests run: 2, Failures: 0, Errors: 2, Time elapsed: 226.765 sec
[junit] Test org.jboss.test.aop.test.ProxyCacheTestCase FAILED
[junit] Running org.jboss.test.aop.test.RemotingUnitTestCase
[junit] Tests run: 0, Failures: 0, Errors: 1, Time elapsed: 1.059 sec
[junit] Test org.jboss.test.aop.test.RemotingUnitTestCase FAILED
[junit] Running org.jboss.test.aop.test.ScopedAnnotatedTestCase
[junit] Tests run: 0, Failures: 0, Errors: 1, Time elapsed: 0.814 sec
[junit] Test org.jboss.test.aop.test.ScopedAnnotatedTestCase FAILED
[junit] Running org.jboss.test.aop.test.ScopedAttachUnitTestCase
[junit] Tests run: 0, Failures: 0, Errors: 1, Time elapsed: 0.813 sec
[junit] Test org.jboss.test.aop.test.ScopedAttachUnitTestCase FAILED
[junit] Running org.jboss.test.aop.test.ScopedEarWithClassesInWebInfTestCase
[junit] Tests run: 0, Failures: 0, Errors: 1, Time elapsed: 0.839 sec
[junit] Test org.jboss.test.aop.test.ScopedEarWithClassesInWebInfTestCase FAILED
[junit] Running org.jboss.test.aop.test.ScopedExtenderBaseLoadedScopedNoParentDelegationTestCase
[junit] Tests run: 0, Failures: 0, Errors: 1, Time elapsed: 0.332 sec
[junit] Test org.jboss.test.aop.test.ScopedExtenderBaseLoadedScopedNoParentDelegationTestCase FAILED
[junit] Running org.jboss.test.aop.test.ScopedExtenderBaseLoadedScopedParentDelegationTestCase
[junit] Tests run: 0, Failures: 0, Errors: 1, Time elapsed: 0.392 sec
[junit] Test org.jboss.test.aop.test.ScopedExtenderBaseLoadedScopedParentDelegationTestCase FAILED
[junit] Running org.jboss.test.aop.test.ScopedExtenderBaseNotLoadedScopedNoParentDelegationTestCase
[junit] Tests run: 0, Failures: 0, Errors: 1, Time elapsed: 0.358 sec
[junit] Test org.jboss.test.aop.test.ScopedExtenderBaseNotLoadedScopedNoParentDelegationTestCase FAILED
[junit] Running org.jboss.test.aop.test.ScopedExtenderBaseNotLoadedScopedParentDelegationTestCase
[junit] Tests run: 0, Failures: 0, Errors: 1, Time elapsed: 0.297 sec
[junit] Test org.jboss.test.aop.test.ScopedExtenderBaseNotLoadedScopedParentDelegationTestCase FAILED
[junit] Running org.jboss.test.aop.test.ScopedUnitTestCase
[junit] Tests run: 0, Failures: 0, Errors: 1, Time elapsed: 0.351 sec
[junit] Test org.jboss.test.aop.test.ScopedUnitTestCase FAILED
[junit] Running org.jboss.test.aop.test.ScopedWovenDependencyTestCase
[junit] Tests run: 2, Failures: 0, Errors: 2, Time elapsed: 8.244 sec
[junit] Test org.jboss.test.aop.test.ScopedWovenDependencyTestCase FAILED
[junit] Running org.jboss.test.aop.test.SecurityUnitTestCase
[junit] Tests run: 0, Failures: 0, Errors: 1, Time elapsed: 1.169 sec
[junit] Test org.jboss.test.aop.test.SecurityUnitTestCase FAILED
[junit] Running org.jboss.test.aop.test.SimpleBeanUnitTestCase
[junit] Tests run: 2, Failures: 0, Errors: 0, Time elapsed: 3.005 sec
[junit] Running org.jboss.test.aop.test.TxLockUnitTestCase
[junit] Tests run: 0, Failures: 0, Errors: 1, Time elapsed: 0.667 sec
[junit] Test org.jboss.test.aop.test.TxLockUnitTestCase FAILED
[junit] Running org.jboss.test.aop.test.TxUnitTestCase
[junit] Tests run: 0, Failures: 0, Errors: 1, Time elapsed: 0.962 sec
[junit] Test org.jboss.test.aop.test.TxUnitTestCase FAILED
[junit] Running org.jboss.test.aop.test.VersionedObjectUnitTestCase
[junit] Tests run: 0, Failures: 0, Errors: 1, Time elapsed: 0.92 sec
[junit] Test org.jboss.test.aop.test.VersionedObjectUnitTestCase FAILED
BUILD SUCCESSFUL
Total time: 7 minutes 53 seconds
+ stop-jboss -p http://hudson.qa.jboss.com/hudson/job/jboss-aop-head-jbossas-5.0.0.GA/ws/... -b localhost
+ local flag=
+ local OPTIND=1
+ getopts p:b:t:m: flag
+ case $flag in
+ local JBOSS_SHUTDOWN_PATH=http://hudson.qa.jboss.com/hudson/job/jboss-aop-head-...
+ getopts p:b:t:m: flag
+ case $flag in
+ local JBOSS_SERVER_BIND_ADDR=localhost
+ getopts p:b:t:m: flag
+ [[ -frs http://hudson.qa.jboss.com/hudson/job/jboss-aop-head-jbossas-5.0.0.GA/ws/... ]]
+ [[ -frs http://hudson.qa.jboss.com/hudson/job/jboss-aop-head-jbossas-5.0.0.GA/ws/... ]]
+ [[ -frs http://hudson.qa.jboss.com/hudson/job/jboss-aop-head-jbossas-5.0.0.GA/ws/... ]]
+ [[ -frs http://hudson.qa.jboss.com/hudson/job/jboss-aop-head-jbossas-5.0.0.GA/ws/... ]]
+ JBOSS_SHUTDOWN_PATH=http://hudson.qa.jboss.com/hudson/job/jboss-aop-head-...
+ chmod 770 http://hudson.qa.jboss.com/hudson/job/jboss-aop-head-jbossas-5.0.0.GA/ws/...
+ [[ -n localhost ]]
+ [[ -n '' ]]
+ local JBOSS_SERVER_SHUTDOWN_MODE=S
+ [[ '' -gt 0 ]]
+ local JBOSS_SERVER_TIMEOUT=90
+ local 'STOP_OPTS=-S -s localhost:1099'
+ echo Stopping server on IP localhost
Stopping server on IP localhost
+ echo With command '"http://hudson.qa.jboss.com/hudson/job/jboss-aop-head-jbossas-5.0.0.GA/ws/... -S -s localhost:1099"'
With command "http://hudson.qa.jboss.com/hudson/job/jboss-aop-head-jbossas-5.0.0.GA/ws/... -S -s localhost:1099"
+ http://hudson.qa.jboss.com/hudson/job/jboss-aop-head-jbossas-5.0.0.GA/ws/... -S -s localhost:1099
Exception in thread "main" javax.naming.CommunicationException: Could not obtain connection to any of these urls: localhost:1099 [Root exception is javax.naming.CommunicationException: Failed to connect to server localhost:1099 [Root exception is javax.naming.ServiceUnavailableException: Failed to connect to server localhost:1099 [Root exception is java.net.ConnectException: Connection refused]]]
at org.jnp.interfaces.NamingContext.checkRef(NamingContext.java:1727)
at org.jnp.interfaces.NamingContext.lookup(NamingContext.java:680)
at org.jnp.interfaces.NamingContext.lookup(NamingContext.java:673)
at javax.naming.InitialContext.lookup(InitialContext.java:351)
at org.jboss.Shutdown.main(Shutdown.java:219)
Caused by: javax.naming.CommunicationException: Failed to connect to server localhost:1099 [Root exception is javax.naming.ServiceUnavailableException: Failed to connect to server localhost:1099 [Root exception is java.net.ConnectException: Connection refused]]
at org.jnp.interfaces.NamingContext.getServer(NamingContext.java:311)
at org.jnp.interfaces.NamingContext.checkRef(NamingContext.java:1698)
... 4 more
Caused by: javax.naming.ServiceUnavailableException: Failed to connect to server localhost:1099 [Root exception is java.net.ConnectException: Connection refused]
at org.jnp.interfaces.NamingContext.getServer(NamingContext.java:281)
... 5 more
Caused by: java.net.ConnectException: Connection refused
at java.net.PlainSocketImpl.socketConnect(Native Method)
at java.net.PlainSocketImpl.doConnect(PlainSocketImpl.java:333)
at java.net.PlainSocketImpl.connectToAddress(PlainSocketImpl.java:195)
at java.net.PlainSocketImpl.connect(PlainSocketImpl.java:182)
at java.net.SocksSocketImpl.connect(SocksSocketImpl.java:366)
at java.net.Socket.connect(Socket.java:520)
at org.jnp.interfaces.TimedSocketFactory.createSocket(TimedSocketFactory.java:97)
at org.jnp.interfaces.TimedSocketFactory.createSocket(TimedSocketFactory.java:82)
at org.jnp.interfaces.NamingContext.getServer(NamingContext.java:277)
... 5 more
+ echo Failed to shutdown JBoss Server. Killing.
Failed to shutdown JBoss Server. Killing.
+ kill-jboss
++ uname -s
+ [[ Linux == \L\i\n\u\x ]]
+ ps -eaf --columns 2200
+ grep run.jar
+ grep -v grep
+ awk '{ print $2; }'
+ xargs kill
usage: kill [ -s signal | -p ] [ -a ] pid ...
kill -l [ signal ]
+ sleep 10
+ ps -eaf --columns 2200
+ grep run.jar
+ grep -v grep
+ awk '{ print $2; }'
+ xargs kill -9
usage: kill [ -s signal | -p ] [ -a ] pid ...
kill -l [ signal ]
+ return 0
+ return 1
Terminating xvnc
[jboss-aop-head-jbossas-5.0.0.GA] $ vncserver -kill :12
Killing Xvnc process ID 18414
Recording test results
16 years, 1 month