[Failure] devstudio-nightly-2.1.0.Alpha1 #179
by jboss-qa-internal@redhat.com
http://hudson.qa.jboss.com/hudson/job/devstudio-nightly-2.1.0.Alpha1/179/
http://hudson.qa.jboss.com/hudson/job/devstudio-nightly-2.1.0.Alpha1/179/...
http://hudson.qa.jboss.com/hudson/job/devstudio-nightly-2.1.0.Alpha1/179/...
http://hudson.qa.jboss.com/hudson/job/devstudio-nightly-2.1.0.Alpha1/179/...
--------------------------------------------------
Failed Tests:
No tests ran.
--------------------------------------------------
Changes:
[snjeza] https://jira.jboss.org/jira/browse/JBIDE-4292 Users should be able to add example sites without adding a plugin (externalized)
[dgolovin] JUnit tests errors fix for:
- junit.framework.AssertionFailedError: org.jboss.tools.jst.web.debug failed to load.
at org.jboss.tools.tests.PlugInLoadTest.isPluginResolved(PlugInLoadTest.java:36)
- junit.framework.AssertionFailedError: org.jboss.tools.struts.debug failed to load.
at org.jboss.tools.tests.PlugInLoadTest.isPluginResolved(PlugInLoadTest.java:36)
[abogachuk] https://jira.jboss.org/jira/browse/JBDS-414 - added info about the option available in the Preferences of VPE
[abogachuk] https://jira.jboss.org/jira/browse/JBDS-414 - screenshot changed to show the Preferences tab with the new option available.
[dmaliarevich] Test Suite title was corrected.
[akazakov] https://jira.jboss.org/jira/browse/JBIDE-2808
[dmaliarevich] https://jira.jboss.org/jira/browse/JBIDE-4271, sash switching logic was corrected.
[ochikvina] https://jira.jboss.org/jira/browse/JBDS-451 - adding Guvnor Tools Ref guide;
[ochikvina] https://jira.jboss.org/jira/browse/JBDS-451 - adding Guvnor Tools Ref guide into index page;
[ochikvina] https://jira.jboss.org/jira/browse/JBDS-451 - adding Guvnor Tools Reference guide;
[scabanovich] https://jira.jboss.org/jira/browse/JBIDE-4303
[scabanovich] https://jira.jboss.org/jira/browse/JBIDE-4303
[scabanovich] https://jira.jboss.org/jira/browse/JBIDE-4303
[scabanovich] https://jira.jboss.org/jira/browse/JBIDE-4303
[scabanovich] https://jira.jboss.org/jira/browse/JBIDE-4303
[rob.stryker(a)jboss.com] JBIDE-3896 - implemented as shown
[DartPeng] JBIDE-4232
change the tooltip of notification image
[DartPeng] JBIDE-4232
change the notification image position
[DartPeng] JBIDE-4298
change some label text
[dgolovin] fix PMD violations after local build is finally up on Eclipse 3.5M7
[koen.aers(a)jboss.com] 4.0.0.beta2 release
[koen.aers(a)jboss.com] 4.0.0.beta2 release
[koen.aers(a)jboss.com] enable mail, remove subprocess from palette
[dgolovin] https://jira.jboss.org/jira/browse/JBIDE-4302 - line that cause the error was commented out to keep build running. That was tested locally and looks like it isn't needed anymore. The original reason was to avoid showing intro first time, to keep VPE working.
[nickboldt] move up to M7
[nickboldt] hack for gef and emf/xsd urls
[nickboldt] fetch from closest mirror; make wget verbose to see which mirror is selected
--------------------------------------------------
Console log:
[...truncated 1843 lines...]
[java] A /home/hudson/hudson_workspace/workspace/devstudio-nightly-2.1.0.Alpha1/jbds-build/eclipse/plugins/org.guvnor.tools/src/org/guvnor/tools/actions/DisconnectAction.java
[java] A /home/hudson/hudson_workspace/workspace/devstudio-nightly-2.1.0.Alpha1/jbds-build/eclipse/plugins/org.guvnor.tools/src/org/guvnor/tools/actions/CompareVersionAction.java
[java] A /home/hudson/hudson_workspace/workspace/devstudio-nightly-2.1.0.Alpha1/jbds-build/eclipse/plugins/org.guvnor.tools/src/org/guvnor/tools/actions/RepositoryElementPropsAction.java
[java] A /home/hudson/hudson_workspace/workspace/devstudio-nightly-2.1.0.Alpha1/jbds-build/eclipse/plugins/org.guvnor.tools/src/org/guvnor/tools/actions/GuvnorCompareEditorInput.java
[java] A /home/hudson/hudson_workspace/workspace/devstudio-nightly-2.1.0.Alpha1/jbds-build/eclipse/plugins/org.guvnor.tools/src/org/guvnor/tools/utils
[java] A /home/hudson/hudson_workspace/workspace/devstudio-nightly-2.1.0.Alpha1/jbds-build/eclipse/plugins/org.guvnor.tools/src/org/guvnor/tools/utils/AuthenticationPromptDialog.java
[java] A /home/hudson/hudson_workspace/workspace/devstudio-nightly-2.1.0.Alpha1/jbds-build/eclipse/plugins/org.guvnor.tools/src/org/guvnor/tools/utils/GuvnorMetadataUtils.java
[java] A /home/hudson/hudson_workspace/workspace/devstudio-nightly-2.1.0.Alpha1/jbds-build/eclipse/plugins/org.guvnor.tools/src/org/guvnor/tools/utils/GuvnorMetadataProps.java
[java] A /home/hudson/hudson_workspace/workspace/devstudio-nightly-2.1.0.Alpha1/jbds-build/eclipse/plugins/org.guvnor.tools/src/org/guvnor/tools/utils/PlatformUtils.java
[java] A /home/hudson/hudson_workspace/workspace/devstudio-nightly-2.1.0.Alpha1/jbds-build/eclipse/plugins/org.guvnor.tools/src/org/guvnor/tools/utils/StringInput.java
[java] A /home/hudson/hudson_workspace/workspace/devstudio-nightly-2.1.0.Alpha1/jbds-build/eclipse/plugins/org.guvnor.tools/src/org/guvnor/tools/utils/ResourceHistorySorter.java
[java] A /home/hudson/hudson_workspace/workspace/devstudio-nightly-2.1.0.Alpha1/jbds-build/eclipse/plugins/org.guvnor.tools/src/org/guvnor/tools/utils/VersionChooserDialog.java
[java] A /home/hudson/hudson_workspace/workspace/devstudio-nightly-2.1.0.Alpha1/jbds-build/eclipse/plugins/org.guvnor.tools/src/org/guvnor/tools/utils/webdav
[java] A /home/hudson/hudson_workspace/workspace/devstudio-nightly-2.1.0.Alpha1/jbds-build/eclipse/plugins/org.guvnor.tools/src/org/guvnor/tools/utils/webdav/WebDavClientFactory.java
[java] A /home/hudson/hudson_workspace/workspace/devstudio-nightly-2.1.0.Alpha1/jbds-build/eclipse/plugins/org.guvnor.tools/src/org/guvnor/tools/utils/webdav/IWebDavClient.java
[java] A /home/hudson/hudson_workspace/workspace/devstudio-nightly-2.1.0.Alpha1/jbds-build/eclipse/plugins/org.guvnor.tools/src/org/guvnor/tools/utils/webdav/WebDavAuthenticator.java
[java] A /home/hudson/hudson_workspace/workspace/devstudio-nightly-2.1.0.Alpha1/jbds-build/eclipse/plugins/org.guvnor.tools/src/org/guvnor/tools/utils/webdav/WebDavServerCache.java
[java] A /home/hudson/hudson_workspace/workspace/devstudio-nightly-2.1.0.Alpha1/jbds-build/eclipse/plugins/org.guvnor.tools/src/org/guvnor/tools/utils/webdav/ResourceProperties.java
[java] A /home/hudson/hudson_workspace/workspace/devstudio-nightly-2.1.0.Alpha1/jbds-build/eclipse/plugins/org.guvnor.tools/src/org/guvnor/tools/utils/webdav/DebugHttpClient.java
[java] A /home/hudson/hudson_workspace/workspace/devstudio-nightly-2.1.0.Alpha1/jbds-build/eclipse/plugins/org.guvnor.tools/src/org/guvnor/tools/utils/webdav/WebDavClient.java
[java] A /home/hudson/hudson_workspace/workspace/devstudio-nightly-2.1.0.Alpha1/jbds-build/eclipse/plugins/org.guvnor.tools/src/org/guvnor/tools/utils/webdav/WebDavException.java
[java] A /home/hudson/hudson_workspace/workspace/devstudio-nightly-2.1.0.Alpha1/jbds-build/eclipse/plugins/org.guvnor.tools/src/org/guvnor/tools/utils/webdav/WebDavSessionAuthenticator.java
[java] A /home/hudson/hudson_workspace/workspace/devstudio-nightly-2.1.0.Alpha1/jbds-build/eclipse/plugins/org.guvnor.tools/src/org/guvnor/tools/utils/webdav/StreamProcessingUtils.java
[java] A /home/hudson/hudson_workspace/workspace/devstudio-nightly-2.1.0.Alpha1/jbds-build/eclipse/plugins/org.guvnor.tools/src/org/guvnor/tools/utils/StringStorage.java
[java] A /home/hudson/hudson_workspace/workspace/devstudio-nightly-2.1.0.Alpha1/jbds-build/eclipse/plugins/org.guvnor.tools/src/org/guvnor/tools/utils/ActionUtils.java
[java] A /home/hudson/hudson_workspace/workspace/devstudio-nightly-2.1.0.Alpha1/jbds-build/eclipse/plugins/org.guvnor.tools/src/org/guvnor/tools/preferences
[java] A /home/hudson/hudson_workspace/workspace/devstudio-nightly-2.1.0.Alpha1/jbds-build/eclipse/plugins/org.guvnor.tools/src/org/guvnor/tools/preferences/IGuvnorPreferenceConstants.java
[java] A /home/hudson/hudson_workspace/workspace/devstudio-nightly-2.1.0.Alpha1/jbds-build/eclipse/plugins/org.guvnor.tools/src/org/guvnor/tools/preferences/GuvnorPreferencePage.java
[java] A /home/hudson/hudson_workspace/workspace/devstudio-nightly-2.1.0.Alpha1/jbds-build/eclipse/plugins/org.guvnor.tools/src/org/guvnor/tools/messages.properties
[java] A /home/hudson/hudson_workspace/workspace/devstudio-nightly-2.1.0.Alpha1/jbds-build/eclipse/plugins/org.guvnor.tools/src/org/guvnor/tools/GuvnorDecorator.java
[java] A /home/hudson/hudson_workspace/workspace/devstudio-nightly-2.1.0.Alpha1/jbds-build/eclipse/plugins/org.guvnor.tools/src/org/guvnor/tools/ResourceChangeListener.java
[java] A /home/hudson/hudson_workspace/workspace/devstudio-nightly-2.1.0.Alpha1/jbds-build/eclipse/plugins/org.guvnor.tools/src/org/guvnor/tools/wizards
[java] A /home/hudson/hudson_workspace/workspace/devstudio-nightly-2.1.0.Alpha1/jbds-build/eclipse/plugins/org.guvnor.tools/src/org/guvnor/tools/wizards/AddResourceWizard.java
[java] A /home/hudson/hudson_workspace/workspace/devstudio-nightly-2.1.0.Alpha1/jbds-build/eclipse/plugins/org.guvnor.tools/src/org/guvnor/tools/wizards/WizardUtils.java
[java] A /home/hudson/hudson_workspace/workspace/devstudio-nightly-2.1.0.Alpha1/jbds-build/eclipse/plugins/org.guvnor.tools/src/org/guvnor/tools/wizards/GuvWizardModel.java
[java] A /home/hudson/hudson_workspace/workspace/devstudio-nightly-2.1.0.Alpha1/jbds-build/eclipse/plugins/org.guvnor.tools/src/org/guvnor/tools/wizards/SelectGuvnorRepPage.java
[java] A /home/hudson/hudson_workspace/workspace/devstudio-nightly-2.1.0.Alpha1/jbds-build/eclipse/plugins/org.guvnor.tools/src/org/guvnor/tools/wizards/CheckoutWizard.java
[java] A /home/hudson/hudson_workspace/workspace/devstudio-nightly-2.1.0.Alpha1/jbds-build/eclipse/plugins/org.guvnor.tools/src/org/guvnor/tools/wizards/GuvnorMainConfigPage.java
[java] A /home/hudson/hudson_workspace/workspace/devstudio-nightly-2.1.0.Alpha1/jbds-build/eclipse/plugins/org.guvnor.tools/src/org/guvnor/tools/wizards/SelectGuvnorResourcesPage.java
[java] A /home/hudson/hudson_workspace/workspace/devstudio-nightly-2.1.0.Alpha1/jbds-build/eclipse/plugins/org.guvnor.tools/src/org/guvnor/tools/wizards/GuvWizNewProjectPage.java
[java] A /home/hudson/hudson_workspace/workspace/devstudio-nightly-2.1.0.Alpha1/jbds-build/eclipse/plugins/org.guvnor.tools/src/org/guvnor/tools/wizards/SelectGuvnorFolderPage.java
[java] A /home/hudson/hudson_workspace/workspace/devstudio-nightly-2.1.0.Alpha1/jbds-build/eclipse/plugins/org.guvnor.tools/src/org/guvnor/tools/wizards/IGuvnorWizard.java
[java] A /home/hudson/hudson_workspace/workspace/devstudio-nightly-2.1.0.Alpha1/jbds-build/eclipse/plugins/org.guvnor.tools/src/org/guvnor/tools/wizards/NewRepLocationWizard.java
[java] A /home/hudson/hudson_workspace/workspace/devstudio-nightly-2.1.0.Alpha1/jbds-build/eclipse/plugins/org.guvnor.tools/src/org/guvnor/tools/wizards/SelectResourceVersionPage.java
[java] A /home/hudson/hudson_workspace/workspace/devstudio-nightly-2.1.0.Alpha1/jbds-build/eclipse/plugins/org.guvnor.tools/src/org/guvnor/tools/wizards/SelectLocalTargetPage.java
[java] A /home/hudson/hudson_workspace/workspace/devstudio-nightly-2.1.0.Alpha1/jbds-build/eclipse/plugins/org.guvnor.tools/src/org/guvnor/tools/GuvnorLocationManager.java
[java] A /home/hudson/hudson_workspace/workspace/devstudio-nightly-2.1.0.Alpha1/jbds-build/eclipse/plugins/org.guvnor.tools/src/org/guvnor/tools/Messages.java
[java] A /home/hudson/hudson_workspace/workspace/devstudio-nightly-2.1.0.Alpha1/jbds-build/eclipse/plugins/org.guvnor.tools/src/org/guvnor/tools/Activator.java
[java] A /home/hudson/hudson_workspace/workspace/devstudio-nightly-2.1.0.Alpha1/jbds-build/eclipse/plugins/org.guvnor.tools/src/org/guvnor/tools/perspectives
[java] A /home/hudson/hudson_workspace/workspace/devstudio-nightly-2.1.0.Alpha1/jbds-build/eclipse/plugins/org.guvnor.tools/src/org/guvnor/tools/perspectives/GuvnorRepExplorerPerspective.java
[java] A /home/hudson/hudson_workspace/workspace/devstudio-nightly-2.1.0.Alpha1/jbds-build/eclipse/plugins/org.guvnor.tools/src/org/guvnor/tools/properties
[java] A /home/hudson/hudson_workspace/workspace/devstudio-nightly-2.1.0.Alpha1/jbds-build/eclipse/plugins/org.guvnor.tools/src/org/guvnor/tools/properties/GuvnorWorkspaceFilePage.java
[java] A /home/hudson/hudson_workspace/workspace/devstudio-nightly-2.1.0.Alpha1/jbds-build/eclipse/plugins/org.guvnor.tools/src/org/guvnor/tools/properties/RepositoryElementPropsDialog.java
[java] A /home/hudson/hudson_workspace/workspace/devstudio-nightly-2.1.0.Alpha1/jbds-build/eclipse/plugins/org.guvnor.tools/src/org/guvnor/tools/views
[java] A /home/hudson/hudson_workspace/workspace/devstudio-nightly-2.1.0.Alpha1/jbds-build/eclipse/plugins/org.guvnor.tools/src/org/guvnor/tools/views/ResourceHistoryContentProvider.java
[java] A /home/hudson/hudson_workspace/workspace/devstudio-nightly-2.1.0.Alpha1/jbds-build/eclipse/plugins/org.guvnor.tools/src/org/guvnor/tools/views/model
[java] A /home/hudson/hudson_workspace/workspace/devstudio-nightly-2.1.0.Alpha1/jbds-build/eclipse/plugins/org.guvnor.tools/src/org/guvnor/tools/views/model/TreePropertyProvider.java
[java] A /home/hudson/hudson_workspace/workspace/devstudio-nightly-2.1.0.Alpha1/jbds-build/eclipse/plugins/org.guvnor.tools/src/org/guvnor/tools/views/model/TreeObject.java
[java] A /home/hudson/hudson_workspace/workspace/devstudio-nightly-2.1.0.Alpha1/jbds-build/eclipse/plugins/org.guvnor.tools/src/org/guvnor/tools/views/model/TreeParent.java
[java] A /home/hudson/hudson_workspace/workspace/devstudio-nightly-2.1.0.Alpha1/jbds-build/eclipse/plugins/org.guvnor.tools/src/org/guvnor/tools/views/model/ResourceHistoryEntry.java
[java] A /home/hudson/hudson_workspace/workspace/devstudio-nightly-2.1.0.Alpha1/jbds-build/eclipse/plugins/org.guvnor.tools/src/org/guvnor/tools/views/ResourceHistoryLabelProvider.java
[java] A /home/hudson/hudson_workspace/workspace/devstudio-nightly-2.1.0.Alpha1/jbds-build/eclipse/plugins/org.guvnor.tools/src/org/guvnor/tools/views/ResourceHistoryView.java
[java] A /home/hudson/hudson_workspace/workspace/devstudio-nightly-2.1.0.Alpha1/jbds-build/eclipse/plugins/org.guvnor.tools/src/org/guvnor/tools/views/RepositoryContentProvider.java
[java] A /home/hudson/hudson_workspace/workspace/devstudio-nightly-2.1.0.Alpha1/jbds-build/eclipse/plugins/org.guvnor.tools/src/org/guvnor/tools/views/IGuvnorConstants.java
[java] A /home/hudson/hudson_workspace/workspace/devstudio-nightly-2.1.0.Alpha1/jbds-build/eclipse/plugins/org.guvnor.tools/src/org/guvnor/tools/views/RepositoryLabelProvider.java
[java] A /home/hudson/hudson_workspace/workspace/devstudio-nightly-2.1.0.Alpha1/jbds-build/eclipse/plugins/org.guvnor.tools/src/org/guvnor/tools/views/RepositoryView.java
[java] A /home/hudson/hudson_workspace/workspace/devstudio-nightly-2.1.0.Alpha1/jbds-build/eclipse/plugins/org.guvnor.tools/bin
[java] A /home/hudson/hudson_workspace/workspace/devstudio-nightly-2.1.0.Alpha1/jbds-build/eclipse/plugins/org.guvnor.tools/.options
[java] A /home/hudson/hudson_workspace/workspace/devstudio-nightly-2.1.0.Alpha1/jbds-build/eclipse/plugins/org.guvnor.tools/plugin.properties
[java] A /home/hudson/hudson_workspace/workspace/devstudio-nightly-2.1.0.Alpha1/jbds-build/eclipse/plugins/org.guvnor.tools/build.properties
[java] A /home/hudson/hudson_workspace/workspace/devstudio-nightly-2.1.0.Alpha1/jbds-build/eclipse/plugins/org.guvnor.tools/icons
[java] A /home/hudson/hudson_workspace/workspace/devstudio-nightly-2.1.0.Alpha1/jbds-build/eclipse/plugins/org.guvnor.tools/icons/guvnor_rep_add.gif
[java] A /home/hudson/hudson_workspace/workspace/devstudio-nightly-2.1.0.Alpha1/jbds-build/eclipse/plugins/org.guvnor.tools/icons/guvnor_controlled_dirty.gif
[java] A /home/hudson/hudson_workspace/workspace/devstudio-nightly-2.1.0.Alpha1/jbds-build/eclipse/plugins/org.guvnor.tools/icons/guvnor_rep_wizban.gif
[java] A /home/hudson/hudson_workspace/workspace/devstudio-nightly-2.1.0.Alpha1/jbds-build/eclipse/plugins/org.guvnor.tools/icons/guvnor_controlled.gif
[java] A /home/hudson/hudson_workspace/workspace/devstudio-nightly-2.1.0.Alpha1/jbds-build/eclipse/plugins/org.guvnor.tools/icons/guvnor_rep.gif
[java] A /home/hudson/hudson_workspace/workspace/devstudio-nightly-2.1.0.Alpha1/jbds-build/eclipse/plugins/org.guvnor.tools/about.html
[java] A /home/hudson/hudson_workspace/workspace/devstudio-nightly-2.1.0.Alpha1/jbds-build/eclipse/plugins/org.guvnor.tools/plugin.xml
[java] Exported revision 26486.
[java]
[java] fetch.recursively:
[java]
[java] init:
[java]
[java] fetchElement:
[java]
[java] fetch:
[java]
[java] fetch.element:
[java]
[java] FetchFromSVN:
[java] [svn] Using javasvn
[java] Svn : Exporting
[java] export -r HEAD http://anonsvn.jboss.org/repos/labs/labs/jbossrules/trunk/drools-eclipse/... /home/hudson/hudson_workspace/workspace/devstudio-nightly-2.1.0.Alpha1/jbds-build/eclipse/features/org.drools.eclipse.test.feature
[java] A /home/hudson/hudson_workspace/workspace/devstudio-nightly-2.1.0.Alpha1/jbds-build/eclipse/features/org.drools.eclipse.test.feature
[java] A /home/hudson/hudson_workspace/workspace/devstudio-nightly-2.1.0.Alpha1/jbds-build/eclipse/features/org.drools.eclipse.test.feature/.project
[java] A /home/hudson/hudson_workspace/workspace/devstudio-nightly-2.1.0.Alpha1/jbds-build/eclipse/features/org.drools.eclipse.test.feature/build.properties
[java] A /home/hudson/hudson_workspace/workspace/devstudio-nightly-2.1.0.Alpha1/jbds-build/eclipse/features/org.drools.eclipse.test.feature/feature.xml
[java] A /home/hudson/hudson_workspace/workspace/devstudio-nightly-2.1.0.Alpha1/jbds-build/eclipse/features/org.drools.eclipse.test.feature/pom.xml
[java] Exported revision 26486.
[java]
[java] fetch.plugins:
[java]
[java] FetchFromSVN:
[java] [svn] Using javasvn
[java] Svn : Exporting
[java] export -r HEAD http://anonsvn.jboss.org/repos/labs/labs/jbossrules/trunk/drools-eclipse/... /home/hudson/hudson_workspace/workspace/devstudio-nightly-2.1.0.Alpha1/jbds-build/eclipse/plugins/org.drools.eclipse.test
[java] A /home/hudson/hudson_workspace/workspace/devstudio-nightly-2.1.0.Alpha1/jbds-build/eclipse/plugins/org.drools.eclipse.test
[java] A /home/hudson/hudson_workspace/workspace/devstudio-nightly-2.1.0.Alpha1/jbds-build/eclipse/plugins/org.drools.eclipse.test/.classpath
[java] A /home/hudson/hudson_workspace/workspace/devstudio-nightly-2.1.0.Alpha1/jbds-build/eclipse/plugins/org.drools.eclipse.test/META-INF
[java] A /home/hudson/hudson_workspace/workspace/devstudio-nightly-2.1.0.Alpha1/jbds-build/eclipse/plugins/org.drools.eclipse.test/META-INF/MANIFEST.MF
[java] A /home/hudson/hudson_workspace/workspace/devstudio-nightly-2.1.0.Alpha1/jbds-build/eclipse/plugins/org.drools.eclipse.test/.project
[java] A /home/hudson/hudson_workspace/workspace/devstudio-nightly-2.1.0.Alpha1/jbds-build/eclipse/plugins/org.drools.eclipse.test/src
[java] A /home/hudson/hudson_workspace/workspace/devstudio-nightly-2.1.0.Alpha1/jbds-build/eclipse/plugins/org.drools.eclipse.test/src/test
[java] A /home/hudson/hudson_workspace/workspace/devstudio-nightly-2.1.0.Alpha1/jbds-build/eclipse/plugins/org.drools.eclipse.test/src/test/java
[java] A /home/hudson/hudson_workspace/workspace/devstudio-nightly-2.1.0.Alpha1/jbds-build/eclipse/plugins/org.drools.eclipse.test/src/test/java/org
[java] A /home/hudson/hudson_workspace/workspace/devstudio-nightly-2.1.0.Alpha1/jbds-build/eclipse/plugins/org.drools.eclipse.test/src/test/java/org/drools
[java] A /home/hudson/hudson_workspace/workspace/devstudio-nightly-2.1.0.Alpha1/jbds-build/eclipse/plugins/org.drools.eclipse.test/src/test/java/org/drools/eclipse
[java] A /home/hudson/hudson_workspace/workspace/devstudio-nightly-2.1.0.Alpha1/jbds-build/eclipse/plugins/org.drools.eclipse.test/src/test/java/org/drools/eclipse/wizard
[java] A /home/hudson/hudson_workspace/workspace/devstudio-nightly-2.1.0.Alpha1/jbds-build/eclipse/plugins/org.drools.eclipse.test/src/test/java/org/drools/eclipse/wizard/rule
[java] A /home/hudson/hudson_workspace/workspace/devstudio-nightly-2.1.0.Alpha1/jbds-build/eclipse/plugins/org.drools.eclipse.test/src/test/java/org/drools/eclipse/wizard/rule/DRLGenTemplateTest.java
[java] A /home/hudson/hudson_workspace/workspace/devstudio-nightly-2.1.0.Alpha1/jbds-build/eclipse/plugins/org.drools.eclipse.test/src/test/java/org/drools/eclipse/dsl
[java] A /home/hudson/hudson_workspace/workspace/devstudio-nightly-2.1.0.Alpha1/jbds-build/eclipse/plugins/org.drools.eclipse.test/src/test/java/org/drools/eclipse/dsl/editor
[java] A /home/hudson/hudson_workspace/workspace/devstudio-nightly-2.1.0.Alpha1/jbds-build/eclipse/plugins/org.drools.eclipse.test/src/test/java/org/drools/eclipse/dsl/editor/test.dsl
[java] A /home/hudson/hudson_workspace/workspace/devstudio-nightly-2.1.0.Alpha1/jbds-build/eclipse/plugins/org.drools.eclipse.test/src/test/java/org/drools/eclipse/dsl/editor/DSLAdapterTest.java
[java] A /home/hudson/hudson_workspace/workspace/devstudio-nightly-2.1.0.Alpha1/jbds-build/eclipse/plugins/org.drools.eclipse.test/src/test/java/org/drools/eclipse/debug
[java] A /home/hudson/hudson_workspace/workspace/devstudio-nightly-2.1.0.Alpha1/jbds-build/eclipse/plugins/org.drools.eclipse.test/src/test/java/org/drools/eclipse/debug/DebugViewsTest.java
[java] A /home/hudson/hudson_workspace/workspace/devstudio-nightly-2.1.0.Alpha1/jbds-build/eclipse/plugins/org.drools.eclipse.test/src/test/java/org/drools/eclipse/AllTestsUtil.java
[java] A /home/hudson/hudson_workspace/workspace/devstudio-nightly-2.1.0.Alpha1/jbds-build/eclipse/plugins/org.drools.eclipse.test/src/test/java/org/drools/eclipse/editors
[java] A /home/hudson/hudson_workspace/workspace/devstudio-nightly-2.1.0.Alpha1/jbds-build/eclipse/plugins/org.drools.eclipse.test/src/test/java/org/drools/eclipse/editors/outline
[java] A /home/hudson/hudson_workspace/workspace/devstudio-nightly-2.1.0.Alpha1/jbds-build/eclipse/plugins/org.drools.eclipse.test/src/test/java/org/drools/eclipse/editors/outline/RuleContentOutlineTest.java
[java] A /home/hudson/hudson_workspace/workspace/devstudio-nightly-2.1.0.Alpha1/jbds-build/eclipse/plugins/org.drools.eclipse.test/src/test/java/org/drools/eclipse/editors/rete
[java] A /home/hudson/hudson_workspace/workspace/devstudio-nightly-2.1.0.Alpha1/jbds-build/eclipse/plugins/org.drools.eclipse.test/src/test/java/org/drools/eclipse/editors/rete/ReteooLayoutFactoryTest.java
[java] A /home/hudson/hudson_workspace/workspace/devstudio-nightly-2.1.0.Alpha1/jbds-build/eclipse/plugins/org.drools.eclipse.test/src/test/java/org/drools/eclipse/editors/rete/ZoomControlTest.java
[java] A /home/hudson/hudson_workspace/workspace/devstudio-nightly-2.1.0.Alpha1/jbds-build/eclipse/plugins/org.drools.eclipse.test/src/test/java/org/drools/eclipse/editors/completion
[java] A /home/hudson/hudson_workspace/workspace/devstudio-nightly-2.1.0.Alpha1/jbds-build/eclipse/plugins/org.drools.eclipse.test/src/test/java/org/drools/eclipse/editors/completion/RuleCompletionProcessorTest.java
[java] A /home/hudson/hudson_workspace/workspace/devstudio-nightly-2.1.0.Alpha1/jbds-build/eclipse/plugins/org.drools.eclipse.test/src/test/java/org/drools/eclipse/editors/completion/MockCompletionProcessor.java
[java] A /home/hudson/hudson_workspace/workspace/devstudio-nightly-2.1.0.Alpha1/jbds-build/eclipse/plugins/org.drools.eclipse.test/src/test/java/org/drools/eclipse/editors/completion/ContextScanningTest.java
[java] A /home/hudson/hudson_workspace/workspace/devstudio-nightly-2.1.0.Alpha1/jbds-build/eclipse/plugins/org.drools.eclipse.test/src/test/java/org/drools/eclipse/editors/completion/CompletionUtilTest.java
[java] A /home/hudson/hudson_workspace/workspace/devstudio-nightly-2.1.0.Alpha1/jbds-build/eclipse/plugins/org.drools.eclipse.test/src/test/java/org/drools/eclipse/editors/completion/KeywordsTest.java
[java] A /home/hudson/hudson_workspace/workspace/devstudio-nightly-2.1.0.Alpha1/jbds-build/eclipse/plugins/org.drools.eclipse.test/src/test/java/org/drools/eclipse/editors/completion/MvelParsingTest.java
[java] A /home/hudson/hudson_workspace/workspace/devstudio-nightly-2.1.0.Alpha1/jbds-build/eclipse/plugins/org.drools.eclipse.test/src/test/java/org/drools/eclipse/editors/completion/DRLCompletionProcessorTest.java
[java] A /home/hudson/hudson_workspace/workspace/devstudio-nightly-2.1.0.Alpha1/jbds-build/eclipse/plugins/org.drools.eclipse.test/src/test/java/org/drools/eclipse/editors/completion/AbstractCompletionProcessorTest.java
[java] A /home/hudson/hudson_workspace/workspace/devstudio-nightly-2.1.0.Alpha1/jbds-build/eclipse/plugins/org.drools.eclipse.test/src/test/java/org/drools/eclipse/editors/completion/CompletionContextTest.java
[java] A /home/hudson/hudson_workspace/workspace/devstudio-nightly-2.1.0.Alpha1/jbds-build/eclipse/plugins/org.drools.eclipse.test/src/test/java/org/drools/eclipse/AllTests.java
[java] A /home/hudson/hudson_workspace/workspace/devstudio-nightly-2.1.0.Alpha1/jbds-build/eclipse/plugins/org.drools.eclipse.test/src/test/resources
[java] A /home/hudson/hudson_workspace/workspace/devstudio-nightly-2.1.0.Alpha1/jbds-build/eclipse/plugins/org.drools.eclipse.test/src/test/resources/simplerule.drl
[java] A /home/hudson/hudson_workspace/workspace/devstudio-nightly-2.1.0.Alpha1/jbds-build/eclipse/plugins/org.drools.eclipse.test/src/test/resources/debug.drl
[java] A /home/hudson/hudson_workspace/workspace/devstudio-nightly-2.1.0.Alpha1/jbds-build/eclipse/plugins/org.drools.eclipse.test/build.properties
[java] A /home/hudson/hudson_workspace/workspace/devstudio-nightly-2.1.0.Alpha1/jbds-build/eclipse/plugins/org.drools.eclipse.test/test.xml
[java] Exported revision 26486.
[java]
[java] fetch.recursively:
[java]
[java] postFetch:
[java]
[java] init-maven:
[java]
[java] build:
[java] [copy] Copying 16 files to /home/hudson/hudson_workspace/workspace/devstudio-nightly-2.1.0.Alpha1/jbds-build/eclipse/plugins/org.drools.eclipse/lib
[java] [copy] Copying 5 files to /home/hudson/hudson_workspace/workspace/devstudio-nightly-2.1.0.Alpha1/jbds-build/eclipse/plugins/org.drools.eclipse.task/lib
[java] [updateVersions] updated plugin [Bundle-Version] org.drools.eclipse from 5.0.1.SNAPSHOT to 5.0.1.trunk-N200905121835-H179 ...
[java] [updateVersions] updated plugin [Bundle-Version] org.drools.eclipse.task from 5.0.1.SNAPSHOT to 5.0.1.trunk-N200905121835-H179 ...
[java] [updateVersions] updated plugin [Bundle-Version] org.drools.eclipse.test from 5.0.1.SNAPSHOT to 5.0.1.trunk-N200905121835-H179 ...
[java] [updateVersions] updated plugin [Fragment-Host] org.drools.eclipse.test from 5.0.1.SNAPSHOT to 5.0.1.trunk-N200905121835-H179 ...
[java] [updateVersions] updated plugin [Bundle-Version] org.guvnor.tools from 5.0.1.SNAPSHOT to 5.0.1.trunk-N200905121835-H179 ...
[java] [updateVersions] updating version of feature org.drools.eclipse.feature to 5.0.1.trunk-N200905121835-H179...
[java] [updateVersions] updating version of feature org.drools.eclipse.task.feature to 5.0.1.trunk-N200905121835-H179...
[java] [updateVersions] updating version of feature org.drools.eclipse.test.feature to 5.0.1.trunk-N200905121835-H179...
[java] [updateVersions] updating version of feature org.guvnor.tools.feature to 5.0.1.trunk-N200905121835-H179...
[java]
[java] generate:
[java]
[java] preGenerate:
[java]
[java] allElements:
[java]
[java] init:
[java]
[java] generateScript:
[java] [eclipse.buildScript] Some inter-plug-in dependencies have not been satisfied.
[java] [eclipse.buildScript] Bundle org.drools.eclipse:
[java] [eclipse.buildScript] Missing required plug-in org.eclipse.gef_0.0.0.
[java] [eclipse.buildScript] Bundle org.drools.eclipse.test:
[java] [eclipse.buildScript] Host plug-in org.drools.eclipse_5.0.1.trunk-N200905121835-H179 has not been found.
[java] Java Result: 13
[echo]
[echo] The builder <b>drools-ide</b> failed to compile with the following results:<br/><br/>
[echo]
[echo] <pre>
[echo] BUILD FAILED
[echo] /home/hudson/hudson_workspace/workspace/devstudio-nightly-2.1.0.Alpha1/jbds-build/clean-eclipse/eclipse/plugins/org.eclipse.pde.build_3.5.0.v20090430-1420/scripts/build.xml:25: The following error occurred while executing this line:
[echo] /home/hudson/hudson_workspace/workspace/devstudio-nightly-2.1.0.Alpha1/jbds-build/clean-eclipse/eclipse/plugins/org.eclipse.pde.build_3.5.0.v20090430-1420/scripts/build.xml:81: The following error occurred while executing this line:
[echo] /home/hudson/hudson_workspace/workspace/devstudio-nightly-2.1.0.Alpha1/org.jboss.ide.eclipse.releng/builders/drools-ide/customTargets.xml:11: The following error occurred while executing this line:
[echo] /qa/services/hudson/hudson_workspace/workspace/devstudio-nightly-2.1.0.Alpha1/jbds-build/clean-eclipse/eclipse/plugins/org.eclipse.pde.build_3.5.0.v20090430-1420/scripts/genericTargets.xml:96: Bundle org.drools.eclipse_5.0.1.trunk-N200905121835-H179 failed to resolve.:
[echo] Missing required plug-in org.eclipse.gef_0.0.0.
[echo]
[echo]
[echo] Total time: 34 seconds
[echo] </pre>
[echo] /home/hudson/hudson_workspace/workspace/devstudio-nightly-2.1.0.Alpha1/jbds-build/2.1.0.Alpha1/200905121835/drools-ide
BUILD FAILED
/qa/services/hudson/hudson_workspace/workspace/devstudio-nightly-2.1.0.Alpha1/org.jboss.ide.eclipse.releng/builders/buildNightly.xml:12: The following error occurred while executing this line:
/qa/services/hudson/hudson_workspace/workspace/devstudio-nightly-2.1.0.Alpha1/org.jboss.ide.eclipse.releng/builders/build.xml:69: The following error occurred while executing this line:
/qa/services/hudson/hudson_workspace/workspace/devstudio-nightly-2.1.0.Alpha1/org.jboss.ide.eclipse.releng/builders/build.xml:27: The following error occurred while executing this line:
/qa/services/hudson/hudson_workspace/workspace/devstudio-nightly-2.1.0.Alpha1/org.jboss.ide.eclipse.releng/builders/build.xml:39: The following error occurred while executing this line:
/qa/services/hudson/hudson_workspace/workspace/devstudio-nightly-2.1.0.Alpha1/org.jboss.ide.eclipse.releng/builders/product/productBuild.xml:93: The following error occurred while executing this line:
/qa/services/hudson/hudson_workspace/workspace/devstudio-nightly-2.1.0.Alpha1/org.jboss.ide.eclipse.releng/builders/product/productBuild.xml:340: The following error occurred while executing this line:
/qa/services/hudson/hudson_workspace/workspace/devstudio-nightly-2.1.0.Alpha1/org.jboss.ide.eclipse.releng/builders/product/productBuild.xml:342: The following error occurred while executing this line:
/qa/services/hudson/hudson_workspace/workspace/devstudio-nightly-2.1.0.Alpha1/org.jboss.ide.eclipse.releng/builders/product/productBuild.xml:320: Specify at least one source - a file or a resource collection.
Total time: 11 minutes 25 seconds
+ cd ../configs/jbds
+ zip build.log.zip build.log
updating: build.log (deflated 95%)
+ cd ../..
+ [[ '' == \l\o\c\a\l ]]
++ cat /home/hudson/hudson_workspace/workspace/devstudio-nightly-2.1.0.Alpha1/jbds-build/buildData.properties
++ grep product.releaseNumber
++ perl -ne 's/[\s\t]+product.releaseNumber=//g;print;'
+ version=2.1.0.Alpha1
++ cat /home/hudson/hudson_workspace/workspace/devstudio-nightly-2.1.0.Alpha1/jbds-build/buildData.properties
++ grep upload.to
++ perl -ne 's/[\s\t]+upload.to=//g;print;'
+ builddir=nightly/2.1.0.Alpha1/200905121835
++ cat /home/hudson/hudson_workspace/workspace/devstudio-nightly-2.1.0.Alpha1/jbds-build/buildData.properties
++ grep product.buildDesc
++ perl -ne 's/[\s\t]+product.buildDesc=//g; print;'
+ buildtype=nightly
++ cat /home/hudson/hudson_workspace/workspace/devstudio-nightly-2.1.0.Alpha1/jbds-build/buildData.properties
++ grep product.releaseNumber
++ perl -ne 's/[\s\t]+product.releaseNumber=//g; print;'
+ releaseNumber=2.1.0.Alpha1
+ DESTINATION=/qa/services/http/binaries/RHDS
+ scp -r /home/hudson/hudson_workspace/workspace/devstudio-nightly-2.1.0.Alpha1/jbds-build/2.1.0.Alpha1 /qa/services/http/binaries/RHDS/nightly/
+ scp configs/jbds/build.log.zip /qa/services/http/binaries/RHDS/nightly/2.1.0.Alpha1/200905121835/
+ scp /home/hudson/hudson_workspace/workspace/devstudio-nightly-2.1.0.Alpha1/jbds-build/latestBuild.html /qa/services/http/binaries/RHDS/nightly/
cp: cannot stat `/home/hudson/hudson_workspace/workspace/devstudio-nightly-2.1.0.Alpha1/jbds-build/latestBuild.html': No such file or directory
Terminating xvnc
[devstudio-nightly-2.1.0.Alpha1] $ vncserver -kill :14
Killing Xvnc process ID 4849
[devstudio-nightly-2.1.0.Alpha1] $ bash -xe /tmp/hudson8127766605142874105.sh
+ kill 4830
Recording test results
Recording Emma reports jbds-build/coverage.xml
Email was triggered for: Failure
There are 1 triggered emails.
Sending email for trigger: Failure
--------------------------------------------------
15 years, 9 months
[Unstable] jbosstools-nightly-3.1.0.Alpha1 #162
by jboss-qa-internal@redhat.com
http://hudson.qa.jboss.com/hudson/job/jbosstools-nightly-3.1.0.Alpha1/162/
http://hudson.qa.jboss.com/hudson/job/jbosstools-nightly-3.1.0.Alpha1/162...
http://hudson.qa.jboss.com/hudson/job/jbosstools-nightly-3.1.0.Alpha1/162...
http://hudson.qa.jboss.com/hudson/job/jbosstools-nightly-3.1.0.Alpha1/162...
--------------------------------------------------
Failed Tests:
32 tests failed.
FAILED: AllTests
Error Message:
expected:<103> but was:<102>
Stack Trace:
junit.framework.AssertionFailedError: expected:<103> but was:<102>
at org.drools.eclipse.editors.completion.CompletionContextTest.testCheckLHSLocationDetermination_INSIDE_CONDITION_END4(CompletionContextTest.java:583)
at org.eclipse.test.EclipseTestRunner.run(EclipseTestRunner.java:354)
at org.eclipse.test.EclipseTestRunner.run(EclipseTestRunner.java:206)
at org.eclipse.test.UITestApplication$3.run(UITestApplication.java:195)
at org.eclipse.swt.widgets.RunnableLock.run(RunnableLock.java:35)
at org.eclipse.swt.widgets.Synchronizer.runAsyncMessages(Synchronizer.java:134)
at org.eclipse.swt.widgets.Display.runAsyncMessages(Display.java:3460)
at org.eclipse.swt.widgets.Display.readAndDispatch(Display.java:3107)
at org.eclipse.ui.internal.Workbench.runEventLoop(Workbench.java:2405)
at org.eclipse.ui.internal.Workbench.runUI(Workbench.java:2369)
at org.eclipse.ui.internal.Workbench.access$4(Workbench.java:2221)
at org.eclipse.ui.internal.Workbench$5.run(Workbench.java:500)
at org.eclipse.core.databinding.observable.Realm.runWithDefault(Realm.java:332)
at org.eclipse.ui.internal.Workbench.createAndRunWorkbench(Workbench.java:493)
at org.eclipse.ui.PlatformUI.createAndRunWorkbench(PlatformUI.java:149)
at org.eclipse.ui.internal.ide.application.IDEApplication.start(IDEApplication.java:113)
at org.eclipse.test.UITestApplication.runApplication(UITestApplication.java:138)
at org.eclipse.test.UITestApplication.run(UITestApplication.java:60)
at org.eclipse.test.UITestApplication.start(UITestApplication.java:210)
at org.eclipse.equinox.internal.app.EclipseAppHandle.run(EclipseAppHandle.java:194)
at org.eclipse.core.runtime.internal.adaptor.EclipseAppLauncher.runApplication(EclipseAppLauncher.java:110)
at org.eclipse.core.runtime.internal.adaptor.EclipseAppLauncher.start(EclipseAppLauncher.java:79)
at org.eclipse.core.runtime.adaptor.EclipseStarter.run(EclipseStarter.java:368)
at org.eclipse.core.runtime.adaptor.EclipseStarter.run(EclipseStarter.java:179)
at org.eclipse.equinox.launcher.Main.invokeFramework(Main.java:559)
at org.eclipse.equinox.launcher.Main.basicRun(Main.java:514)
at org.eclipse.equinox.launcher.Main.run(Main.java:1311)
at org.eclipse.equinox.launcher.Main.main(Main.java:1287)
at org.eclipse.core.launcher.Main.main(Main.java:34)
FAILED: AllTests
Error Message:
expected:<100> but was:<103>
Stack Trace:
junit.framework.AssertionFailedError: expected:<100> but was:<103>
at org.drools.eclipse.editors.completion.CompletionContextTest.testCheckLHSLocationDetermination_INSIDE_CONDITION_START14(CompletionContextTest.java:593)
at org.eclipse.test.EclipseTestRunner.run(EclipseTestRunner.java:354)
at org.eclipse.test.EclipseTestRunner.run(EclipseTestRunner.java:206)
at org.eclipse.test.UITestApplication$3.run(UITestApplication.java:195)
at org.eclipse.swt.widgets.RunnableLock.run(RunnableLock.java:35)
at org.eclipse.swt.widgets.Synchronizer.runAsyncMessages(Synchronizer.java:134)
at org.eclipse.swt.widgets.Display.runAsyncMessages(Display.java:3460)
at org.eclipse.swt.widgets.Display.readAndDispatch(Display.java:3107)
at org.eclipse.ui.internal.Workbench.runEventLoop(Workbench.java:2405)
at org.eclipse.ui.internal.Workbench.runUI(Workbench.java:2369)
at org.eclipse.ui.internal.Workbench.access$4(Workbench.java:2221)
at org.eclipse.ui.internal.Workbench$5.run(Workbench.java:500)
at org.eclipse.core.databinding.observable.Realm.runWithDefault(Realm.java:332)
at org.eclipse.ui.internal.Workbench.createAndRunWorkbench(Workbench.java:493)
at org.eclipse.ui.PlatformUI.createAndRunWorkbench(PlatformUI.java:149)
at org.eclipse.ui.internal.ide.application.IDEApplication.start(IDEApplication.java:113)
at org.eclipse.test.UITestApplication.runApplication(UITestApplication.java:138)
at org.eclipse.test.UITestApplication.run(UITestApplication.java:60)
at org.eclipse.test.UITestApplication.start(UITestApplication.java:210)
at org.eclipse.equinox.internal.app.EclipseAppHandle.run(EclipseAppHandle.java:194)
at org.eclipse.core.runtime.internal.adaptor.EclipseAppLauncher.runApplication(EclipseAppLauncher.java:110)
at org.eclipse.core.runtime.internal.adaptor.EclipseAppLauncher.start(EclipseAppLauncher.java:79)
at org.eclipse.core.runtime.adaptor.EclipseStarter.run(EclipseStarter.java:368)
at org.eclipse.core.runtime.adaptor.EclipseStarter.run(EclipseStarter.java:179)
at org.eclipse.equinox.launcher.Main.invokeFramework(Main.java:559)
at org.eclipse.equinox.launcher.Main.basicRun(Main.java:514)
at org.eclipse.equinox.launcher.Main.run(Main.java:1311)
at org.eclipse.equinox.launcher.Main.main(Main.java:1287)
at org.eclipse.core.launcher.Main.main(Main.java:34)
FAILED: ASTestSuite
Error Message:
expected:<3> but was:<4>
Stack Trace:
junit.framework.AssertionFailedError: expected:<3> but was:<4>
at org.jboss.ide.eclipse.as.test.classpath.ProjectRuntimeTest.verifyPostRuntimeCPE(ProjectRuntimeTest.java:80)
at org.jboss.ide.eclipse.as.test.classpath.ProjectRuntimeTest.testProjectRuntime(ProjectRuntimeTest.java:64)
at org.eclipse.test.EclipseTestRunner.run(EclipseTestRunner.java:354)
at org.eclipse.test.EclipseTestRunner.run(EclipseTestRunner.java:206)
at org.eclipse.test.UITestApplication$3.run(UITestApplication.java:195)
at org.eclipse.swt.widgets.RunnableLock.run(RunnableLock.java:35)
at org.eclipse.swt.widgets.Synchronizer.runAsyncMessages(Synchronizer.java:134)
at org.eclipse.swt.widgets.Display.runAsyncMessages(Display.java:3460)
at org.eclipse.swt.widgets.Display.readAndDispatch(Display.java:3107)
at org.eclipse.ui.internal.Workbench.runEventLoop(Workbench.java:2405)
at org.eclipse.ui.internal.Workbench.runUI(Workbench.java:2369)
at org.eclipse.ui.internal.Workbench.access$4(Workbench.java:2221)
at org.eclipse.ui.internal.Workbench$5.run(Workbench.java:500)
at org.eclipse.core.databinding.observable.Realm.runWithDefault(Realm.java:332)
at org.eclipse.ui.internal.Workbench.createAndRunWorkbench(Workbench.java:493)
at org.eclipse.ui.PlatformUI.createAndRunWorkbench(PlatformUI.java:149)
at org.eclipse.ui.internal.ide.application.IDEApplication.start(IDEApplication.java:113)
at org.eclipse.test.UITestApplication.runApplication(UITestApplication.java:138)
at org.eclipse.test.UITestApplication.run(UITestApplication.java:60)
at org.eclipse.test.UITestApplication.start(UITestApplication.java:210)
at org.eclipse.equinox.internal.app.EclipseAppHandle.run(EclipseAppHandle.java:194)
at org.eclipse.core.runtime.internal.adaptor.EclipseAppLauncher.runApplication(EclipseAppLauncher.java:110)
at org.eclipse.core.runtime.internal.adaptor.EclipseAppLauncher.start(EclipseAppLauncher.java:79)
at org.eclipse.core.runtime.adaptor.EclipseStarter.run(EclipseStarter.java:368)
at org.eclipse.core.runtime.adaptor.EclipseStarter.run(EclipseStarter.java:179)
at org.eclipse.equinox.launcher.Main.invokeFramework(Main.java:559)
at org.eclipse.equinox.launcher.Main.basicRun(Main.java:514)
at org.eclipse.equinox.launcher.Main.run(Main.java:1311)
at org.eclipse.equinox.launcher.Main.main(Main.java:1287)
at org.eclipse.core.launcher.Main.main(Main.java:34)
FAILED: ASTestSuite
Error Message:
null
Stack Trace:
junit.framework.AssertionFailedError
at org.jboss.ide.eclipse.as.test.publishing.JBIDE4184Test.testJira(JBIDE4184Test.java:44)
at org.eclipse.test.EclipseTestRunner.run(EclipseTestRunner.java:354)
at org.eclipse.test.EclipseTestRunner.run(EclipseTestRunner.java:206)
at org.eclipse.test.UITestApplication$3.run(UITestApplication.java:195)
at org.eclipse.swt.widgets.RunnableLock.run(RunnableLock.java:35)
at org.eclipse.swt.widgets.Synchronizer.runAsyncMessages(Synchronizer.java:134)
at org.eclipse.swt.widgets.Display.runAsyncMessages(Display.java:3460)
at org.eclipse.swt.widgets.Display.readAndDispatch(Display.java:3107)
at org.eclipse.ui.internal.Workbench.runEventLoop(Workbench.java:2405)
at org.eclipse.ui.internal.Workbench.runUI(Workbench.java:2369)
at org.eclipse.ui.internal.Workbench.access$4(Workbench.java:2221)
at org.eclipse.ui.internal.Workbench$5.run(Workbench.java:500)
at org.eclipse.core.databinding.observable.Realm.runWithDefault(Realm.java:332)
at org.eclipse.ui.internal.Workbench.createAndRunWorkbench(Workbench.java:493)
at org.eclipse.ui.PlatformUI.createAndRunWorkbench(PlatformUI.java:149)
at org.eclipse.ui.internal.ide.application.IDEApplication.start(IDEApplication.java:113)
at org.eclipse.test.UITestApplication.runApplication(UITestApplication.java:138)
at org.eclipse.test.UITestApplication.run(UITestApplication.java:60)
at org.eclipse.test.UITestApplication.start(UITestApplication.java:210)
at org.eclipse.equinox.internal.app.EclipseAppHandle.run(EclipseAppHandle.java:194)
at org.eclipse.core.runtime.internal.adaptor.EclipseAppLauncher.runApplication(EclipseAppLauncher.java:110)
at org.eclipse.core.runtime.internal.adaptor.EclipseAppLauncher.start(EclipseAppLauncher.java:79)
at org.eclipse.core.runtime.adaptor.EclipseStarter.run(EclipseStarter.java:368)
at org.eclipse.core.runtime.adaptor.EclipseStarter.run(EclipseStarter.java:179)
at org.eclipse.equinox.launcher.Main.invokeFramework(Main.java:559)
at org.eclipse.equinox.launcher.Main.basicRun(Main.java:514)
at org.eclipse.equinox.launcher.Main.run(Main.java:1311)
at org.eclipse.equinox.launcher.Main.main(Main.java:1287)
at org.eclipse.core.launcher.Main.main(Main.java:34)
FAILED: CommonModelAllTests
Error Message:
Icons for 5 actions are missing. ActionPath=FaceletTaglibTag:CreateActions/AddSource iconPath=empty ActionPath=FaceletTaglibTag:CreateActions/AddValidator iconPath=empty ActionPath=FaceletTaglibTag:CreateActions/AddComponent iconPath=empty ActionPath=FaceletTaglibTag:CreateActions/AddConverter iconPath=empty ActionPath=FaceletTaglibTag:CreateActions/AddHandler iconPath=empty
Stack Trace:
junit.framework.AssertionFailedError: Icons for 5 actions are missing.
ActionPath=FaceletTaglibTag:CreateActions/AddSource iconPath=empty
ActionPath=FaceletTaglibTag:CreateActions/AddValidator iconPath=empty
ActionPath=FaceletTaglibTag:CreateActions/AddComponent iconPath=empty
ActionPath=FaceletTaglibTag:CreateActions/AddConverter iconPath=empty
ActionPath=FaceletTaglibTag:CreateActions/AddHandler iconPath=empty
at org.jboss.tools.common.model.test.MetaModelTest.testActionIcons(MetaModelTest.java:241)
at org.eclipse.test.EclipseTestRunner.run(EclipseTestRunner.java:354)
at org.eclipse.test.EclipseTestRunner.run(EclipseTestRunner.java:206)
at org.eclipse.test.UITestApplication$3.run(UITestApplication.java:195)
at org.eclipse.swt.widgets.RunnableLock.run(RunnableLock.java:35)
at org.eclipse.swt.widgets.Synchronizer.runAsyncMessages(Synchronizer.java:134)
at org.eclipse.swt.widgets.Display.runAsyncMessages(Display.java:3460)
at org.eclipse.swt.widgets.Display.readAndDispatch(Display.java:3107)
at org.eclipse.ui.internal.Workbench.runEventLoop(Workbench.java:2405)
at org.eclipse.ui.internal.Workbench.runUI(Workbench.java:2369)
at org.eclipse.ui.internal.Workbench.access$4(Workbench.java:2221)
at org.eclipse.ui.internal.Workbench$5.run(Workbench.java:500)
at org.eclipse.core.databinding.observable.Realm.runWithDefault(Realm.java:332)
at org.eclipse.ui.internal.Workbench.createAndRunWorkbench(Workbench.java:493)
at org.eclipse.ui.PlatformUI.createAndRunWorkbench(PlatformUI.java:149)
at org.eclipse.ui.internal.ide.application.IDEApplication.start(IDEApplication.java:113)
at org.eclipse.test.UITestApplication.runApplication(UITestApplication.java:138)
at org.eclipse.test.UITestApplication.run(UITestApplication.java:60)
at org.eclipse.test.UITestApplication.start(UITestApplication.java:210)
at org.eclipse.equinox.internal.app.EclipseAppHandle.run(EclipseAppHandle.java:194)
at org.eclipse.core.runtime.internal.adaptor.EclipseAppLauncher.runApplication(EclipseAppLauncher.java:110)
at org.eclipse.core.runtime.internal.adaptor.EclipseAppLauncher.start(EclipseAppLauncher.java:79)
at org.eclipse.core.runtime.adaptor.EclipseStarter.run(EclipseStarter.java:368)
at org.eclipse.core.runtime.adaptor.EclipseStarter.run(EclipseStarter.java:179)
at org.eclipse.equinox.launcher.Main.invokeFramework(Main.java:559)
at org.eclipse.equinox.launcher.Main.basicRun(Main.java:514)
at org.eclipse.equinox.launcher.Main.run(Main.java:1311)
at org.eclipse.equinox.launcher.Main.main(Main.java:1287)
at org.eclipse.core.launcher.Main.main(Main.java:34)
FAILED: CommonAllTests
Error Message:
Error occurs when creating HTTP Client object
Stack Trace:
junit.framework.AssertionFailedError: Error occurs when creating HTTP Client object
at org.jboss.tools.common.util.test.HttpUtilTest.testCreateHttpClient(HttpUtilTest.java:25)
at org.eclipse.test.EclipseTestRunner.run(EclipseTestRunner.java:354)
at org.eclipse.test.EclipseTestRunner.run(EclipseTestRunner.java:206)
at org.eclipse.test.CoreTestApplication.runTests(CoreTestApplication.java:35)
at org.eclipse.test.CoreTestApplication.run(CoreTestApplication.java:31)
at org.eclipse.equinox.internal.app.EclipseAppContainer.callMethodWithException(EclipseAppContainer.java:574)
at org.eclipse.equinox.internal.app.EclipseAppHandle.run(EclipseAppHandle.java:196)
at org.eclipse.core.runtime.internal.adaptor.EclipseAppLauncher.runApplication(EclipseAppLauncher.java:110)
at org.eclipse.core.runtime.internal.adaptor.EclipseAppLauncher.start(EclipseAppLauncher.java:79)
at org.eclipse.core.runtime.adaptor.EclipseStarter.run(EclipseStarter.java:368)
at org.eclipse.core.runtime.adaptor.EclipseStarter.run(EclipseStarter.java:179)
at org.eclipse.equinox.launcher.Main.invokeFramework(Main.java:559)
at org.eclipse.equinox.launcher.Main.basicRun(Main.java:514)
at org.eclipse.equinox.launcher.Main.run(Main.java:1311)
at org.eclipse.equinox.launcher.Main.main(Main.java:1287)
at org.eclipse.core.launcher.Main.main(Main.java:34)
FAILED: JMXCoreAllTests
Error Message:
Failed to retrieve RMIServer stub: javax.naming.ServiceUnavailableException [Root exception is java.rmi.ConnectException: Connection refused to host: localhost; nested exception is: java.net.ConnectException: Connection refused]
Stack Trace:
java.io.IOException: Failed to retrieve RMIServer stub: javax.naming.ServiceUnavailableException [Root exception is java.rmi.ConnectException: Connection refused to host: localhost; nested exception is:
java.net.ConnectException: Connection refused]
at javax.management.remote.rmi.RMIConnector.connect(RMIConnector.java:323)
at javax.management.remote.JMXConnectorFactory.connect(JMXConnectorFactory.java:248)
at org.jboss.tools.jmx.core.providers.DefaultConnectionWrapper.connect(DefaultConnectionWrapper.java:80)
at org.jboss.tools.jmx.core.tests.DefaultProviderTest.testConnection(DefaultProviderTest.java:116)
at org.eclipse.test.EclipseTestRunner.run(EclipseTestRunner.java:354)
at org.eclipse.test.EclipseTestRunner.run(EclipseTestRunner.java:206)
at org.eclipse.test.UITestApplication$3.run(UITestApplication.java:195)
at org.eclipse.swt.widgets.RunnableLock.run(RunnableLock.java:35)
at org.eclipse.swt.widgets.Synchronizer.runAsyncMessages(Synchronizer.java:134)
at org.eclipse.swt.widgets.Display.runAsyncMessages(Display.java:3460)
at org.eclipse.swt.widgets.Display.readAndDispatch(Display.java:3107)
at org.eclipse.ui.internal.Workbench.runEventLoop(Workbench.java:2405)
at org.eclipse.ui.internal.Workbench.runUI(Workbench.java:2369)
at org.eclipse.ui.internal.Workbench.access$4(Workbench.java:2221)
at org.eclipse.ui.internal.Workbench$5.run(Workbench.java:500)
at org.eclipse.core.databinding.observable.Realm.runWithDefault(Realm.java:332)
at org.eclipse.ui.internal.Workbench.createAndRunWorkbench(Workbench.java:493)
at org.eclipse.ui.PlatformUI.createAndRunWorkbench(PlatformUI.java:149)
at org.eclipse.ui.internal.ide.application.IDEApplication.start(IDEApplication.java:113)
at org.eclipse.test.UITestApplication.runApplication(UITestApplication.java:138)
at org.eclipse.test.UITestApplication.run(UITestApplication.java:60)
at org.eclipse.test.UITestApplication.start(UITestApplication.java:210)
at org.eclipse.equinox.internal.app.EclipseAppHandle.run(EclipseAppHandle.java:194)
at org.eclipse.core.runtime.internal.adaptor.EclipseAppLauncher.runApplication(EclipseAppLauncher.java:110)
at org.eclipse.core.runtime.internal.adaptor.EclipseAppLauncher.start(EclipseAppLauncher.java:79)
at org.eclipse.core.runtime.adaptor.EclipseStarter.run(EclipseStarter.java:368)
at org.eclipse.core.runtime.adaptor.EclipseStarter.run(EclipseStarter.java:179)
at org.eclipse.equinox.launcher.Main.invokeFramework(Main.java:559)
at org.eclipse.equinox.launcher.Main.basicRun(Main.java:514)
at org.eclipse.equinox.launcher.Main.run(Main.java:1311)
at org.eclipse.equinox.launcher.Main.main(Main.java:1287)
at org.eclipse.core.launcher.Main.main(Main.java:34)
Caused by: javax.naming.ServiceUnavailableException [Root exception is java.rmi.ConnectException: Connection refused to host: localhost; nested exception is:
java.net.ConnectException: Connection refused]
at com.sun.jndi.rmi.registry.RegistryContext.lookup(RegistryContext.java:101)
at com.sun.jndi.toolkit.url.GenericURLContext.lookup(GenericURLContext.java:185)
at javax.naming.InitialContext.lookup(InitialContext.java:392)
at javax.management.remote.rmi.RMIConnector.findRMIServerJNDI(RMIConnector.java:1871)
at javax.management.remote.rmi.RMIConnector.findRMIServer(RMIConnector.java:1841)
at javax.management.remote.rmi.RMIConnector.connect(RMIConnector.java:257)
Caused by: java.rmi.ConnectException: Connection refused to host: localhost; nested exception is:
java.net.ConnectException: Connection refused
at sun.rmi.transport.tcp.TCPEndpoint.newSocket(TCPEndpoint.java:601)
at sun.rmi.transport.tcp.TCPChannel.createConnection(TCPChannel.java:198)
at sun.rmi.transport.tcp.TCPChannel.newConnection(TCPChannel.java:184)
at sun.rmi.server.UnicastRef.newCall(UnicastRef.java:322)
at sun.rmi.registry.RegistryImpl_Stub.lookup(Unknown Source)
at com.sun.jndi.rmi.registry.RegistryContext.lookup(RegistryContext.java:97)
Caused by: java.net.ConnectException: Connection refused
at java.net.PlainSocketImpl.socketConnect(Native Method)
at java.net.PlainSocketImpl.doConnect(PlainSocketImpl.java:333)
at java.net.PlainSocketImpl.connectToAddress(PlainSocketImpl.java:195)
at java.net.PlainSocketImpl.connect(PlainSocketImpl.java:182)
at java.net.SocksSocketImpl.connect(SocksSocketImpl.java:366)
at java.net.Socket.connect(Socket.java:519)
at java.net.Socket.connect(Socket.java:469)
at java.net.Socket.<init>(Socket.java:366)
at java.net.Socket.<init>(Socket.java:180)
at sun.rmi.transport.proxy.RMIDirectSocketFactory.createSocket(RMIDirectSocketFactory.java:22)
at sun.rmi.transport.proxy.RMIMasterSocketFactory.createSocket(RMIMasterSocketFactory.java:128)
at sun.rmi.transport.tcp.TCPEndpoint.newSocket(TCPEndpoint.java:595)
FAILED: JsfAllTests
Error Message:
The function "getAccessibleFor" returned an error condition (0x80004005)
Stack Trace:
org.mozilla.xpcom.XPCOMException: The function "getAccessibleFor" returned an error condition (0x80004005)
at org.mozilla.xpcom.internal.XPCOMJavaProxy.callXPCOMMethod(Native Method)
at org.mozilla.xpcom.internal.XPCOMJavaProxy.invoke(XPCOMJavaProxy.java:143)
at $Proxy33.getAccessibleFor(Unknown Source)
at org.jboss.tools.vpe.editor.util.VisualDomUtil.getBounds(VisualDomUtil.java:257)
at org.jboss.tools.jsf.vpe.jsf.test.jbide.JBIDE3473Test.getBoundsOfElementById(JBIDE3473Test.java:104)
at org.jboss.tools.jsf.vpe.jsf.test.jbide.JBIDE3473Test.testNodeUpdate(JBIDE3473Test.java:70)
at junit.extensions.TestDecorator.basicRun(TestDecorator.java:24)
at junit.extensions.TestSetup$1.protect(TestSetup.java:21)
at junit.extensions.TestSetup.run(TestSetup.java:25)
at org.eclipse.test.EclipseTestRunner.run(EclipseTestRunner.java:354)
at org.eclipse.test.EclipseTestRunner.run(EclipseTestRunner.java:206)
at org.eclipse.test.UITestApplication$3.run(UITestApplication.java:195)
at org.eclipse.swt.widgets.RunnableLock.run(RunnableLock.java:35)
at org.eclipse.swt.widgets.Synchronizer.runAsyncMessages(Synchronizer.java:134)
at org.eclipse.swt.widgets.Display.runAsyncMessages(Display.java:3460)
at org.eclipse.swt.widgets.Display.readAndDispatch(Display.java:3107)
at org.eclipse.ui.internal.Workbench.runEventLoop(Workbench.java:2405)
at org.eclipse.ui.internal.Workbench.runUI(Workbench.java:2369)
at org.eclipse.ui.internal.Workbench.access$4(Workbench.java:2221)
at org.eclipse.ui.internal.Workbench$5.run(Workbench.java:500)
at org.eclipse.core.databinding.observable.Realm.runWithDefault(Realm.java:332)
at org.eclipse.ui.internal.Workbench.createAndRunWorkbench(Workbench.java:493)
at org.eclipse.ui.PlatformUI.createAndRunWorkbench(PlatformUI.java:149)
at org.eclipse.ui.internal.ide.application.IDEApplication.start(IDEApplication.java:113)
at org.eclipse.test.UITestApplication.runApplication(UITestApplication.java:138)
at org.eclipse.test.UITestApplication.run(UITestApplication.java:60)
at org.eclipse.test.UITestApplication.start(UITestApplication.java:210)
at org.eclipse.equinox.internal.app.EclipseAppHandle.run(EclipseAppHandle.java:194)
at org.eclipse.core.runtime.internal.adaptor.EclipseAppLauncher.runApplication(EclipseAppLauncher.java:110)
at org.eclipse.core.runtime.internal.adaptor.EclipseAppLauncher.start(EclipseAppLauncher.java:79)
at org.eclipse.core.runtime.adaptor.EclipseStarter.run(EclipseStarter.java:368)
at org.eclipse.core.runtime.adaptor.EclipseStarter.run(EclipseStarter.java:179)
at org.eclipse.equinox.launcher.Main.invokeFramework(Main.java:559)
at org.eclipse.equinox.launcher.Main.basicRun(Main.java:514)
at org.eclipse.equinox.launcher.Main.run(Main.java:1311)
at org.eclipse.equinox.launcher.Main.main(Main.java:1287)
at org.eclipse.core.launcher.Main.main(Main.java:34)
FAILED: JsfAllTests
Error Message:
taggedDiv should be not null
Stack Trace:
junit.framework.AssertionFailedError: taggedDiv should be not null
at org.jboss.tools.jsf.vpe.jsf.test.jbide.JBIDE3441Test.checkTaggedDivValue(JBIDE3441Test.java:71)
at org.jboss.tools.jsf.vpe.jsf.test.jbide.JBIDE3441Test.testVisualRefresh(JBIDE3441Test.java:61)
at junit.extensions.TestDecorator.basicRun(TestDecorator.java:24)
at junit.extensions.TestSetup$1.protect(TestSetup.java:21)
at junit.extensions.TestSetup.run(TestSetup.java:25)
at org.eclipse.test.EclipseTestRunner.run(EclipseTestRunner.java:354)
at org.eclipse.test.EclipseTestRunner.run(EclipseTestRunner.java:206)
at org.eclipse.test.UITestApplication$3.run(UITestApplication.java:195)
at org.eclipse.swt.widgets.RunnableLock.run(RunnableLock.java:35)
at org.eclipse.swt.widgets.Synchronizer.runAsyncMessages(Synchronizer.java:134)
at org.eclipse.swt.widgets.Display.runAsyncMessages(Display.java:3460)
at org.eclipse.swt.widgets.Display.readAndDispatch(Display.java:3107)
at org.eclipse.ui.internal.Workbench.runEventLoop(Workbench.java:2405)
at org.eclipse.ui.internal.Workbench.runUI(Workbench.java:2369)
at org.eclipse.ui.internal.Workbench.access$4(Workbench.java:2221)
at org.eclipse.ui.internal.Workbench$5.run(Workbench.java:500)
at org.eclipse.core.databinding.observable.Realm.runWithDefault(Realm.java:332)
at org.eclipse.ui.internal.Workbench.createAndRunWorkbench(Workbench.java:493)
at org.eclipse.ui.PlatformUI.createAndRunWorkbench(PlatformUI.java:149)
at org.eclipse.ui.internal.ide.application.IDEApplication.start(IDEApplication.java:113)
at org.eclipse.test.UITestApplication.runApplication(UITestApplication.java:138)
at org.eclipse.test.UITestApplication.run(UITestApplication.java:60)
at org.eclipse.test.UITestApplication.start(UITestApplication.java:210)
at org.eclipse.equinox.internal.app.EclipseAppHandle.run(EclipseAppHandle.java:194)
at org.eclipse.core.runtime.internal.adaptor.EclipseAppLauncher.runApplication(EclipseAppLauncher.java:110)
at org.eclipse.core.runtime.internal.adaptor.EclipseAppLauncher.start(EclipseAppLauncher.java:79)
at org.eclipse.core.runtime.adaptor.EclipseStarter.run(EclipseStarter.java:368)
at org.eclipse.core.runtime.adaptor.EclipseStarter.run(EclipseStarter.java:179)
at org.eclipse.equinox.launcher.Main.invokeFramework(Main.java:559)
at org.eclipse.equinox.launcher.Main.basicRun(Main.java:514)
at org.eclipse.equinox.launcher.Main.run(Main.java:1311)
at org.eclipse.equinox.launcher.Main.main(Main.java:1287)
at org.eclipse.core.launcher.Main.main(Main.java:34)
FAILED: RichFacesAllTests
Error Message:
string is"file:///qa/services/hudson/hudson_workspace/workspace/jbosstools-nightly-3.1.0.Alpha1/jbds-build/3.1.0.Alpha1/200905121444/tests/eclipse/plugins/org.jboss.tools.jsf.vpe.richfaces_3.0.0.GA-N200905121444-H162/resources/pickList/arrow_remove.gif" but pattern is ".*resources/pickList/arrow_copy.gif"
Stack Trace:
junit.framework.AssertionFailedError: string is"file:///qa/services/hudson/hudson_workspace/workspace/jbosstools-nightly-3.1.0.Alpha1/jbds-build/3.1.0.Alpha1/200905121444/tests/eclipse/plugins/org.jboss.tools.jsf.vpe.richfaces_3.0.0.GA-N200905121444-H162/resources/pickList/arrow_remove.gif" but pattern is ".*resources/pickList/arrow_copy.gif"
at org.jboss.tools.vpe.ui.test.ComponentContentTest.compareElements(ComponentContentTest.java:136)
at org.jboss.tools.vpe.ui.test.ComponentContentTest.performContentTest(ComponentContentTest.java:95)
at org.jboss.tools.jsf.vpe.richfaces.test.RichFacesComponentContentTest.testPickList(RichFacesComponentContentTest.java:247)
at junit.extensions.TestDecorator.basicRun(TestDecorator.java:24)
at junit.extensions.TestSetup$1.protect(TestSetup.java:21)
at junit.extensions.TestSetup.run(TestSetup.java:25)
at org.eclipse.test.EclipseTestRunner.run(EclipseTestRunner.java:354)
at org.eclipse.test.EclipseTestRunner.run(EclipseTestRunner.java:206)
at org.eclipse.test.UITestApplication$3.run(UITestApplication.java:195)
at org.eclipse.swt.widgets.RunnableLock.run(RunnableLock.java:35)
at org.eclipse.swt.widgets.Synchronizer.runAsyncMessages(Synchronizer.java:134)
at org.eclipse.swt.widgets.Display.runAsyncMessages(Display.java:3460)
at org.eclipse.swt.widgets.Display.readAndDispatch(Display.java:3107)
at org.eclipse.ui.internal.Workbench.runEventLoop(Workbench.java:2405)
at org.eclipse.ui.internal.Workbench.runUI(Workbench.java:2369)
at org.eclipse.ui.internal.Workbench.access$4(Workbench.java:2221)
at org.eclipse.ui.internal.Workbench$5.run(Workbench.java:500)
at org.eclipse.core.databinding.observable.Realm.runWithDefault(Realm.java:332)
at org.eclipse.ui.internal.Workbench.createAndRunWorkbench(Workbench.java:493)
at org.eclipse.ui.PlatformUI.createAndRunWorkbench(PlatformUI.java:149)
at org.eclipse.ui.internal.ide.application.IDEApplication.start(IDEApplication.java:113)
at org.eclipse.test.UITestApplication.runApplication(UITestApplication.java:138)
at org.eclipse.test.UITestApplication.run(UITestApplication.java:60)
at org.eclipse.test.UITestApplication.start(UITestApplication.java:210)
at org.eclipse.equinox.internal.app.EclipseAppHandle.run(EclipseAppHandle.java:194)
at org.eclipse.core.runtime.internal.adaptor.EclipseAppLauncher.runApplication(EclipseAppLauncher.java:110)
at org.eclipse.core.runtime.internal.adaptor.EclipseAppLauncher.start(EclipseAppLauncher.java:79)
at org.eclipse.core.runtime.adaptor.EclipseStarter.run(EclipseStarter.java:368)
at org.eclipse.core.runtime.adaptor.EclipseStarter.run(EclipseStarter.java:179)
at org.eclipse.equinox.launcher.Main.invokeFramework(Main.java:559)
at org.eclipse.equinox.launcher.Main.basicRun(Main.java:514)
at org.eclipse.equinox.launcher.Main.run(Main.java:1311)
at org.eclipse.equinox.launcher.Main.main(Main.java:1287)
at org.eclipse.core.launcher.Main.main(Main.java:34)
FAILED: JstJspAllTests
Error Message:
Proposal #{applicationScope} not found!
Stack Trace:
junit.framework.AssertionFailedError: Proposal #{applicationScope} not found!
at org.jboss.tools.jst.jsp.test.ca.ContentAssistantTestCase.checkProposals(ContentAssistantTestCase.java:86)
at org.jboss.tools.jst.jsp.test.ca.JsfJspJbide1813Test.testJsfJspJbide1813Test(JsfJspJbide1813Test.java:39)
at org.eclipse.test.EclipseTestRunner.run(EclipseTestRunner.java:354)
at org.eclipse.test.EclipseTestRunner.run(EclipseTestRunner.java:206)
at org.eclipse.test.UITestApplication$3.run(UITestApplication.java:195)
at org.eclipse.swt.widgets.RunnableLock.run(RunnableLock.java:35)
at org.eclipse.swt.widgets.Synchronizer.runAsyncMessages(Synchronizer.java:134)
at org.eclipse.swt.widgets.Display.runAsyncMessages(Display.java:3460)
at org.eclipse.swt.widgets.Display.readAndDispatch(Display.java:3107)
at org.eclipse.ui.internal.Workbench.runEventLoop(Workbench.java:2405)
at org.eclipse.ui.internal.Workbench.runUI(Workbench.java:2369)
at org.eclipse.ui.internal.Workbench.access$4(Workbench.java:2221)
at org.eclipse.ui.internal.Workbench$5.run(Workbench.java:500)
at org.eclipse.core.databinding.observable.Realm.runWithDefault(Realm.java:332)
at org.eclipse.ui.internal.Workbench.createAndRunWorkbench(Workbench.java:493)
at org.eclipse.ui.PlatformUI.createAndRunWorkbench(PlatformUI.java:149)
at org.eclipse.ui.internal.ide.application.IDEApplication.start(IDEApplication.java:113)
at org.eclipse.test.UITestApplication.runApplication(UITestApplication.java:138)
at org.eclipse.test.UITestApplication.run(UITestApplication.java:60)
at org.eclipse.test.UITestApplication.start(UITestApplication.java:210)
at org.eclipse.equinox.internal.app.EclipseAppHandle.run(EclipseAppHandle.java:194)
at org.eclipse.core.runtime.internal.adaptor.EclipseAppLauncher.runApplication(EclipseAppLauncher.java:110)
at org.eclipse.core.runtime.internal.adaptor.EclipseAppLauncher.start(EclipseAppLauncher.java:79)
at org.eclipse.core.runtime.adaptor.EclipseStarter.run(EclipseStarter.java:368)
at org.eclipse.core.runtime.adaptor.EclipseStarter.run(EclipseStarter.java:179)
at org.eclipse.equinox.launcher.Main.invokeFramework(Main.java:559)
at org.eclipse.equinox.launcher.Main.basicRun(Main.java:514)
at org.eclipse.equinox.launcher.Main.run(Main.java:1311)
at org.eclipse.equinox.launcher.Main.main(Main.java:1287)
at org.eclipse.core.launcher.Main.main(Main.java:34)
FAILED: JstJspAllTests
Error Message:
Content Assistant returned no proposals
Stack Trace:
junit.framework.AssertionFailedError: Content Assistant returned no proposals
at org.jboss.tools.jst.jsp.test.ca.ContentAssistantTestCase.checkProposals(ContentAssistantTestCase.java:79)
at org.jboss.tools.jst.jsp.test.ca.JsfJspJbide1807Test.testJsfJspJbide1807Test(JsfJspJbide1807Test.java:37)
at org.eclipse.test.EclipseTestRunner.run(EclipseTestRunner.java:354)
at org.eclipse.test.EclipseTestRunner.run(EclipseTestRunner.java:206)
at org.eclipse.test.UITestApplication$3.run(UITestApplication.java:195)
at org.eclipse.swt.widgets.RunnableLock.run(RunnableLock.java:35)
at org.eclipse.swt.widgets.Synchronizer.runAsyncMessages(Synchronizer.java:134)
at org.eclipse.swt.widgets.Display.runAsyncMessages(Display.java:3460)
at org.eclipse.swt.widgets.Display.readAndDispatch(Display.java:3107)
at org.eclipse.ui.internal.Workbench.runEventLoop(Workbench.java:2405)
at org.eclipse.ui.internal.Workbench.runUI(Workbench.java:2369)
at org.eclipse.ui.internal.Workbench.access$4(Workbench.java:2221)
at org.eclipse.ui.internal.Workbench$5.run(Workbench.java:500)
at org.eclipse.core.databinding.observable.Realm.runWithDefault(Realm.java:332)
at org.eclipse.ui.internal.Workbench.createAndRunWorkbench(Workbench.java:493)
at org.eclipse.ui.PlatformUI.createAndRunWorkbench(PlatformUI.java:149)
at org.eclipse.ui.internal.ide.application.IDEApplication.start(IDEApplication.java:113)
at org.eclipse.test.UITestApplication.runApplication(UITestApplication.java:138)
at org.eclipse.test.UITestApplication.run(UITestApplication.java:60)
at org.eclipse.test.UITestApplication.start(UITestApplication.java:210)
at org.eclipse.equinox.internal.app.EclipseAppHandle.run(EclipseAppHandle.java:194)
at org.eclipse.core.runtime.internal.adaptor.EclipseAppLauncher.runApplication(EclipseAppLauncher.java:110)
at org.eclipse.core.runtime.internal.adaptor.EclipseAppLauncher.start(EclipseAppLauncher.java:79)
at org.eclipse.core.runtime.adaptor.EclipseStarter.run(EclipseStarter.java:368)
at org.eclipse.core.runtime.adaptor.EclipseStarter.run(EclipseStarter.java:179)
at org.eclipse.equinox.launcher.Main.invokeFramework(Main.java:559)
at org.eclipse.equinox.launcher.Main.basicRun(Main.java:514)
at org.eclipse.equinox.launcher.Main.run(Main.java:1311)
at org.eclipse.equinox.launcher.Main.main(Main.java:1287)
at org.eclipse.core.launcher.Main.main(Main.java:34)
FAILED: JstJspAllTests
Error Message:
Content Assistant returned no proposals of type CustomCompletionProposal.
Stack Trace:
junit.framework.AssertionFailedError: Content Assistant returned no proposals of type CustomCompletionProposal.
at org.jboss.tools.jst.jsp.test.ca.JstJspJbide1759Test.testJstJspJbide1759(JstJspJbide1759Test.java:97)
at org.jboss.tools.jst.jsp.test.ca.JstJspJbide1759Test.testJstJspJbide1759(JstJspJbide1759Test.java:51)
at org.eclipse.test.EclipseTestRunner.run(EclipseTestRunner.java:354)
at org.eclipse.test.EclipseTestRunner.run(EclipseTestRunner.java:206)
at org.eclipse.test.UITestApplication$3.run(UITestApplication.java:195)
at org.eclipse.swt.widgets.RunnableLock.run(RunnableLock.java:35)
at org.eclipse.swt.widgets.Synchronizer.runAsyncMessages(Synchronizer.java:134)
at org.eclipse.swt.widgets.Display.runAsyncMessages(Display.java:3460)
at org.eclipse.swt.widgets.Display.readAndDispatch(Display.java:3107)
at org.eclipse.ui.internal.Workbench.runEventLoop(Workbench.java:2405)
at org.eclipse.ui.internal.Workbench.runUI(Workbench.java:2369)
at org.eclipse.ui.internal.Workbench.access$4(Workbench.java:2221)
at org.eclipse.ui.internal.Workbench$5.run(Workbench.java:500)
at org.eclipse.core.databinding.observable.Realm.runWithDefault(Realm.java:332)
at org.eclipse.ui.internal.Workbench.createAndRunWorkbench(Workbench.java:493)
at org.eclipse.ui.PlatformUI.createAndRunWorkbench(PlatformUI.java:149)
at org.eclipse.ui.internal.ide.application.IDEApplication.start(IDEApplication.java:113)
at org.eclipse.test.UITestApplication.runApplication(UITestApplication.java:138)
at org.eclipse.test.UITestApplication.run(UITestApplication.java:60)
at org.eclipse.test.UITestApplication.start(UITestApplication.java:210)
at org.eclipse.equinox.internal.app.EclipseAppHandle.run(EclipseAppHandle.java:194)
at org.eclipse.core.runtime.internal.adaptor.EclipseAppLauncher.runApplication(EclipseAppLauncher.java:110)
at org.eclipse.core.runtime.internal.adaptor.EclipseAppLauncher.start(EclipseAppLauncher.java:79)
at org.eclipse.core.runtime.adaptor.EclipseStarter.run(EclipseStarter.java:368)
at org.eclipse.core.runtime.adaptor.EclipseStarter.run(EclipseStarter.java:179)
at org.eclipse.equinox.launcher.Main.invokeFramework(Main.java:559)
at org.eclipse.equinox.launcher.Main.basicRun(Main.java:514)
at org.eclipse.equinox.launcher.Main.run(Main.java:1311)
at org.eclipse.equinox.launcher.Main.main(Main.java:1287)
at org.eclipse.core.launcher.Main.main(Main.java:34)
FAILED: JstJspAllTests
Error Message:
Content Assistant peturned no proposals for template paths.
Stack Trace:
junit.framework.AssertionFailedError: Content Assistant peturned no proposals for template paths.
at org.jboss.tools.jst.jsp.test.ca.JsfJspJbide2437Test.testJsfJspJbide2437(JsfJspJbide2437Test.java:72)
at org.eclipse.test.EclipseTestRunner.run(EclipseTestRunner.java:354)
at org.eclipse.test.EclipseTestRunner.run(EclipseTestRunner.java:206)
at org.eclipse.test.UITestApplication$3.run(UITestApplication.java:195)
at org.eclipse.swt.widgets.RunnableLock.run(RunnableLock.java:35)
at org.eclipse.swt.widgets.Synchronizer.runAsyncMessages(Synchronizer.java:134)
at org.eclipse.swt.widgets.Display.runAsyncMessages(Display.java:3460)
at org.eclipse.swt.widgets.Display.readAndDispatch(Display.java:3107)
at org.eclipse.ui.internal.Workbench.runEventLoop(Workbench.java:2405)
at org.eclipse.ui.internal.Workbench.runUI(Workbench.java:2369)
at org.eclipse.ui.internal.Workbench.access$4(Workbench.java:2221)
at org.eclipse.ui.internal.Workbench$5.run(Workbench.java:500)
at org.eclipse.core.databinding.observable.Realm.runWithDefault(Realm.java:332)
at org.eclipse.ui.internal.Workbench.createAndRunWorkbench(Workbench.java:493)
at org.eclipse.ui.PlatformUI.createAndRunWorkbench(PlatformUI.java:149)
at org.eclipse.ui.internal.ide.application.IDEApplication.start(IDEApplication.java:113)
at org.eclipse.test.UITestApplication.runApplication(UITestApplication.java:138)
at org.eclipse.test.UITestApplication.run(UITestApplication.java:60)
at org.eclipse.test.UITestApplication.start(UITestApplication.java:210)
at org.eclipse.equinox.internal.app.EclipseAppHandle.run(EclipseAppHandle.java:194)
at org.eclipse.core.runtime.internal.adaptor.EclipseAppLauncher.runApplication(EclipseAppLauncher.java:110)
at org.eclipse.core.runtime.internal.adaptor.EclipseAppLauncher.start(EclipseAppLauncher.java:79)
at org.eclipse.core.runtime.adaptor.EclipseStarter.run(EclipseStarter.java:368)
at org.eclipse.core.runtime.adaptor.EclipseStarter.run(EclipseStarter.java:179)
at org.eclipse.equinox.launcher.Main.invokeFramework(Main.java:559)
at org.eclipse.equinox.launcher.Main.basicRun(Main.java:514)
at org.eclipse.equinox.launcher.Main.run(Main.java:1311)
at org.eclipse.equinox.launcher.Main.main(Main.java:1287)
at org.eclipse.core.launcher.Main.main(Main.java:34)
FAILED: JstWebAllTests
Error Message:
TLD list does not contain expected TLD in XModel.
Stack Trace:
junit.framework.AssertionFailedError: TLD list does not contain expected TLD in XModel.
at org.jboss.tools.jst.web.test.WebContentAssistProviderTest.testTlds(WebContentAssistProviderTest.java:66)
at org.eclipse.test.EclipseTestRunner.run(EclipseTestRunner.java:354)
at org.eclipse.test.EclipseTestRunner.run(EclipseTestRunner.java:206)
at org.eclipse.test.UITestApplication$3.run(UITestApplication.java:195)
at org.eclipse.swt.widgets.RunnableLock.run(RunnableLock.java:35)
at org.eclipse.swt.widgets.Synchronizer.runAsyncMessages(Synchronizer.java:134)
at org.eclipse.swt.widgets.Display.runAsyncMessages(Display.java:3460)
at org.eclipse.swt.widgets.Display.readAndDispatch(Display.java:3107)
at org.eclipse.ui.internal.Workbench.runEventLoop(Workbench.java:2405)
at org.eclipse.ui.internal.Workbench.runUI(Workbench.java:2369)
at org.eclipse.ui.internal.Workbench.access$4(Workbench.java:2221)
at org.eclipse.ui.internal.Workbench$5.run(Workbench.java:500)
at org.eclipse.core.databinding.observable.Realm.runWithDefault(Realm.java:332)
at org.eclipse.ui.internal.Workbench.createAndRunWorkbench(Workbench.java:493)
at org.eclipse.ui.PlatformUI.createAndRunWorkbench(PlatformUI.java:149)
at org.eclipse.ui.internal.ide.application.IDEApplication.start(IDEApplication.java:113)
at org.eclipse.test.UITestApplication.runApplication(UITestApplication.java:138)
at org.eclipse.test.UITestApplication.run(UITestApplication.java:60)
at org.eclipse.test.UITestApplication.start(UITestApplication.java:210)
at org.eclipse.equinox.internal.app.EclipseAppHandle.run(EclipseAppHandle.java:194)
at org.eclipse.core.runtime.internal.adaptor.EclipseAppLauncher.runApplication(EclipseAppLauncher.java:110)
at org.eclipse.core.runtime.internal.adaptor.EclipseAppLauncher.start(EclipseAppLauncher.java:79)
at org.eclipse.core.runtime.adaptor.EclipseStarter.run(EclipseStarter.java:368)
at org.eclipse.core.runtime.adaptor.EclipseStarter.run(EclipseStarter.java:179)
at org.eclipse.equinox.launcher.Main.invokeFramework(Main.java:559)
at org.eclipse.equinox.launcher.Main.basicRun(Main.java:514)
at org.eclipse.equinox.launcher.Main.run(Main.java:1311)
at org.eclipse.equinox.launcher.Main.main(Main.java:1287)
at org.eclipse.core.launcher.Main.main(Main.java:34)
FAILED: SeamCoreAllTests
Error Message:
Loading time per component is too large: 14.243589 ms.
Stack Trace:
junit.framework.AssertionFailedError: Loading time per component is too large: 14.243589 ms.
at org.jboss.tools.seam.core.test.SerializationTest.testLoadSerializedModelTime(SerializationTest.java:127)
at org.eclipse.test.EclipseTestRunner.run(EclipseTestRunner.java:354)
at org.eclipse.test.EclipseTestRunner.run(EclipseTestRunner.java:206)
at org.eclipse.test.UITestApplication$3.run(UITestApplication.java:195)
at org.eclipse.swt.widgets.RunnableLock.run(RunnableLock.java:35)
at org.eclipse.swt.widgets.Synchronizer.runAsyncMessages(Synchronizer.java:134)
at org.eclipse.swt.widgets.Display.runAsyncMessages(Display.java:3460)
at org.eclipse.swt.widgets.Display.readAndDispatch(Display.java:3107)
at org.eclipse.ui.internal.Workbench.runEventLoop(Workbench.java:2405)
at org.eclipse.ui.internal.Workbench.runUI(Workbench.java:2369)
at org.eclipse.ui.internal.Workbench.access$4(Workbench.java:2221)
at org.eclipse.ui.internal.Workbench$5.run(Workbench.java:500)
at org.eclipse.core.databinding.observable.Realm.runWithDefault(Realm.java:332)
at org.eclipse.ui.internal.Workbench.createAndRunWorkbench(Workbench.java:493)
at org.eclipse.ui.PlatformUI.createAndRunWorkbench(PlatformUI.java:149)
at org.eclipse.ui.internal.ide.application.IDEApplication.start(IDEApplication.java:113)
at org.eclipse.test.UITestApplication.runApplication(UITestApplication.java:138)
at org.eclipse.test.UITestApplication.run(UITestApplication.java:60)
at org.eclipse.test.UITestApplication.start(UITestApplication.java:210)
at org.eclipse.equinox.internal.app.EclipseAppHandle.run(EclipseAppHandle.java:194)
at org.eclipse.core.runtime.internal.adaptor.EclipseAppLauncher.runApplication(EclipseAppLauncher.java:110)
at org.eclipse.core.runtime.internal.adaptor.EclipseAppLauncher.start(EclipseAppLauncher.java:79)
at org.eclipse.core.runtime.adaptor.EclipseStarter.run(EclipseStarter.java:368)
at org.eclipse.core.runtime.adaptor.EclipseStarter.run(EclipseStarter.java:179)
at org.eclipse.equinox.launcher.Main.invokeFramework(Main.java:559)
at org.eclipse.equinox.launcher.Main.basicRun(Main.java:514)
at org.eclipse.equinox.launcher.Main.run(Main.java:1311)
at org.eclipse.equinox.launcher.Main.main(Main.java:1287)
at org.eclipse.core.launcher.Main.main(Main.java:34)
FAILED: SeamCoreAllTests
Error Message:
Problem marker was found in components.xml file expected:<0> but was:<3>
Stack Trace:
junit.framework.AssertionFailedError: Problem marker was found in components.xml file expected:<0> but was:<3>
at org.jboss.tools.seam.core.test.SeamValidatorsTest.testComponentsValidator(SeamValidatorsTest.java:145)
at junit.extensions.TestDecorator.basicRun(TestDecorator.java:24)
at junit.extensions.TestSetup$1.protect(TestSetup.java:21)
at junit.extensions.TestSetup.run(TestSetup.java:25)
at org.eclipse.test.EclipseTestRunner.run(EclipseTestRunner.java:354)
at org.eclipse.test.EclipseTestRunner.run(EclipseTestRunner.java:206)
at org.eclipse.test.UITestApplication$3.run(UITestApplication.java:195)
at org.eclipse.swt.widgets.RunnableLock.run(RunnableLock.java:35)
at org.eclipse.swt.widgets.Synchronizer.runAsyncMessages(Synchronizer.java:134)
at org.eclipse.swt.widgets.Display.runAsyncMessages(Display.java:3460)
at org.eclipse.swt.widgets.Display.readAndDispatch(Display.java:3107)
at org.eclipse.ui.internal.Workbench.runEventLoop(Workbench.java:2405)
at org.eclipse.ui.internal.Workbench.runUI(Workbench.java:2369)
at org.eclipse.ui.internal.Workbench.access$4(Workbench.java:2221)
at org.eclipse.ui.internal.Workbench$5.run(Workbench.java:500)
at org.eclipse.core.databinding.observable.Realm.runWithDefault(Realm.java:332)
at org.eclipse.ui.internal.Workbench.createAndRunWorkbench(Workbench.java:493)
at org.eclipse.ui.PlatformUI.createAndRunWorkbench(PlatformUI.java:149)
at org.eclipse.ui.internal.ide.application.IDEApplication.start(IDEApplication.java:113)
at org.eclipse.test.UITestApplication.runApplication(UITestApplication.java:138)
at org.eclipse.test.UITestApplication.run(UITestApplication.java:60)
at org.eclipse.test.UITestApplication.start(UITestApplication.java:210)
at org.eclipse.equinox.internal.app.EclipseAppHandle.run(EclipseAppHandle.java:194)
at org.eclipse.core.runtime.internal.adaptor.EclipseAppLauncher.runApplication(EclipseAppLauncher.java:110)
at org.eclipse.core.runtime.internal.adaptor.EclipseAppLauncher.start(EclipseAppLauncher.java:79)
at org.eclipse.core.runtime.adaptor.EclipseStarter.run(EclipseStarter.java:368)
at org.eclipse.core.runtime.adaptor.EclipseStarter.run(EclipseStarter.java:179)
at org.eclipse.equinox.launcher.Main.invokeFramework(Main.java:559)
at org.eclipse.equinox.launcher.Main.basicRun(Main.java:514)
at org.eclipse.equinox.launcher.Main.run(Main.java:1311)
at org.eclipse.equinox.launcher.Main.main(Main.java:1287)
at org.eclipse.core.launcher.Main.main(Main.java:34)
FAILED: SeamCoreAllTests
Error Message:
null
Stack Trace:
junit.framework.AssertionFailedError
at org.jboss.tools.seam.core.test.refactoring.SeamComponentRefactoringTest.renameComponent(SeamComponentRefactoringTest.java:116)
at org.jboss.tools.seam.core.test.refactoring.SeamComponentRefactoringTest.testSeamComponentRename(SeamComponentRefactoringTest.java:92)
at junit.extensions.TestDecorator.basicRun(TestDecorator.java:24)
at junit.extensions.TestSetup$1.protect(TestSetup.java:21)
at junit.extensions.TestSetup.run(TestSetup.java:25)
at org.eclipse.test.EclipseTestRunner.run(EclipseTestRunner.java:354)
at org.eclipse.test.EclipseTestRunner.run(EclipseTestRunner.java:206)
at org.eclipse.test.UITestApplication$3.run(UITestApplication.java:195)
at org.eclipse.swt.widgets.RunnableLock.run(RunnableLock.java:35)
at org.eclipse.swt.widgets.Synchronizer.runAsyncMessages(Synchronizer.java:134)
at org.eclipse.swt.widgets.Display.runAsyncMessages(Display.java:3460)
at org.eclipse.swt.widgets.Display.readAndDispatch(Display.java:3107)
at org.eclipse.ui.internal.Workbench.runEventLoop(Workbench.java:2405)
at org.eclipse.ui.internal.Workbench.runUI(Workbench.java:2369)
at org.eclipse.ui.internal.Workbench.access$4(Workbench.java:2221)
at org.eclipse.ui.internal.Workbench$5.run(Workbench.java:500)
at org.eclipse.core.databinding.observable.Realm.runWithDefault(Realm.java:332)
at org.eclipse.ui.internal.Workbench.createAndRunWorkbench(Workbench.java:493)
at org.eclipse.ui.PlatformUI.createAndRunWorkbench(PlatformUI.java:149)
at org.eclipse.ui.internal.ide.application.IDEApplication.start(IDEApplication.java:113)
at org.eclipse.test.UITestApplication.runApplication(UITestApplication.java:138)
at org.eclipse.test.UITestApplication.run(UITestApplication.java:60)
at org.eclipse.test.UITestApplication.start(UITestApplication.java:210)
at org.eclipse.equinox.internal.app.EclipseAppHandle.run(EclipseAppHandle.java:194)
at org.eclipse.core.runtime.internal.adaptor.EclipseAppLauncher.runApplication(EclipseAppLauncher.java:110)
at org.eclipse.core.runtime.internal.adaptor.EclipseAppLauncher.start(EclipseAppLauncher.java:79)
at org.eclipse.core.runtime.adaptor.EclipseStarter.run(EclipseStarter.java:368)
at org.eclipse.core.runtime.adaptor.EclipseStarter.run(EclipseStarter.java:179)
at org.eclipse.equinox.launcher.Main.invokeFramework(Main.java:559)
at org.eclipse.equinox.launcher.Main.basicRun(Main.java:514)
at org.eclipse.equinox.launcher.Main.run(Main.java:1311)
at org.eclipse.equinox.launcher.Main.main(Main.java:1287)
at org.eclipse.core.launcher.Main.main(Main.java:34)
FAILED: Seam20XFacetTestSuite201GA
Error Message:
Found additional files ([commons-beanutils.jar] in F/earprj-ear/EarContent at /qa/services/hudson/hudson_workspace/workspace/jbosstools-nightly-3.1.0.Alpha1/jbds-build/3.1.0.Alpha1/200905121444/tests/workspace/earprj-ear/EarContent
Stack Trace:
junit.framework.AssertionFailedError: Found additional files ([commons-beanutils.jar] in F/earprj-ear/EarContent at /qa/services/hudson/hudson_workspace/workspace/jbosstools-nightly-3.1.0.Alpha1/jbds-build/3.1.0.Alpha1/200905121444/tests/workspace/earprj-ear/EarContent
at org.jboss.tools.seam.core.test.project.facet.Seam2FacetInstallDelegateTest.assertOnlyContainsTheseFiles(Seam2FacetInstallDelegateTest.java:268)
at org.jboss.tools.seam.core.test.project.facet.Seam2FacetInstallDelegateTest.testEarLibs(Seam2FacetInstallDelegateTest.java:197)
at junit.extensions.TestDecorator.basicRun(TestDecorator.java:24)
at junit.extensions.TestSetup$1.protect(TestSetup.java:21)
at junit.extensions.TestSetup.run(TestSetup.java:25)
at org.eclipse.test.EclipseTestRunner.run(EclipseTestRunner.java:354)
at org.eclipse.test.EclipseTestRunner.run(EclipseTestRunner.java:206)
at org.eclipse.test.UITestApplication$3.run(UITestApplication.java:195)
at org.eclipse.swt.widgets.RunnableLock.run(RunnableLock.java:35)
at org.eclipse.swt.widgets.Synchronizer.runAsyncMessages(Synchronizer.java:134)
at org.eclipse.swt.widgets.Display.runAsyncMessages(Display.java:3460)
at org.eclipse.swt.widgets.Display.readAndDispatch(Display.java:3107)
at org.eclipse.ui.internal.Workbench.runEventLoop(Workbench.java:2405)
at org.eclipse.ui.internal.Workbench.runUI(Workbench.java:2369)
at org.eclipse.ui.internal.Workbench.access$4(Workbench.java:2221)
at org.eclipse.ui.internal.Workbench$5.run(Workbench.java:500)
at org.eclipse.core.databinding.observable.Realm.runWithDefault(Realm.java:332)
at org.eclipse.ui.internal.Workbench.createAndRunWorkbench(Workbench.java:493)
at org.eclipse.ui.PlatformUI.createAndRunWorkbench(PlatformUI.java:149)
at org.eclipse.ui.internal.ide.application.IDEApplication.start(IDEApplication.java:113)
at org.eclipse.test.UITestApplication.runApplication(UITestApplication.java:138)
at org.eclipse.test.UITestApplication.run(UITestApplication.java:60)
at org.eclipse.test.UITestApplication.start(UITestApplication.java:210)
at org.eclipse.equinox.internal.app.EclipseAppHandle.run(EclipseAppHandle.java:194)
at org.eclipse.core.runtime.internal.adaptor.EclipseAppLauncher.runApplication(EclipseAppLauncher.java:110)
at org.eclipse.core.runtime.internal.adaptor.EclipseAppLauncher.start(EclipseAppLauncher.java:79)
at org.eclipse.core.runtime.adaptor.EclipseStarter.run(EclipseStarter.java:368)
at org.eclipse.core.runtime.adaptor.EclipseStarter.run(EclipseStarter.java:179)
at org.eclipse.equinox.launcher.Main.invokeFramework(Main.java:559)
at org.eclipse.equinox.launcher.Main.basicRun(Main.java:514)
at org.eclipse.equinox.launcher.Main.run(Main.java:1311)
at org.eclipse.equinox.launcher.Main.main(Main.java:1287)
at org.eclipse.core.launcher.Main.main(Main.java:34)
FAILED: Seam20XFacetTestSuite202SP1
Error Message:
Found additional files ([commons-beanutils.jar] in F/earprj-ear/EarContent at /qa/services/hudson/hudson_workspace/workspace/jbosstools-nightly-3.1.0.Alpha1/jbds-build/3.1.0.Alpha1/200905121444/tests/workspace/earprj-ear/EarContent
Stack Trace:
junit.framework.AssertionFailedError: Found additional files ([commons-beanutils.jar] in F/earprj-ear/EarContent at /qa/services/hudson/hudson_workspace/workspace/jbosstools-nightly-3.1.0.Alpha1/jbds-build/3.1.0.Alpha1/200905121444/tests/workspace/earprj-ear/EarContent
at org.jboss.tools.seam.core.test.project.facet.Seam2FacetInstallDelegateTest.assertOnlyContainsTheseFiles(Seam2FacetInstallDelegateTest.java:268)
at org.jboss.tools.seam.core.test.project.facet.Seam2FacetInstallDelegateTest.testEarLibs(Seam2FacetInstallDelegateTest.java:197)
at junit.extensions.TestDecorator.basicRun(TestDecorator.java:24)
at junit.extensions.TestSetup$1.protect(TestSetup.java:21)
at junit.extensions.TestSetup.run(TestSetup.java:25)
at org.eclipse.test.EclipseTestRunner.run(EclipseTestRunner.java:354)
at org.eclipse.test.EclipseTestRunner.run(EclipseTestRunner.java:206)
at org.eclipse.test.UITestApplication$3.run(UITestApplication.java:195)
at org.eclipse.swt.widgets.RunnableLock.run(RunnableLock.java:35)
at org.eclipse.swt.widgets.Synchronizer.runAsyncMessages(Synchronizer.java:134)
at org.eclipse.swt.widgets.Display.runAsyncMessages(Display.java:3460)
at org.eclipse.swt.widgets.Display.readAndDispatch(Display.java:3107)
at org.eclipse.ui.internal.Workbench.runEventLoop(Workbench.java:2405)
at org.eclipse.ui.internal.Workbench.runUI(Workbench.java:2369)
at org.eclipse.ui.internal.Workbench.access$4(Workbench.java:2221)
at org.eclipse.ui.internal.Workbench$5.run(Workbench.java:500)
at org.eclipse.core.databinding.observable.Realm.runWithDefault(Realm.java:332)
at org.eclipse.ui.internal.Workbench.createAndRunWorkbench(Workbench.java:493)
at org.eclipse.ui.PlatformUI.createAndRunWorkbench(PlatformUI.java:149)
at org.eclipse.ui.internal.ide.application.IDEApplication.start(IDEApplication.java:113)
at org.eclipse.test.UITestApplication.runApplication(UITestApplication.java:138)
at org.eclipse.test.UITestApplication.run(UITestApplication.java:60)
at org.eclipse.test.UITestApplication.start(UITestApplication.java:210)
at org.eclipse.equinox.internal.app.EclipseAppHandle.run(EclipseAppHandle.java:194)
at org.eclipse.core.runtime.internal.adaptor.EclipseAppLauncher.runApplication(EclipseAppLauncher.java:110)
at org.eclipse.core.runtime.internal.adaptor.EclipseAppLauncher.start(EclipseAppLauncher.java:79)
at org.eclipse.core.runtime.adaptor.EclipseStarter.run(EclipseStarter.java:368)
at org.eclipse.core.runtime.adaptor.EclipseStarter.run(EclipseStarter.java:179)
at org.eclipse.equinox.launcher.Main.invokeFramework(Main.java:559)
at org.eclipse.equinox.launcher.Main.basicRun(Main.java:514)
at org.eclipse.equinox.launcher.Main.run(Main.java:1311)
at org.eclipse.equinox.launcher.Main.main(Main.java:1287)
at org.eclipse.core.launcher.Main.main(Main.java:34)
FAILED: Seam20XFacetTestSuite203CR1
Error Message:
Found additional files ([commons-beanutils.jar] in F/earprj-ear/EarContent at /qa/services/hudson/hudson_workspace/workspace/jbosstools-nightly-3.1.0.Alpha1/jbds-build/3.1.0.Alpha1/200905121444/tests/workspace/earprj-ear/EarContent
Stack Trace:
junit.framework.AssertionFailedError: Found additional files ([commons-beanutils.jar] in F/earprj-ear/EarContent at /qa/services/hudson/hudson_workspace/workspace/jbosstools-nightly-3.1.0.Alpha1/jbds-build/3.1.0.Alpha1/200905121444/tests/workspace/earprj-ear/EarContent
at org.jboss.tools.seam.core.test.project.facet.Seam2FacetInstallDelegateTest.assertOnlyContainsTheseFiles(Seam2FacetInstallDelegateTest.java:268)
at org.jboss.tools.seam.core.test.project.facet.Seam2FacetInstallDelegateTest.testEarLibs(Seam2FacetInstallDelegateTest.java:197)
at junit.extensions.TestDecorator.basicRun(TestDecorator.java:24)
at junit.extensions.TestSetup$1.protect(TestSetup.java:21)
at junit.extensions.TestSetup.run(TestSetup.java:25)
at org.eclipse.test.EclipseTestRunner.run(EclipseTestRunner.java:354)
at org.eclipse.test.EclipseTestRunner.run(EclipseTestRunner.java:206)
at org.eclipse.test.UITestApplication$3.run(UITestApplication.java:195)
at org.eclipse.swt.widgets.RunnableLock.run(RunnableLock.java:35)
at org.eclipse.swt.widgets.Synchronizer.runAsyncMessages(Synchronizer.java:134)
at org.eclipse.swt.widgets.Display.runAsyncMessages(Display.java:3460)
at org.eclipse.swt.widgets.Display.readAndDispatch(Display.java:3107)
at org.eclipse.ui.internal.Workbench.runEventLoop(Workbench.java:2405)
at org.eclipse.ui.internal.Workbench.runUI(Workbench.java:2369)
at org.eclipse.ui.internal.Workbench.access$4(Workbench.java:2221)
at org.eclipse.ui.internal.Workbench$5.run(Workbench.java:500)
at org.eclipse.core.databinding.observable.Realm.runWithDefault(Realm.java:332)
at org.eclipse.ui.internal.Workbench.createAndRunWorkbench(Workbench.java:493)
at org.eclipse.ui.PlatformUI.createAndRunWorkbench(PlatformUI.java:149)
at org.eclipse.ui.internal.ide.application.IDEApplication.start(IDEApplication.java:113)
at org.eclipse.test.UITestApplication.runApplication(UITestApplication.java:138)
at org.eclipse.test.UITestApplication.run(UITestApplication.java:60)
at org.eclipse.test.UITestApplication.start(UITestApplication.java:210)
at org.eclipse.equinox.internal.app.EclipseAppHandle.run(EclipseAppHandle.java:194)
at org.eclipse.core.runtime.internal.adaptor.EclipseAppLauncher.runApplication(EclipseAppLauncher.java:110)
at org.eclipse.core.runtime.internal.adaptor.EclipseAppLauncher.start(EclipseAppLauncher.java:79)
at org.eclipse.core.runtime.adaptor.EclipseStarter.run(EclipseStarter.java:368)
at org.eclipse.core.runtime.adaptor.EclipseStarter.run(EclipseStarter.java:179)
at org.eclipse.equinox.launcher.Main.invokeFramework(Main.java:559)
at org.eclipse.equinox.launcher.Main.basicRun(Main.java:514)
at org.eclipse.equinox.launcher.Main.run(Main.java:1311)
at org.eclipse.equinox.launcher.Main.main(Main.java:1287)
at org.eclipse.core.launcher.Main.main(Main.java:34)
FAILED: Seam20XFacetTestSuiteFP
Error Message:
Found additional files ([commons-beanutils.jar] in F/earprj-ear/EarContent at /qa/services/hudson/hudson_workspace/workspace/jbosstools-nightly-3.1.0.Alpha1/jbds-build/3.1.0.Alpha1/200905121444/tests/workspace/earprj-ear/EarContent
Stack Trace:
junit.framework.AssertionFailedError: Found additional files ([commons-beanutils.jar] in F/earprj-ear/EarContent at /qa/services/hudson/hudson_workspace/workspace/jbosstools-nightly-3.1.0.Alpha1/jbds-build/3.1.0.Alpha1/200905121444/tests/workspace/earprj-ear/EarContent
at org.jboss.tools.seam.core.test.project.facet.Seam2FacetInstallDelegateTest.assertOnlyContainsTheseFiles(Seam2FacetInstallDelegateTest.java:268)
at org.jboss.tools.seam.core.test.project.facet.Seam2FacetInstallDelegateTest.testEarLibs(Seam2FacetInstallDelegateTest.java:197)
at junit.extensions.TestDecorator.basicRun(TestDecorator.java:24)
at junit.extensions.TestSetup$1.protect(TestSetup.java:21)
at junit.extensions.TestSetup.run(TestSetup.java:25)
at org.eclipse.test.EclipseTestRunner.run(EclipseTestRunner.java:354)
at org.eclipse.test.EclipseTestRunner.run(EclipseTestRunner.java:206)
at org.eclipse.test.UITestApplication$3.run(UITestApplication.java:195)
at org.eclipse.swt.widgets.RunnableLock.run(RunnableLock.java:35)
at org.eclipse.swt.widgets.Synchronizer.runAsyncMessages(Synchronizer.java:134)
at org.eclipse.swt.widgets.Display.runAsyncMessages(Display.java:3460)
at org.eclipse.swt.widgets.Display.readAndDispatch(Display.java:3107)
at org.eclipse.ui.internal.Workbench.runEventLoop(Workbench.java:2405)
at org.eclipse.ui.internal.Workbench.runUI(Workbench.java:2369)
at org.eclipse.ui.internal.Workbench.access$4(Workbench.java:2221)
at org.eclipse.ui.internal.Workbench$5.run(Workbench.java:500)
at org.eclipse.core.databinding.observable.Realm.runWithDefault(Realm.java:332)
at org.eclipse.ui.internal.Workbench.createAndRunWorkbench(Workbench.java:493)
at org.eclipse.ui.PlatformUI.createAndRunWorkbench(PlatformUI.java:149)
at org.eclipse.ui.internal.ide.application.IDEApplication.start(IDEApplication.java:113)
at org.eclipse.test.UITestApplication.runApplication(UITestApplication.java:138)
at org.eclipse.test.UITestApplication.run(UITestApplication.java:60)
at org.eclipse.test.UITestApplication.start(UITestApplication.java:210)
at org.eclipse.equinox.internal.app.EclipseAppHandle.run(EclipseAppHandle.java:194)
at org.eclipse.core.runtime.internal.adaptor.EclipseAppLauncher.runApplication(EclipseAppLauncher.java:110)
at org.eclipse.core.runtime.internal.adaptor.EclipseAppLauncher.start(EclipseAppLauncher.java:79)
at org.eclipse.core.runtime.adaptor.EclipseStarter.run(EclipseStarter.java:368)
at org.eclipse.core.runtime.adaptor.EclipseStarter.run(EclipseStarter.java:179)
at org.eclipse.equinox.launcher.Main.invokeFramework(Main.java:559)
at org.eclipse.equinox.launcher.Main.basicRun(Main.java:514)
at org.eclipse.equinox.launcher.Main.run(Main.java:1311)
at org.eclipse.equinox.launcher.Main.main(Main.java:1287)
at org.eclipse.core.launcher.Main.main(Main.java:34)
FAILED: SeamUiAllTests
Error Message:
Model source folder property is not set expected:<[]> but was:<[/TestSeamSettingsPreferencesPage/src]>
Stack Trace:
junit.framework.ComparisonFailure: Model source folder property is not set expected:<[]> but was:<[/TestSeamSettingsPreferencesPage/src]>
at org.jboss.tools.seam.ui.test.preferences.SeamSettingsPreferencesPageTest.testSettingsPage(SeamSettingsPreferencesPageTest.java:120)
at junit.extensions.TestDecorator.basicRun(TestDecorator.java:24)
at junit.extensions.TestSetup$1.protect(TestSetup.java:21)
at junit.extensions.TestSetup.run(TestSetup.java:25)
at org.eclipse.test.EclipseTestRunner.run(EclipseTestRunner.java:354)
at org.eclipse.test.EclipseTestRunner.run(EclipseTestRunner.java:206)
at org.eclipse.test.UITestApplication$3.run(UITestApplication.java:195)
at org.eclipse.swt.widgets.RunnableLock.run(RunnableLock.java:35)
at org.eclipse.swt.widgets.Synchronizer.runAsyncMessages(Synchronizer.java:134)
at org.eclipse.swt.widgets.Display.runAsyncMessages(Display.java:3460)
at org.eclipse.swt.widgets.Display.readAndDispatch(Display.java:3107)
at org.eclipse.ui.internal.Workbench.runEventLoop(Workbench.java:2405)
at org.eclipse.ui.internal.Workbench.runUI(Workbench.java:2369)
at org.eclipse.ui.internal.Workbench.access$4(Workbench.java:2221)
at org.eclipse.ui.internal.Workbench$5.run(Workbench.java:500)
at org.eclipse.core.databinding.observable.Realm.runWithDefault(Realm.java:332)
at org.eclipse.ui.internal.Workbench.createAndRunWorkbench(Workbench.java:493)
at org.eclipse.ui.PlatformUI.createAndRunWorkbench(PlatformUI.java:149)
at org.eclipse.ui.internal.ide.application.IDEApplication.start(IDEApplication.java:113)
at org.eclipse.test.UITestApplication.runApplication(UITestApplication.java:138)
at org.eclipse.test.UITestApplication.run(UITestApplication.java:60)
at org.eclipse.test.UITestApplication.start(UITestApplication.java:210)
at org.eclipse.equinox.internal.app.EclipseAppHandle.run(EclipseAppHandle.java:194)
at org.eclipse.core.runtime.internal.adaptor.EclipseAppLauncher.runApplication(EclipseAppLauncher.java:110)
at org.eclipse.core.runtime.internal.adaptor.EclipseAppLauncher.start(EclipseAppLauncher.java:79)
at org.eclipse.core.runtime.adaptor.EclipseStarter.run(EclipseStarter.java:368)
at org.eclipse.core.runtime.adaptor.EclipseStarter.run(EclipseStarter.java:179)
at org.eclipse.equinox.launcher.Main.invokeFramework(Main.java:559)
at org.eclipse.equinox.launcher.Main.basicRun(Main.java:514)
at org.eclipse.equinox.launcher.Main.run(Main.java:1311)
at org.eclipse.equinox.launcher.Main.main(Main.java:1287)
at org.eclipse.core.launcher.Main.main(Main.java:34)
FAILED: ToolsAllTests
Error Message:
org.jboss.tools.jst.web.debug failed to load.
Stack Trace:
junit.framework.AssertionFailedError: org.jboss.tools.jst.web.debug failed to load.
at org.jboss.tools.tests.PlugInLoadTest.isPluginResolved(PlugInLoadTest.java:36)
at org.jboss.tools.tests.PlugInLoadTest.assertPluginsResolved(PlugInLoadTest.java:53)
at org.jboss.tools.tests.PlugInLoadTest.testJstPluginsResolved(PlugInLoadTest.java:85)
at org.eclipse.test.EclipseTestRunner.run(EclipseTestRunner.java:354)
at org.eclipse.test.EclipseTestRunner.run(EclipseTestRunner.java:206)
at org.eclipse.test.UITestApplication$3.run(UITestApplication.java:195)
at org.eclipse.swt.widgets.RunnableLock.run(RunnableLock.java:35)
at org.eclipse.swt.widgets.Synchronizer.runAsyncMessages(Synchronizer.java:134)
at org.eclipse.swt.widgets.Display.runAsyncMessages(Display.java:3460)
at org.eclipse.swt.widgets.Display.readAndDispatch(Display.java:3107)
at org.eclipse.ui.internal.Workbench.runEventLoop(Workbench.java:2405)
at org.eclipse.ui.internal.Workbench.runUI(Workbench.java:2369)
at org.eclipse.ui.internal.Workbench.access$4(Workbench.java:2221)
at org.eclipse.ui.internal.Workbench$5.run(Workbench.java:500)
at org.eclipse.core.databinding.observable.Realm.runWithDefault(Realm.java:332)
at org.eclipse.ui.internal.Workbench.createAndRunWorkbench(Workbench.java:493)
at org.eclipse.ui.PlatformUI.createAndRunWorkbench(PlatformUI.java:149)
at org.eclipse.ui.internal.ide.application.IDEApplication.start(IDEApplication.java:113)
at org.eclipse.test.UITestApplication.runApplication(UITestApplication.java:138)
at org.eclipse.test.UITestApplication.run(UITestApplication.java:60)
at org.eclipse.test.UITestApplication.start(UITestApplication.java:210)
at org.eclipse.equinox.internal.app.EclipseAppHandle.run(EclipseAppHandle.java:194)
at org.eclipse.core.runtime.internal.adaptor.EclipseAppLauncher.runApplication(EclipseAppLauncher.java:110)
at org.eclipse.core.runtime.internal.adaptor.EclipseAppLauncher.start(EclipseAppLauncher.java:79)
at org.eclipse.core.runtime.adaptor.EclipseStarter.run(EclipseStarter.java:368)
at org.eclipse.core.runtime.adaptor.EclipseStarter.run(EclipseStarter.java:179)
at org.eclipse.equinox.launcher.Main.invokeFramework(Main.java:559)
at org.eclipse.equinox.launcher.Main.basicRun(Main.java:514)
at org.eclipse.equinox.launcher.Main.run(Main.java:1311)
at org.eclipse.equinox.launcher.Main.main(Main.java:1287)
at org.eclipse.core.launcher.Main.main(Main.java:34)
FAILED: ToolsAllTests
Error Message:
org.jboss.tools.struts.debug failed to load.
Stack Trace:
junit.framework.AssertionFailedError: org.jboss.tools.struts.debug failed to load.
at org.jboss.tools.tests.PlugInLoadTest.isPluginResolved(PlugInLoadTest.java:36)
at org.jboss.tools.tests.PlugInLoadTest.assertPluginsResolved(PlugInLoadTest.java:53)
at org.jboss.tools.tests.PlugInLoadTest.testStrutsPluginsResolved(PlugInLoadTest.java:104)
at org.eclipse.test.EclipseTestRunner.run(EclipseTestRunner.java:354)
at org.eclipse.test.EclipseTestRunner.run(EclipseTestRunner.java:206)
at org.eclipse.test.UITestApplication$3.run(UITestApplication.java:195)
at org.eclipse.swt.widgets.RunnableLock.run(RunnableLock.java:35)
at org.eclipse.swt.widgets.Synchronizer.runAsyncMessages(Synchronizer.java:134)
at org.eclipse.swt.widgets.Display.runAsyncMessages(Display.java:3460)
at org.eclipse.swt.widgets.Display.readAndDispatch(Display.java:3107)
at org.eclipse.ui.internal.Workbench.runEventLoop(Workbench.java:2405)
at org.eclipse.ui.internal.Workbench.runUI(Workbench.java:2369)
at org.eclipse.ui.internal.Workbench.access$4(Workbench.java:2221)
at org.eclipse.ui.internal.Workbench$5.run(Workbench.java:500)
at org.eclipse.core.databinding.observable.Realm.runWithDefault(Realm.java:332)
at org.eclipse.ui.internal.Workbench.createAndRunWorkbench(Workbench.java:493)
at org.eclipse.ui.PlatformUI.createAndRunWorkbench(PlatformUI.java:149)
at org.eclipse.ui.internal.ide.application.IDEApplication.start(IDEApplication.java:113)
at org.eclipse.test.UITestApplication.runApplication(UITestApplication.java:138)
at org.eclipse.test.UITestApplication.run(UITestApplication.java:60)
at org.eclipse.test.UITestApplication.start(UITestApplication.java:210)
at org.eclipse.equinox.internal.app.EclipseAppHandle.run(EclipseAppHandle.java:194)
at org.eclipse.core.runtime.internal.adaptor.EclipseAppLauncher.runApplication(EclipseAppLauncher.java:110)
at org.eclipse.core.runtime.internal.adaptor.EclipseAppLauncher.start(EclipseAppLauncher.java:79)
at org.eclipse.core.runtime.adaptor.EclipseStarter.run(EclipseStarter.java:368)
at org.eclipse.core.runtime.adaptor.EclipseStarter.run(EclipseStarter.java:179)
at org.eclipse.equinox.launcher.Main.invokeFramework(Main.java:559)
at org.eclipse.equinox.launcher.Main.basicRun(Main.java:514)
at org.eclipse.equinox.launcher.Main.run(Main.java:1311)
at org.eclipse.equinox.launcher.Main.main(Main.java:1287)
at org.eclipse.core.launcher.Main.main(Main.java:34)
FAILED: HtmlAllTests
Error Message:
null
Stack Trace:
java.lang.NullPointerException
at org.jboss.tools.vpe.html.test.jbide.JBIDE3280Test.testJBIDE3280(JBIDE3280Test.java:66)
at junit.extensions.TestDecorator.basicRun(TestDecorator.java:24)
at junit.extensions.TestSetup$1.protect(TestSetup.java:21)
at junit.extensions.TestSetup.run(TestSetup.java:25)
at org.eclipse.test.EclipseTestRunner.run(EclipseTestRunner.java:354)
at org.eclipse.test.EclipseTestRunner.run(EclipseTestRunner.java:206)
at org.eclipse.test.UITestApplication$3.run(UITestApplication.java:195)
at org.eclipse.swt.widgets.RunnableLock.run(RunnableLock.java:35)
at org.eclipse.swt.widgets.Synchronizer.runAsyncMessages(Synchronizer.java:134)
at org.eclipse.swt.widgets.Display.runAsyncMessages(Display.java:3460)
at org.eclipse.swt.widgets.Display.readAndDispatch(Display.java:3107)
at org.eclipse.ui.internal.Workbench.runEventLoop(Workbench.java:2405)
at org.eclipse.ui.internal.Workbench.runUI(Workbench.java:2369)
at org.eclipse.ui.internal.Workbench.access$4(Workbench.java:2221)
at org.eclipse.ui.internal.Workbench$5.run(Workbench.java:500)
at org.eclipse.core.databinding.observable.Realm.runWithDefault(Realm.java:332)
at org.eclipse.ui.internal.Workbench.createAndRunWorkbench(Workbench.java:493)
at org.eclipse.ui.PlatformUI.createAndRunWorkbench(PlatformUI.java:149)
at org.eclipse.ui.internal.ide.application.IDEApplication.start(IDEApplication.java:113)
at org.eclipse.test.UITestApplication.runApplication(UITestApplication.java:138)
at org.eclipse.test.UITestApplication.run(UITestApplication.java:60)
at org.eclipse.test.UITestApplication.start(UITestApplication.java:210)
at org.eclipse.equinox.internal.app.EclipseAppHandle.run(EclipseAppHandle.java:194)
at org.eclipse.core.runtime.internal.adaptor.EclipseAppLauncher.runApplication(EclipseAppLauncher.java:110)
at org.eclipse.core.runtime.internal.adaptor.EclipseAppLauncher.start(EclipseAppLauncher.java:79)
at org.eclipse.core.runtime.adaptor.EclipseStarter.run(EclipseStarter.java:368)
at org.eclipse.core.runtime.adaptor.EclipseStarter.run(EclipseStarter.java:179)
at org.eclipse.equinox.launcher.Main.invokeFramework(Main.java:559)
at org.eclipse.equinox.launcher.Main.basicRun(Main.java:514)
at org.eclipse.equinox.launcher.Main.run(Main.java:1311)
at org.eclipse.equinox.launcher.Main.main(Main.java:1287)
at org.eclipse.core.launcher.Main.main(Main.java:34)
FAILED: HtmlAllTests
Error Message:
name of tag is "#text"but must be "BR"
Stack Trace:
junit.framework.AssertionFailedError: name of tag is "#text"but must be "BR"
at org.jboss.tools.vpe.ui.test.ComponentContentTest.compareElements(ComponentContentTest.java:136)
at org.jboss.tools.vpe.ui.test.ComponentContentTest.performContentTest(ComponentContentTest.java:95)
at org.jboss.tools.vpe.html.test.HtmlComponentContentTest.testPre(HtmlComponentContentTest.java:334)
at junit.extensions.TestDecorator.basicRun(TestDecorator.java:24)
at junit.extensions.TestSetup$1.protect(TestSetup.java:21)
at junit.extensions.TestSetup.run(TestSetup.java:25)
at org.eclipse.test.EclipseTestRunner.run(EclipseTestRunner.java:354)
at org.eclipse.test.EclipseTestRunner.run(EclipseTestRunner.java:206)
at org.eclipse.test.UITestApplication$3.run(UITestApplication.java:195)
at org.eclipse.swt.widgets.RunnableLock.run(RunnableLock.java:35)
at org.eclipse.swt.widgets.Synchronizer.runAsyncMessages(Synchronizer.java:134)
at org.eclipse.swt.widgets.Display.runAsyncMessages(Display.java:3460)
at org.eclipse.swt.widgets.Display.readAndDispatch(Display.java:3107)
at org.eclipse.ui.internal.Workbench.runEventLoop(Workbench.java:2405)
at org.eclipse.ui.internal.Workbench.runUI(Workbench.java:2369)
at org.eclipse.ui.internal.Workbench.access$4(Workbench.java:2221)
at org.eclipse.ui.internal.Workbench$5.run(Workbench.java:500)
at org.eclipse.core.databinding.observable.Realm.runWithDefault(Realm.java:332)
at org.eclipse.ui.internal.Workbench.createAndRunWorkbench(Workbench.java:493)
at org.eclipse.ui.PlatformUI.createAndRunWorkbench(PlatformUI.java:149)
at org.eclipse.ui.internal.ide.application.IDEApplication.start(IDEApplication.java:113)
at org.eclipse.test.UITestApplication.runApplication(UITestApplication.java:138)
at org.eclipse.test.UITestApplication.run(UITestApplication.java:60)
at org.eclipse.test.UITestApplication.start(UITestApplication.java:210)
at org.eclipse.equinox.internal.app.EclipseAppHandle.run(EclipseAppHandle.java:194)
at org.eclipse.core.runtime.internal.adaptor.EclipseAppLauncher.runApplication(EclipseAppLauncher.java:110)
at org.eclipse.core.runtime.internal.adaptor.EclipseAppLauncher.start(EclipseAppLauncher.java:79)
at org.eclipse.core.runtime.adaptor.EclipseStarter.run(EclipseStarter.java:368)
at org.eclipse.core.runtime.adaptor.EclipseStarter.run(EclipseStarter.java:179)
at org.eclipse.equinox.launcher.Main.invokeFramework(Main.java:559)
at org.eclipse.equinox.launcher.Main.basicRun(Main.java:514)
at org.eclipse.equinox.launcher.Main.run(Main.java:1311)
at org.eclipse.equinox.launcher.Main.main(Main.java:1287)
at org.eclipse.core.launcher.Main.main(Main.java:34)
FAILED: HtmlAllTests
Error Message:
name of tag is "#text"but must be "BR"
Stack Trace:
junit.framework.AssertionFailedError: name of tag is "#text"but must be "BR"
at org.jboss.tools.vpe.ui.test.ComponentContentTest.compareElements(ComponentContentTest.java:136)
at org.jboss.tools.vpe.ui.test.ComponentContentTest.performContentTest(ComponentContentTest.java:95)
at org.jboss.tools.vpe.html.test.HtmlComponentContentTest.testXmp(HtmlComponentContentTest.java:415)
at junit.extensions.TestDecorator.basicRun(TestDecorator.java:24)
at junit.extensions.TestSetup$1.protect(TestSetup.java:21)
at junit.extensions.TestSetup.run(TestSetup.java:25)
at org.eclipse.test.EclipseTestRunner.run(EclipseTestRunner.java:354)
at org.eclipse.test.EclipseTestRunner.run(EclipseTestRunner.java:206)
at org.eclipse.test.UITestApplication$3.run(UITestApplication.java:195)
at org.eclipse.swt.widgets.RunnableLock.run(RunnableLock.java:35)
at org.eclipse.swt.widgets.Synchronizer.runAsyncMessages(Synchronizer.java:134)
at org.eclipse.swt.widgets.Display.runAsyncMessages(Display.java:3460)
at org.eclipse.swt.widgets.Display.readAndDispatch(Display.java:3107)
at org.eclipse.ui.internal.Workbench.runEventLoop(Workbench.java:2405)
at org.eclipse.ui.internal.Workbench.runUI(Workbench.java:2369)
at org.eclipse.ui.internal.Workbench.access$4(Workbench.java:2221)
at org.eclipse.ui.internal.Workbench$5.run(Workbench.java:500)
at org.eclipse.core.databinding.observable.Realm.runWithDefault(Realm.java:332)
at org.eclipse.ui.internal.Workbench.createAndRunWorkbench(Workbench.java:493)
at org.eclipse.ui.PlatformUI.createAndRunWorkbench(PlatformUI.java:149)
at org.eclipse.ui.internal.ide.application.IDEApplication.start(IDEApplication.java:113)
at org.eclipse.test.UITestApplication.runApplication(UITestApplication.java:138)
at org.eclipse.test.UITestApplication.run(UITestApplication.java:60)
at org.eclipse.test.UITestApplication.start(UITestApplication.java:210)
at org.eclipse.equinox.internal.app.EclipseAppHandle.run(EclipseAppHandle.java:194)
at org.eclipse.core.runtime.internal.adaptor.EclipseAppLauncher.runApplication(EclipseAppLauncher.java:110)
at org.eclipse.core.runtime.internal.adaptor.EclipseAppLauncher.start(EclipseAppLauncher.java:79)
at org.eclipse.core.runtime.adaptor.EclipseStarter.run(EclipseStarter.java:368)
at org.eclipse.core.runtime.adaptor.EclipseStarter.run(EclipseStarter.java:179)
at org.eclipse.equinox.launcher.Main.invokeFramework(Main.java:559)
at org.eclipse.equinox.launcher.Main.basicRun(Main.java:514)
at org.eclipse.equinox.launcher.Main.run(Main.java:1311)
at org.eclipse.equinox.launcher.Main.main(Main.java:1287)
at org.eclipse.core.launcher.Main.main(Main.java:34)
FAILED: VpeAllTests
Error Message:
Sheme vpe-templates-jsf.xml is not valid : cvc-complex-type.3.2.2: Attribute 'class' is not allowed to appear in element 'ul'.
Stack Trace:
junit.framework.AssertionFailedError: Sheme vpe-templates-jsf.xml is not valid : cvc-complex-type.3.2.2: Attribute 'class' is not allowed to appear in element 'ul'.
at org.jboss.tools.vpe.test.TemplateSchemeValidateTest.testValidationGlobalTemplates(TemplateSchemeValidateTest.java:119)
at junit.extensions.TestDecorator.basicRun(TestDecorator.java:24)
at junit.extensions.TestSetup$1.protect(TestSetup.java:21)
at junit.extensions.TestSetup.run(TestSetup.java:25)
at org.eclipse.test.EclipseTestRunner.run(EclipseTestRunner.java:354)
at org.eclipse.test.EclipseTestRunner.run(EclipseTestRunner.java:206)
at org.eclipse.test.UITestApplication$3.run(UITestApplication.java:195)
at org.eclipse.swt.widgets.RunnableLock.run(RunnableLock.java:35)
at org.eclipse.swt.widgets.Synchronizer.runAsyncMessages(Synchronizer.java:134)
at org.eclipse.swt.widgets.Display.runAsyncMessages(Display.java:3460)
at org.eclipse.swt.widgets.Display.readAndDispatch(Display.java:3107)
at org.eclipse.ui.internal.Workbench.runEventLoop(Workbench.java:2405)
at org.eclipse.ui.internal.Workbench.runUI(Workbench.java:2369)
at org.eclipse.ui.internal.Workbench.access$4(Workbench.java:2221)
at org.eclipse.ui.internal.Workbench$5.run(Workbench.java:500)
at org.eclipse.core.databinding.observable.Realm.runWithDefault(Realm.java:332)
at org.eclipse.ui.internal.Workbench.createAndRunWorkbench(Workbench.java:493)
at org.eclipse.ui.PlatformUI.createAndRunWorkbench(PlatformUI.java:149)
at org.eclipse.ui.internal.ide.application.IDEApplication.start(IDEApplication.java:113)
at org.eclipse.test.UITestApplication.runApplication(UITestApplication.java:138)
at org.eclipse.test.UITestApplication.run(UITestApplication.java:60)
at org.eclipse.test.UITestApplication.start(UITestApplication.java:210)
at org.eclipse.equinox.internal.app.EclipseAppHandle.run(EclipseAppHandle.java:194)
at org.eclipse.core.runtime.internal.adaptor.EclipseAppLauncher.runApplication(EclipseAppLauncher.java:110)
at org.eclipse.core.runtime.internal.adaptor.EclipseAppLauncher.start(EclipseAppLauncher.java:79)
at org.eclipse.core.runtime.adaptor.EclipseStarter.run(EclipseStarter.java:368)
at org.eclipse.core.runtime.adaptor.EclipseStarter.run(EclipseStarter.java:179)
at org.eclipse.equinox.launcher.Main.invokeFramework(Main.java:559)
at org.eclipse.equinox.launcher.Main.basicRun(Main.java:514)
at org.eclipse.equinox.launcher.Main.run(Main.java:1311)
at org.eclipse.equinox.launcher.Main.main(Main.java:1287)
at org.eclipse.core.launcher.Main.main(Main.java:34)
FAILED: JBossWSCoreAllTests
Error Message:
Error: Could not generate. (use --show-traces to see full traces) Error: com/sun/codemodel/JExpression
Stack Trace:
junit.framework.AssertionFailedError: Error: Could not generate. (use --show-traces to see full traces)
Error: com/sun/codemodel/JExpression
at org.jboss.tools.ws.core.test.command.JBossWSJavaFirstCommandTest.testWSProviderInvokeCommand(JBossWSJavaFirstCommandTest.java:142)
at org.eclipse.test.EclipseTestRunner.run(EclipseTestRunner.java:354)
at org.eclipse.test.EclipseTestRunner.run(EclipseTestRunner.java:206)
at org.eclipse.test.UITestApplication$3.run(UITestApplication.java:195)
at org.eclipse.swt.widgets.RunnableLock.run(RunnableLock.java:35)
at org.eclipse.swt.widgets.Synchronizer.runAsyncMessages(Synchronizer.java:134)
at org.eclipse.swt.widgets.Display.runAsyncMessages(Display.java:3460)
at org.eclipse.swt.widgets.Display.readAndDispatch(Display.java:3107)
at org.eclipse.ui.internal.Workbench.runEventLoop(Workbench.java:2405)
at org.eclipse.ui.internal.Workbench.runUI(Workbench.java:2369)
at org.eclipse.ui.internal.Workbench.access$4(Workbench.java:2221)
at org.eclipse.ui.internal.Workbench$5.run(Workbench.java:500)
at org.eclipse.core.databinding.observable.Realm.runWithDefault(Realm.java:332)
at org.eclipse.ui.internal.Workbench.createAndRunWorkbench(Workbench.java:493)
at org.eclipse.ui.PlatformUI.createAndRunWorkbench(PlatformUI.java:149)
at org.eclipse.ui.internal.ide.application.IDEApplication.start(IDEApplication.java:113)
at org.eclipse.test.UITestApplication.runApplication(UITestApplication.java:138)
at org.eclipse.test.UITestApplication.run(UITestApplication.java:60)
at org.eclipse.test.UITestApplication.start(UITestApplication.java:210)
at org.eclipse.equinox.internal.app.EclipseAppHandle.run(EclipseAppHandle.java:194)
at org.eclipse.core.runtime.internal.adaptor.EclipseAppLauncher.runApplication(EclipseAppLauncher.java:110)
at org.eclipse.core.runtime.internal.adaptor.EclipseAppLauncher.start(EclipseAppLauncher.java:79)
at org.eclipse.core.runtime.adaptor.EclipseStarter.run(EclipseStarter.java:368)
at org.eclipse.core.runtime.adaptor.EclipseStarter.run(EclipseStarter.java:179)
at org.eclipse.equinox.launcher.Main.invokeFramework(Main.java:559)
at org.eclipse.equinox.launcher.Main.basicRun(Main.java:514)
at org.eclipse.equinox.launcher.Main.run(Main.java:1311)
at org.eclipse.equinox.launcher.Main.main(Main.java:1287)
at org.eclipse.core.launcher.Main.main(Main.java:34)
FAILED: JBossWSCoreAllTests
Error Message:
Error: Could not generate. (use --show-traces to see full traces) Error: com/sun/codemodel/JExpression
Stack Trace:
junit.framework.AssertionFailedError: Error: Could not generate. (use --show-traces to see full traces)
Error: com/sun/codemodel/JExpression
at org.jboss.tools.ws.core.test.command.JBossWSJavaFirstCommandTest.testDeployResult(JBossWSJavaFirstCommandTest.java:170)
at org.eclipse.test.EclipseTestRunner.run(EclipseTestRunner.java:354)
at org.eclipse.test.EclipseTestRunner.run(EclipseTestRunner.java:206)
at org.eclipse.test.UITestApplication$3.run(UITestApplication.java:195)
at org.eclipse.swt.widgets.RunnableLock.run(RunnableLock.java:35)
at org.eclipse.swt.widgets.Synchronizer.runAsyncMessages(Synchronizer.java:134)
at org.eclipse.swt.widgets.Display.runAsyncMessages(Display.java:3460)
at org.eclipse.swt.widgets.Display.readAndDispatch(Display.java:3107)
at org.eclipse.ui.internal.Workbench.runEventLoop(Workbench.java:2405)
at org.eclipse.ui.internal.Workbench.runUI(Workbench.java:2369)
at org.eclipse.ui.internal.Workbench.access$4(Workbench.java:2221)
at org.eclipse.ui.internal.Workbench$5.run(Workbench.java:500)
at org.eclipse.core.databinding.observable.Realm.runWithDefault(Realm.java:332)
at org.eclipse.ui.internal.Workbench.createAndRunWorkbench(Workbench.java:493)
at org.eclipse.ui.PlatformUI.createAndRunWorkbench(PlatformUI.java:149)
at org.eclipse.ui.internal.ide.application.IDEApplication.start(IDEApplication.java:113)
at org.eclipse.test.UITestApplication.runApplication(UITestApplication.java:138)
at org.eclipse.test.UITestApplication.run(UITestApplication.java:60)
at org.eclipse.test.UITestApplication.start(UITestApplication.java:210)
at org.eclipse.equinox.internal.app.EclipseAppHandle.run(EclipseAppHandle.java:194)
at org.eclipse.core.runtime.internal.adaptor.EclipseAppLauncher.runApplication(EclipseAppLauncher.java:110)
at org.eclipse.core.runtime.internal.adaptor.EclipseAppLauncher.start(EclipseAppLauncher.java:79)
at org.eclipse.core.runtime.adaptor.EclipseStarter.run(EclipseStarter.java:368)
at org.eclipse.core.runtime.adaptor.EclipseStarter.run(EclipseStarter.java:179)
at org.eclipse.equinox.launcher.Main.invokeFramework(Main.java:559)
at org.eclipse.equinox.launcher.Main.basicRun(Main.java:514)
at org.eclipse.equinox.launcher.Main.run(Main.java:1311)
at org.eclipse.equinox.launcher.Main.main(Main.java:1287)
at org.eclipse.core.launcher.Main.main(Main.java:34)
FAILED: JBossWSCoreAllTests
Error Message:
Failed to generate implementation class
Stack Trace:
junit.framework.AssertionFailedError: Failed to generate implementation class
at org.jboss.tools.ws.core.test.command.JBossWSTopDownCommandTest.testDeployResult(JBossWSTopDownCommandTest.java:220)
at org.eclipse.test.EclipseTestRunner.run(EclipseTestRunner.java:354)
at org.eclipse.test.EclipseTestRunner.run(EclipseTestRunner.java:206)
at org.eclipse.test.UITestApplication$3.run(UITestApplication.java:195)
at org.eclipse.swt.widgets.RunnableLock.run(RunnableLock.java:35)
at org.eclipse.swt.widgets.Synchronizer.runAsyncMessages(Synchronizer.java:134)
at org.eclipse.swt.widgets.Display.runAsyncMessages(Display.java:3460)
at org.eclipse.swt.widgets.Display.readAndDispatch(Display.java:3107)
at org.eclipse.ui.internal.Workbench.runEventLoop(Workbench.java:2405)
at org.eclipse.ui.internal.Workbench.runUI(Workbench.java:2369)
at org.eclipse.ui.internal.Workbench.access$4(Workbench.java:2221)
at org.eclipse.ui.internal.Workbench$5.run(Workbench.java:500)
at org.eclipse.core.databinding.observable.Realm.runWithDefault(Realm.java:332)
at org.eclipse.ui.internal.Workbench.createAndRunWorkbench(Workbench.java:493)
at org.eclipse.ui.PlatformUI.createAndRunWorkbench(PlatformUI.java:149)
at org.eclipse.ui.internal.ide.application.IDEApplication.start(IDEApplication.java:113)
at org.eclipse.test.UITestApplication.runApplication(UITestApplication.java:138)
at org.eclipse.test.UITestApplication.run(UITestApplication.java:60)
at org.eclipse.test.UITestApplication.start(UITestApplication.java:210)
at org.eclipse.equinox.internal.app.EclipseAppHandle.run(EclipseAppHandle.java:194)
at org.eclipse.core.runtime.internal.adaptor.EclipseAppLauncher.runApplication(EclipseAppLauncher.java:110)
at org.eclipse.core.runtime.internal.adaptor.EclipseAppLauncher.start(EclipseAppLauncher.java:79)
at org.eclipse.core.runtime.adaptor.EclipseStarter.run(EclipseStarter.java:368)
at org.eclipse.core.runtime.adaptor.EclipseStarter.run(EclipseStarter.java:179)
at org.eclipse.equinox.launcher.Main.invokeFramework(Main.java:559)
at org.eclipse.equinox.launcher.Main.basicRun(Main.java:514)
at org.eclipse.equinox.launcher.Main.run(Main.java:1311)
at org.eclipse.equinox.launcher.Main.main(Main.java:1287)
at org.eclipse.core.launcher.Main.main(Main.java:34)
--------------------------------------------------
Changes:
[abogachuk] https://jira.jboss.org/jira/browse/JBDS-414 - added info about the option available in the Preferences of VPE
[abogachuk] https://jira.jboss.org/jira/browse/JBDS-414 - screenshot changed to show the Preferences tab with the new option available.
[dgolovin] https://jira.jboss.org/jira/browse/JBIDE-4302 - line that cause the error was commented out to keep build running. That was tested locally and looks like it isn't needed anymore. The original reason was to avoid showing intro first time, to keep VPE working.
--------------------------------------------------
Console log:
[...truncated 29389 lines...]
[jar] Building jar: /home/hudson/hudson_workspace/workspace/jbosstools-nightly-3.1.0.Alpha1/jbds-build/site/eclipse/plugins/org.jboss.tools.jsf.vpe.jsf_3.0.0.GA-N200905121444-H162.jar
[jar] Building jar: /home/hudson/hudson_workspace/workspace/jbosstools-nightly-3.1.0.Alpha1/jbds-build/site/eclipse/plugins/org.jboss.tools.jsf.vpe.myfaces_3.0.0.GA-N200905121444-H162.jar
[jar] Building jar: /home/hudson/hudson_workspace/workspace/jbosstools-nightly-3.1.0.Alpha1/jbds-build/site/eclipse/plugins/org.jboss.tools.jsf.vpe.richfaces_3.0.0.GA-N200905121444-H162.jar
[jar] Building jar: /home/hudson/hudson_workspace/workspace/jbosstools-nightly-3.1.0.Alpha1/jbds-build/site/eclipse/plugins/org.jboss.tools.jsf.vpe.seam_3.0.0.GA-N200905121444-H162.jar
[jar] Building jar: /home/hudson/hudson_workspace/workspace/jbosstools-nightly-3.1.0.Alpha1/jbds-build/site/eclipse/plugins/org.jboss.tools.jsf_3.0.0.GA-N200905121444-H162.jar
[jar] Building jar: /home/hudson/hudson_workspace/workspace/jbosstools-nightly-3.1.0.Alpha1/jbds-build/site/eclipse/plugins/org.jboss.tools.jst.firstrun_3.0.0.GA-N200905121444-H162.jar
[jar] Building jar: /home/hudson/hudson_workspace/workspace/jbosstools-nightly-3.1.0.Alpha1/jbds-build/site/eclipse/plugins/org.jboss.tools.jst.jsp_3.0.0.GA-N200905121444-H162.jar
[jar] Building jar: /home/hudson/hudson_workspace/workspace/jbosstools-nightly-3.1.0.Alpha1/jbds-build/site/eclipse/plugins/org.jboss.tools.jst.web.tiles.ui_3.0.0.GA-N200905121444-H162.jar
[jar] Building jar: /home/hudson/hudson_workspace/workspace/jbosstools-nightly-3.1.0.Alpha1/jbds-build/site/eclipse/plugins/org.jboss.tools.jst.web.tiles_3.0.0.GA-N200905121444-H162.jar
[jar] Building jar: /home/hudson/hudson_workspace/workspace/jbosstools-nightly-3.1.0.Alpha1/jbds-build/site/eclipse/plugins/org.jboss.tools.jst.web.ui_3.0.0.GA-N200905121444-H162.jar
[jar] Building jar: /home/hudson/hudson_workspace/workspace/jbosstools-nightly-3.1.0.Alpha1/jbds-build/site/eclipse/plugins/org.jboss.tools.jst.web.verification_3.0.0.GA-N200905121444-H162.jar
[jar] Building jar: /home/hudson/hudson_workspace/workspace/jbosstools-nightly-3.1.0.Alpha1/jbds-build/site/eclipse/plugins/org.jboss.tools.jst.web_3.0.0.GA-N200905121444-H162.jar
[jar] Building jar: /home/hudson/hudson_workspace/workspace/jbosstools-nightly-3.1.0.Alpha1/jbds-build/site/eclipse/plugins/org.jboss.tools.seam.core_3.0.0.GA-N200905121444-H162.jar
[jar] Building jar: /home/hudson/hudson_workspace/workspace/jbosstools-nightly-3.1.0.Alpha1/jbds-build/site/eclipse/plugins/org.jboss.tools.seam.pages.xml_3.0.0.GA-N200905121444-H162.jar
[jar] Building jar: /home/hudson/hudson_workspace/workspace/jbosstools-nightly-3.1.0.Alpha1/jbds-build/site/eclipse/plugins/org.jboss.tools.seam.text.ext_3.0.0.GA-N200905121444-H162.jar
[jar] Building jar: /home/hudson/hudson_workspace/workspace/jbosstools-nightly-3.1.0.Alpha1/jbds-build/site/eclipse/plugins/org.jboss.tools.seam.ui.pages_3.0.0.GA-N200905121444-H162.jar
[jar] Building jar: /home/hudson/hudson_workspace/workspace/jbosstools-nightly-3.1.0.Alpha1/jbds-build/site/eclipse/plugins/org.jboss.tools.seam.xml.ui_3.0.0.GA-N200905121444-H162.jar
[jar] Building jar: /home/hudson/hudson_workspace/workspace/jbosstools-nightly-3.1.0.Alpha1/jbds-build/site/eclipse/plugins/org.jboss.tools.seam.xml_3.0.0.GA-N200905121444-H162.jar
[jar] Building jar: /home/hudson/hudson_workspace/workspace/jbosstools-nightly-3.1.0.Alpha1/jbds-build/site/eclipse/plugins/org.jboss.tools.struts.text.ext_3.0.0.GA-N200905121444-H162.jar
[jar] Building jar: /home/hudson/hudson_workspace/workspace/jbosstools-nightly-3.1.0.Alpha1/jbds-build/site/eclipse/plugins/org.jboss.tools.struts.ui_3.0.0.GA-N200905121444-H162.jar
[jar] Building jar: /home/hudson/hudson_workspace/workspace/jbosstools-nightly-3.1.0.Alpha1/jbds-build/site/eclipse/plugins/org.jboss.tools.struts.validator.ui_3.0.0.GA-N200905121444-H162.jar
[jar] Building jar: /home/hudson/hudson_workspace/workspace/jbosstools-nightly-3.1.0.Alpha1/jbds-build/site/eclipse/plugins/org.jboss.tools.struts.verification_3.0.0.GA-N200905121444-H162.jar
[jar] Building jar: /home/hudson/hudson_workspace/workspace/jbosstools-nightly-3.1.0.Alpha1/jbds-build/site/eclipse/plugins/org.jboss.tools.struts_3.0.0.GA-N200905121444-H162.jar
[jar] Building jar: /home/hudson/hudson_workspace/workspace/jbosstools-nightly-3.1.0.Alpha1/jbds-build/site/eclipse/plugins/org.jboss.tools.vpe.docbook_3.0.0.GA-N200905121444-H162.jar
[jar] Building jar: /home/hudson/hudson_workspace/workspace/jbosstools-nightly-3.1.0.Alpha1/jbds-build/site/eclipse/plugins/org.jboss.tools.vpe.html_3.0.0.GA-N200905121444-H162.jar
[jar] Building jar: /home/hudson/hudson_workspace/workspace/jbosstools-nightly-3.1.0.Alpha1/jbds-build/site/eclipse/plugins/org.jboss.tools.vpe.jsp_3.0.0.GA-N200905121444-H162.jar
[jar] Building jar: /home/hudson/hudson_workspace/workspace/jbosstools-nightly-3.1.0.Alpha1/jbds-build/site/eclipse/plugins/org.jboss.tools.vpe.ui.palette_3.0.0.GA-N200905121444-H162.jar
[jar] Building jar: /home/hudson/hudson_workspace/workspace/jbosstools-nightly-3.1.0.Alpha1/jbds-build/site/eclipse/plugins/org.jboss.tools.vpe_3.0.0.GA-N200905121444-H162.jar
[jar] Building jar: /home/hudson/hudson_workspace/workspace/jbosstools-nightly-3.1.0.Alpha1/jbds-build/site/eclipse/plugins/org.jboss.tools.xulrunner_1.0.0.GA-N200905121444-H162.jar
[jar] Building jar: /home/hudson/hudson_workspace/workspace/jbosstools-nightly-3.1.0.Alpha1/jbds-build/site/eclipse/plugins/org.mozilla.xpcom_1.8.1.3-20070904.jar
[jar] Building jar: /home/hudson/hudson_workspace/workspace/jbosstools-nightly-3.1.0.Alpha1/jbds-build/site/eclipse/plugins/org.mozilla.xulrunner.carbon.macosx_1.8.1.3-20070904.jar
[jar] Building jar: /home/hudson/hudson_workspace/workspace/jbosstools-nightly-3.1.0.Alpha1/jbds-build/site/eclipse/plugins/org.mozilla.xulrunner.gtk.linux.x86_1.8.1.3-20070904.jar
[jar] Building jar: /home/hudson/hudson_workspace/workspace/jbosstools-nightly-3.1.0.Alpha1/jbds-build/site/eclipse/plugins/org.mozilla.xulrunner.gtk.linux.x86_64_1.8.1.4-20080112.jar
[jar] Building jar: /home/hudson/hudson_workspace/workspace/jbosstools-nightly-3.1.0.Alpha1/jbds-build/site/eclipse/plugins/org.mozilla.xulrunner.win32.win32.x86_1.8.1.3-20070904.jar
load.properties:
[echo] Getting version for 'jmx' builder to property 'jmx.versionTag' from /qa/services/hudson/hudson_workspace/workspace/jbosstools-nightly-3.1.0.Alpha1/org.jboss.ide.eclipse.releng/builders/product/versionTags/jbosstools/3.1.0.Alpha1.tags
[echo]
[echo] jbds-jmx-filename=JMX-1.0.0.GA-N200905121444-H162.zip
[echo] jbds-jmx-nodeps-filename=JMX-nodeps-1.0.0.GA-N200905121444-H162.zip
[echo]
[echo] Getting version for 'drools-ide' builder to property 'drools-ide.versionTag' from /qa/services/hudson/hudson_workspace/workspace/jbosstools-nightly-3.1.0.Alpha1/org.jboss.ide.eclipse.releng/builders/product/versionTags/jbosstools/3.1.0.Alpha1.tags
[echo]
[echo] jbds-drools-ide-filename=DroolsIDE-5.0.1.trunk-N200905121444-H162.zip
[echo] jbds-drools-ide-nodeps-filename=DroolsIDE-nodeps-5.0.1.trunk-N200905121444-H162.zip
[echo]
[echo] Getting version for 'archives' builder to property 'archives.versionTag' from /qa/services/hudson/hudson_workspace/workspace/jbosstools-nightly-3.1.0.Alpha1/org.jboss.ide.eclipse.releng/builders/product/versionTags/jbosstools/3.1.0.Alpha1.tags
[echo]
[echo] jbds-archives-filename=JBossTools-Archives-3.0.0.GA-N200905121444-H162.zip
[echo] jbds-archives-nodeps-filename=JBossTools-Archives-nodeps-3.0.0.GA-N200905121444-H162.zip
[echo]
[echo] Getting version for 'xulrunner' builder to property 'xulrunner.versionTag' from /qa/services/hudson/hudson_workspace/workspace/jbosstools-nightly-3.1.0.Alpha1/org.jboss.ide.eclipse.releng/builders/product/versionTags/jbosstools/3.1.0.Alpha1.tags
[echo]
[echo] jbds-xulrunner-win32-filename=XulRunner-win32-1.0.0.GA-N200905121444-H162.zip
[echo] jbds-xulrunner-win32-nodeps-filename=XulRunner-win32-nodeps-1.0.0.GA-N200905121444-H162.zip
[echo]
[echo] Getting version for 'xulrunner' builder to property 'xulrunner.versionTag' from /qa/services/hudson/hudson_workspace/workspace/jbosstools-nightly-3.1.0.Alpha1/org.jboss.ide.eclipse.releng/builders/product/versionTags/jbosstools/3.1.0.Alpha1.tags
[echo]
[echo] jbds-xulrunner-linux-gtk-filename=XulRunner-linux-gtk-1.0.0.GA-N200905121444-H162.zip
[echo] jbds-xulrunner-linux-gtk-nodeps-filename=XulRunner-linux-gtk-nodeps-1.0.0.GA-N200905121444-H162.zip
[echo]
[echo] Getting version for 'richfaces' builder to property 'richfaces.versionTag' from /qa/services/hudson/hudson_workspace/workspace/jbosstools-nightly-3.1.0.Alpha1/org.jboss.ide.eclipse.releng/builders/product/versionTags/jbosstools/3.1.0.Alpha1.tags
[echo]
[echo] jbds-richfaces-win32-filename=RichFaces-VPE-win32-3.0.0.GA-N200905121444-H162.zip
[echo] jbds-richfaces-win32-nodeps-filename=RichFaces-VPE-win32-nodeps-3.0.0.GA-N200905121444-H162.zip
[echo]
[echo] Getting version for 'richfaces' builder to property 'richfaces.versionTag' from /qa/services/hudson/hudson_workspace/workspace/jbosstools-nightly-3.1.0.Alpha1/org.jboss.ide.eclipse.releng/builders/product/versionTags/jbosstools/3.1.0.Alpha1.tags
[echo]
[echo] jbds-richfaces-linux-gtk-filename=RichFaces-VPE-linux-gtk-3.0.0.GA-N200905121444-H162.zip
[echo] jbds-richfaces-linux-gtk-nodeps-filename=RichFaces-VPE-linux-gtk-nodeps-3.0.0.GA-N200905121444-H162.zip
[echo]
[echo] Getting version for 'jbpm-convert' builder to property 'jbpm-convert.versionTag' from /qa/services/hudson/hudson_workspace/workspace/jbosstools-nightly-3.1.0.Alpha1/org.jboss.ide.eclipse.releng/builders/product/versionTags/jbosstools/3.1.0.Alpha1.tags
[echo]
[echo] jbds-jbpm-convert-filename=jBPM-Convert-1.0.0.GA-N200905121444-H162.zip
[echo] jbds-jbpm-convert-nodeps-filename=jBPM-Convert-nodeps-1.0.0.GA-N200905121444-H162.zip
[echo]
[echo] Getting version for 'freemarker' builder to property 'freemarker.versionTag' from /qa/services/hudson/hudson_workspace/workspace/jbosstools-nightly-3.1.0.Alpha1/org.jboss.ide.eclipse.releng/builders/product/versionTags/jbosstools/3.1.0.Alpha1.tags
[echo]
[echo] jbds-freemarker-filename=FreeMarkerIDE-1.0.2.GA-N200905121444-H162.zip
[echo] jbds-freemarker-nodeps-filename=
[echo]
[length] /home/hudson/hudson_workspace/workspace/jbosstools-nightly-3.1.0.Alpha1/jbds-build/3.1.0.Alpha1/200905121444/freemarker is a directory; length unspecified
[echo] Getting version for 'hibernate-tools' builder to property 'hibernate-tools.versionTag' from /qa/services/hudson/hudson_workspace/workspace/jbosstools-nightly-3.1.0.Alpha1/org.jboss.ide.eclipse.releng/builders/product/versionTags/jbosstools/3.1.0.Alpha1.tags
[echo]
[echo] jbds-hibernate-tools-filename=HibernateTools-3.2.4.GA-N200905121444-H162.zip
[echo] jbds-hibernate-tools-nodeps-filename=HibernateTools-nodeps-3.2.4.GA-N200905121444-H162.zip
[echo]
[echo] Getting version for 'struts' builder to property 'struts.versionTag' from /qa/services/hudson/hudson_workspace/workspace/jbosstools-nightly-3.1.0.Alpha1/org.jboss.ide.eclipse.releng/builders/product/versionTags/jbosstools/3.1.0.Alpha1.tags
[echo]
[echo] jbds-struts-filename=StrutsTools-3.0.0.GA-N200905121444-H162.zip
[echo] jbds-struts-nodeps-filename=StrutsTools-nodeps-3.0.0.GA-N200905121444-H162.zip
[echo]
[echo] Getting version for 'jbpm' builder to property 'jbpm.versionTag' from /qa/services/hudson/hudson_workspace/workspace/jbosstools-nightly-3.1.0.Alpha1/org.jboss.ide.eclipse.releng/builders/product/versionTags/jbosstools/3.1.0.Alpha1.tags
[echo]
[echo] jbds-jbpm-filename=jBPM-Designer-3.1.7.GA-N200905121444-H162.zip
[echo] jbds-jbpm-nodeps-filename=jBPM-Designer-nodeps-3.1.7.GA-N200905121444-H162.zip
[echo]
[echo] Getting version for 'as' builder to property 'as.versionTag' from /qa/services/hudson/hudson_workspace/workspace/jbosstools-nightly-3.1.0.Alpha1/org.jboss.ide.eclipse.releng/builders/product/versionTags/jbosstools/3.1.0.Alpha1.tags
[echo]
[echo] jbds-as-filename=JBossAS-Tools-2.0.0.GA-N200905121444-H162.zip
[echo] jbds-as-nodeps-filename=JBossAS-Tools-nodeps-2.0.0.GA-N200905121444-H162.zip
[echo]
[echo] Getting version for 'seam' builder to property 'seam.versionTag' from /qa/services/hudson/hudson_workspace/workspace/jbosstools-nightly-3.1.0.Alpha1/org.jboss.ide.eclipse.releng/builders/product/versionTags/jbosstools/3.1.0.Alpha1.tags
[echo]
[echo] jbds-seam-filename=SeamTools-3.0.0.GA-N200905121444-H162.zip
[echo] jbds-seam-nodeps-filename=SeamTools-nodeps-3.0.0.GA-N200905121444-H162.zip
[echo]
[echo] Getting version for 'examples' builder to property 'examples.versionTag' from /qa/services/hudson/hudson_workspace/workspace/jbosstools-nightly-3.1.0.Alpha1/org.jboss.ide.eclipse.releng/builders/product/versionTags/jbosstools/3.1.0.Alpha1.tags
[echo]
[echo] jbds-examples-filename=JBossTools-Examples-1.0.0.GA-N200905121444-H162.zip
[echo] jbds-examples-nodeps-filename=JBossTools-Examples-nodeps-1.0.0.GA-N200905121444-H162.zip
[echo]
[echo] Getting version for 'esb' builder to property 'esb.versionTag' from /qa/services/hudson/hudson_workspace/workspace/jbosstools-nightly-3.1.0.Alpha1/org.jboss.ide.eclipse.releng/builders/product/versionTags/jbosstools/3.1.0.Alpha1.tags
[echo]
[echo] jbds-esb-filename=JBossTools-ESB-1.1.0.GA-N200905121444-H162.zip
[echo] jbds-esb-nodeps-filename=JBossTools-ESB-nodeps-1.1.0.GA-N200905121444-H162.zip
[echo]
[echo] Getting version for 'ws' builder to property 'ws.versionTag' from /qa/services/hudson/hudson_workspace/workspace/jbosstools-nightly-3.1.0.Alpha1/org.jboss.ide.eclipse.releng/builders/product/versionTags/jbosstools/3.1.0.Alpha1.tags
[echo]
[echo] jbds-ws-filename=JBossWS-Tools-1.0.0.GA-N200905121444-H162.zip
[echo] jbds-ws-nodeps-filename=JBossWS-Tools-nodeps-1.0.0.GA-N200905121444-H162.zip
[echo]
[echo] Getting version for 'birt' builder to property 'birt.versionTag' from /qa/services/hudson/hudson_workspace/workspace/jbosstools-nightly-3.1.0.Alpha1/org.jboss.ide.eclipse.releng/builders/product/versionTags/jbosstools/3.1.0.Alpha1.tags
[echo]
[echo] jbds-birt-filename=JBossTools-BIRT-1.0.0.GA-N200905121444-H162.zip
[echo] jbds-birt-nodeps-filename=JBossTools-BIRT-nodeps-1.0.0.GA-N200905121444-H162.zip
[echo]
[echo] Getting version for 'portlet' builder to property 'portlet.versionTag' from /qa/services/hudson/hudson_workspace/workspace/jbosstools-nightly-3.1.0.Alpha1/org.jboss.ide.eclipse.releng/builders/product/versionTags/jbosstools/3.1.0.Alpha1.tags
[echo]
[echo] jbds-portlet-filename=JBoss-Portlet-Tools-1.0.0.GA-N200905121444-H162.zip
[echo] jbds-portlet-nodeps-filename=JBoss-Portlet-Tools-nodeps-1.0.0.GA-N200905121444-H162.zip
[echo]
[echo] Getting version for 'smooks' builder to property 'smooks.versionTag' from /qa/services/hudson/hudson_workspace/workspace/jbosstools-nightly-3.1.0.Alpha1/org.jboss.ide.eclipse.releng/builders/product/versionTags/jbosstools/3.1.0.Alpha1.tags
[echo]
[echo] jbds-smooks-filename=JBossTools-Smooks-1.0.0.GA-N200905121444-H162.zip
[echo] jbds-smooks-nodeps-filename=JBossTools-Smooks-nodeps-1.0.0.GA-N200905121444-H162.zip
[echo]
[echo] Getting version for 'tptp' builder to property 'tptp.versionTag' from /qa/services/hudson/hudson_workspace/workspace/jbosstools-nightly-3.1.0.Alpha1/org.jboss.ide.eclipse.releng/builders/product/versionTags/jbosstools/3.1.0.Alpha1.tags
[echo]
[echo] jbds-tptp-filename=JBoss-TPTP-Tools-1.0.0.GA-N200905121444-H162.zip
[echo] jbds-tptp-nodeps-filename=JBoss-TPTP-Tools-nodeps-1.0.0.GA-N200905121444-H162.zip
[echo]
pack200:
[echo] Using /qa/tools/opt/jdk1.6.0_11/jre/bin/pack200 to pack update site jars...
[mkdir] Created dir: /qa/services/hudson/hudson_workspace/workspace/jbosstools-nightly-3.1.0.Alpha1/org.jboss.ide.eclipse.releng/builders/product/updateSite/updateSitePackTmp/output
[mkdir] Created dir: /qa/services/hudson/hudson_workspace/workspace/jbosstools-nightly-3.1.0.Alpha1/org.jboss.ide.eclipse.releng/builders/product/updateSite/updateSitePackTmp/input
[echo] Zip update jars in /home/hudson/hudson_workspace/workspace/jbosstools-nightly-3.1.0.Alpha1/jbds-build/site to temporary Master zip (to avoid packing nested jars) ...
[zip] Building zip: /qa/services/hudson/hudson_workspace/workspace/jbosstools-nightly-3.1.0.Alpha1/org.jboss.ide.eclipse.releng/builders/product/updateSite/updateSitePackTmp/input/Master.zip
[exec] 101M updateSite/updateSitePackTmp/input/Master.zip
[echo] Pack jars ...
[echo] Run jarprocessor.pack200 using launcherjar = /home/hudson/hudson_workspace/workspace/jbosstools-nightly-3.1.0.Alpha1/jbds-build/clean-eclipse/eclipse/plugins/org.eclipse.equinox.launcher_1.0.200.v20090429-1630.jar
[exec] 165M updateSite/updateSitePackTmp/output/Master.zip
[unzip] Expanding: /qa/services/hudson/hudson_workspace/workspace/jbosstools-nightly-3.1.0.Alpha1/org.jboss.ide.eclipse.releng/builders/product/updateSite/updateSitePackTmp/output/Master.zip into /home/hudson/hudson_workspace/workspace/jbosstools-nightly-3.1.0.Alpha1/jbds-build/site
[delete] Deleting directory /qa/services/hudson/hudson_workspace/workspace/jbosstools-nightly-3.1.0.Alpha1/org.jboss.ide.eclipse.releng/builders/product/updateSite/updateSitePackTmp
copy.site.rootfiles:
[echo] Build development jbosstools update site...
[copy] Copying 4 files to /home/hudson/hudson_workspace/workspace/jbosstools-nightly-3.1.0.Alpha1/jbds-build/site/eclipse
p2:
[echo] Run p2 metadata generator using launcherjar = /home/hudson/hudson_workspace/workspace/jbosstools-nightly-3.1.0.Alpha1/jbds-build/clean-eclipse/eclipse/plugins/org.eclipse.equinox.launcher_1.0.200.v20090429-1630.jar
[p2] Generating metadata for /home/hudson/hudson_workspace/workspace/jbosstools-nightly-3.1.0.Alpha1/jbds-build/site/eclipse.
[p2] Generation completed with success [11 seconds].
build.metadata:
publish.site:
post-build:
publish.results:
send.notification.email:
[mail] Failed to initialise MIME mail: javax/mail/MessagingException
publish.log:
init:
clean.all.subfolders:
BUILD SUCCESSFUL
Total time: 171 minutes 4 seconds
+ cd ../configs/jbds
+ zip build.log.zip build.log
updating: build.log (deflated 96%)
+ cd ../..
+ [[ '' == \l\o\c\a\l ]]
++ cat /home/hudson/hudson_workspace/workspace/jbosstools-nightly-3.1.0.Alpha1/jbds-build/buildData.properties
++ grep product.releaseNumber
++ perl -ne 's/[\s\t]+product.releaseNumber=//g;print;'
+ version=3.1.0.Alpha1
++ cat /home/hudson/hudson_workspace/workspace/jbosstools-nightly-3.1.0.Alpha1/jbds-build/buildData.properties
++ grep upload.to
++ perl -ne 's/[\s\t]+upload.to=//g;print;'
+ builddir=nightly/3.1.0.Alpha1/200905121444
++ cat /home/hudson/hudson_workspace/workspace/jbosstools-nightly-3.1.0.Alpha1/jbds-build/buildData.properties
++ grep product.buildDesc
++ perl -ne 's/[\s\t]+product.buildDesc=//g; print;'
+ buildtype=nightly
++ cat /home/hudson/hudson_workspace/workspace/jbosstools-nightly-3.1.0.Alpha1/jbds-build/buildData.properties
++ perl -ne 's/[\s\t]+product.releaseNumber=//g; print;'
++ grep product.releaseNumber
+ releaseNumber=3.1.0.Alpha1
+ DESTINATION=jbossqa@download.jboss.org:/htdocs/jbosstools
+ scp -r /home/hudson/hudson_workspace/workspace/jbosstools-nightly-3.1.0.Alpha1/jbds-build/3.1.0.Alpha1 jbossqa@download.jboss.org:/htdocs/jbosstools/builds/nightly/
+ scp configs/jbds/build.log.zip jbossqa@download.jboss.org:/htdocs/jbosstools/builds/nightly/3.1.0.Alpha1/200905121444/
+ scp /home/hudson/hudson_workspace/workspace/jbosstools-nightly-3.1.0.Alpha1/jbds-build/latestBuild.html jbossqa@download.jboss.org:/htdocs/jbosstools/builds/nightly/
+ [[ -d /home/hudson/hudson_workspace/workspace/jbosstools-nightly-3.1.0.Alpha1/jbds-build/site/eclipse ]]
+ mkdir -p /home/hudson/hudson_workspace/workspace/jbosstools-nightly-3.1.0.Alpha1/jbds-build/site/nightly/trunk
+ mv /home/hudson/hudson_workspace/workspace/jbosstools-nightly-3.1.0.Alpha1/jbds-build/site/eclipse/artifacts.jar /home/hudson/hudson_workspace/workspace/jbosstools-nightly-3.1.0.Alpha1/jbds-build/site/eclipse/associateSites.xml /home/hudson/hudson_workspace/workspace/jbosstools-nightly-3.1.0.Alpha1/jbds-build/site/eclipse/content.jar /home/hudson/hudson_workspace/workspace/jbosstools-nightly-3.1.0.Alpha1/jbds-build/site/eclipse/features /home/hudson/hudson_workspace/workspace/jbosstools-nightly-3.1.0.Alpha1/jbds-build/site/eclipse/index.html /home/hudson/hudson_workspace/workspace/jbosstools-nightly-3.1.0.Alpha1/jbds-build/site/eclipse/plugins /home/hudson/hudson_workspace/workspace/jbosstools-nightly-3.1.0.Alpha1/jbds-build/site/eclipse/site.xml /home/hudson/hudson_workspace/workspace/jbosstools-nightly-3.1.0.Alpha1/jbds-build/site/eclipse/web /home/hudson/hudson_workspace/workspace/jbosstools-nightly-3.1.0.Alpha1/jbds-build/site/nightly/trunk
++ find /home/hudson/hudson_workspace/workspace/jbosstools-nightly-3.1.0.Alpha1/jbds-build/site/nightly/trunk/features -name '*.jar'
+ [[ -n /home/hudson/hudson_workspace/workspace/jbosstools-nightly-3.1.0.Alpha1/jbds-build/site/nightly/trunk/features/org.jboss.tools.smooks.feature_1.0.0.GA-N200905121444-H162.jar
/home/hudson/hudson_workspace/workspace/jbosstools-nightly-3.1.0.Alpha1/jbds-build/site/nightly/trunk/features/org.jboss.tools.portlet.feature_1.0.0.GA-N200905121444-H162.jar
/home/hudson/hudson_workspace/workspace/jbosstools-nightly-3.1.0.Alpha1/jbds-build/site/nightly/trunk/features/org.guvnor.tools.feature_5.0.1.trunk-N200905121444-H162.jar
/home/hudson/hudson_workspace/workspace/jbosstools-nightly-3.1.0.Alpha1/jbds-build/site/nightly/trunk/features/org.jboss.tools.birt.feature_1.0.0.GA-N200905121444-H162.jar
/home/hudson/hudson_workspace/workspace/jbosstools-nightly-3.1.0.Alpha1/jbds-build/site/nightly/trunk/features/org.jboss.tools.ws.feature_1.0.0.GA-N200905121444-H162.jar
/home/hudson/hudson_workspace/workspace/jbosstools-nightly-3.1.0.Alpha1/jbds-build/site/nightly/trunk/features/org.jboss.tools.esb.feature_1.1.0.GA-N200905121444-H162.jar
/home/hudson/hudson_workspace/workspace/jbosstools-nightly-3.1.0.Alpha1/jbds-build/site/nightly/trunk/features/org.jboss.ide.eclipse.as.feature_2.0.0.GA-N200905121444-H162.jar
/home/hudson/hudson_workspace/workspace/jbosstools-nightly-3.1.0.Alpha1/jbds-build/site/nightly/trunk/features/org.jboss.tools.richfaces.feature_3.0.0.GA-N200905121444-H162.jar
/home/hudson/hudson_workspace/workspace/jbosstools-nightly-3.1.0.Alpha1/jbds-build/site/nightly/trunk/features/org.jboss.tools.jmx.feature_1.0.0.GA-N200905121444-H162.jar
/home/hudson/hudson_workspace/workspace/jbosstools-nightly-3.1.0.Alpha1/jbds-build/site/nightly/trunk/features/org.jboss.tools.struts_feature_3.0.0.GA-N200905121444-H162.jar
/home/hudson/hudson_workspace/workspace/jbosstools-nightly-3.1.0.Alpha1/jbds-build/site/nightly/trunk/features/org.jboss.tools.xulrunner.feature_1.8.1.3-20070904.jar
/home/hudson/hudson_workspace/workspace/jbosstools-nightly-3.1.0.Alpha1/jbds-build/site/nightly/trunk/features/org.jboss.tools.seam.feature_3.0.0.GA-N200905121444-H162.jar
/home/hudson/hudson_workspace/workspace/jbosstools-nightly-3.1.0.Alpha1/jbds-build/site/nightly/trunk/features/org.jbpm.gd.jpdl.feature_3.1.7.GA-N200905121444-H162.jar
/home/hudson/hudson_workspace/workspace/jbosstools-nightly-3.1.0.Alpha1/jbds-build/site/nightly/trunk/features/org.jboss.ide.eclipse.freemarker.feature_1.0.2.GA-N200905121444-H162.jar
/home/hudson/hudson_workspace/workspace/jbosstools-nightly-3.1.0.Alpha1/jbds-build/site/nightly/trunk/features/org.jboss.tools.tptp.feature_1.0.0.GA-N200905121444-H162.jar
/home/hudson/hudson_workspace/workspace/jbosstools-nightly-3.1.0.Alpha1/jbds-build/site/nightly/trunk/features/org.hibernate.eclipse.feature_3.2.4.GA-N200905121444-H162.jar
/home/hudson/hudson_workspace/workspace/jbosstools-nightly-3.1.0.Alpha1/jbds-build/site/nightly/trunk/features/org.drools.eclipse.feature_5.0.1.trunk-N200905121444-H162.jar
/home/hudson/hudson_workspace/workspace/jbosstools-nightly-3.1.0.Alpha1/jbds-build/site/nightly/trunk/features/org.drools.eclipse.task.feature_5.0.1.trunk-N200905121444-H162.jar
/home/hudson/hudson_workspace/workspace/jbosstools-nightly-3.1.0.Alpha1/jbds-build/site/nightly/trunk/features/org.jboss.ide.eclipse.archives.feature_3.0.0.GA-N200905121444-H162.jar
/home/hudson/hudson_workspace/workspace/jbosstools-nightly-3.1.0.Alpha1/jbds-build/site/nightly/trunk/features/org.jboss.tools.jbpm.convert.feature_1.0.0.GA-N200905121444-H162.jar
/home/hudson/hudson_workspace/workspace/jbosstools-nightly-3.1.0.Alpha1/jbds-build/site/nightly/trunk/features/org.jboss.tools.project.examples.feature_1.0.0.GA-N200905121444-H162.jar ]]
+ rsync -arz --delete /home/hudson/hudson_workspace/workspace/jbosstools-nightly-3.1.0.Alpha1/jbds-build/site/nightly/trunk jbossqa@download.jboss.org:/htdocs/jbosstools/updates/nightly/
Terminating xvnc
[jbosstools-nightly-3.1.0.Alpha1] $ vncserver -kill :11
Killing Xvnc process ID 27134
[jbosstools-nightly-3.1.0.Alpha1] $ bash -xe /tmp/hudson8075190291918659443.sh
+ kill 27115
Recording test results
Recording Emma reports jbds-build/coverage.xml
[PMD] Collecting PMD analysis files...
[PMD] Found 4757 annotations (101 new, 688 high, 4067 normal, 2 low)
[PMD] Don't changing build status, no threshold has been exceeded
Build was marked for publishing on https://hudson.jboss.org/hudson/
Email was triggered for: Unstable
There are 1 triggered emails.
Sending email for trigger: Unstable
--------------------------------------------------
15 years, 9 months
JBoss-AS-5.1.x - Build # 431 - Failure!
by jboss-qa-internal@redhat.com
JBoss-AS-5.1.x - Build # 431 - Failure:
Check console output at https://hudson.jboss.org/hudson//job/JBoss-AS-5.1.x/431 to view the results.
Modifications since last build:
-------------------------------------------------------------------------
started
Building remotely on soavmg7-linux
SCM check out aborted
FATAL: null
java.lang.InterruptedException
at java.lang.Object.wait(Native Method)
at hudson.remoting.Request$1.get(Request.java:197)
at hudson.remoting.Request$1.get(Request.java:157)
at hudson.remoting.FutureAdapter.get(FutureAdapter.java:59)
at hudson.FilePath.copyRecursiveTo(FilePath.java:962)
at hudson.tasks.ArtifactArchiver.perform(ArtifactArchiver.java:101)
at hudson.model.AbstractBuild$AbstractRunner.performAllBuildStep(AbstractBuild.java:359)
at hudson.model.AbstractBuild$AbstractRunner.performAllBuildStep(AbstractBuild.java:347)
at hudson.model.Build$RunnerImpl.post2(Build.java:169)
at hudson.model.AbstractBuild$AbstractRunner.post(AbstractBuild.java:332)
at hudson.model.Run.run(Run.java:885)
at hudson.model.Build.run(Build.java:112)
at hudson.model.ResourceController.execute(ResourceController.java:93)
at hudson.model.Executor.run(Executor.java:113)
15 years, 9 months
JBoss-AS-6.0.x - Build # 451 - Fixed!
by jboss-qa-internal@redhat.com
JBoss-AS-6.0.x - Build # 451 - Fixed:
Check console output at https://hudson.jboss.org/hudson//job/JBoss-AS-6.0.x/451 to view the results.
Modifications since last build:
[anil.saldhana(a)jboss.com] JBAS-6710: merge 88676 from Branch_5_x
[bstansberry(a)jboss.com] [JBAS-6875] Have the naming service write its connection URL to data dir
[JBAS-6903] Upgrade Naming to 5.0.3.GA
[anil.saldhana(a)jboss.com] JBAS-6905: merge rev 88759. from Branch_5_x
15 years, 9 months
JBoss-AS-6.0.x - Build # 450 - Failure!
by jboss-qa-internal@redhat.com
JBoss-AS-6.0.x - Build # 450 - Failure:
Check console output at https://hudson.jboss.org/hudson//job/JBoss-AS-6.0.x/450 to view the results.
Modifications since last build:
[bstansberry(a)jboss.com] [JBAS-6864] Split up the tests into one test per class
[anil.saldhana(a)jboss.com] increase mem
[anil.saldhana(a)jboss.com] JBAS-6894: merge in rev 88746. from Branch_5_x
[jaikiran] JBAS-6883 Upgraded EJB3 to 1.1.5 release
-------------------------------------------------------------------------
[...truncated 14075 lines...]
[INFO] Installing /qa/services/hudson/hudson_workspace/workspace/JBoss-AS-6.0.x/JBossAS_6_0/varia/target/jboss-as-varia-foe-deployer-3.2-sar.jar to /home/hudson/.m2/repository/org/jboss/jbossas/jboss-as-varia/6.0.0-SNAPSHOT/jboss-as-varia-6.0.0-SNAPSHOT-foe-deployer-3.2-sar.jar
[INFO] Installing /qa/services/hudson/hudson_workspace/workspace/JBoss-AS-6.0.x/JBossAS_6_0/varia/target/jboss-as-varia-autonumber-plugin.jar to /home/hudson/.m2/repository/org/jboss/jbossas/jboss-as-varia/6.0.0-SNAPSHOT/jboss-as-varia-6.0.0-SNAPSHOT-autonumber-plugin.jar
[INFO] Installing /qa/services/hudson/hudson_workspace/workspace/JBoss-AS-6.0.x/JBossAS_6_0/varia/target/jboss-as-varia-httpa-invoker-sar.jar to /home/hudson/.m2/repository/org/jboss/jbossas/jboss-as-varia/6.0.0-SNAPSHOT/jboss-as-varia-6.0.0-SNAPSHOT-httpa-invoker-sar.jar
[INFO] Installing /qa/services/hudson/hudson_workspace/workspace/JBoss-AS-6.0.x/JBossAS_6_0/varia/target/jboss-as-varia-deployment-service.jar to /home/hudson/.m2/repository/org/jboss/jbossas/jboss-as-varia/6.0.0-SNAPSHOT/jboss-as-varia-6.0.0-SNAPSHOT-deployment-service.jar
[INFO] Installing /qa/services/hudson/hudson_workspace/workspace/JBoss-AS-6.0.x/JBossAS_6_0/varia/target/jboss-as-varia-mail-plugin.jar to /home/hudson/.m2/repository/org/jboss/jbossas/jboss-as-varia/6.0.0-SNAPSHOT/jboss-as-varia-6.0.0-SNAPSHOT-mail-plugin.jar
[INFO] Installing /qa/services/hudson/hudson_workspace/workspace/JBoss-AS-6.0.x/JBossAS_6_0/varia/target/jboss-as-varia-jbossjmx-ant.jar to /home/hudson/.m2/repository/org/jboss/jbossas/jboss-as-varia/6.0.0-SNAPSHOT/jboss-as-varia-6.0.0-SNAPSHOT-jbossjmx-ant.jar
[INFO] ------------------------------------------------------------------------
[INFO] Building JBoss Application Server Management
[INFO] task-segment: [install]
[INFO] ------------------------------------------------------------------------
[INFO] [buildnumber:create {execution: set-build-properties}]
[INFO] Checking for local modifications: skipped.
[INFO] Updating project files from SCM: skipped.
[INFO] Storing buildNumber: 88753 at timestamp: May 12, 2009 1:10:14 PM EDT
[INFO] [enforcer:enforce {execution: ban-bad-dependencies}]
[INFO] [enforcer:enforce {execution: enforce-java-maven-versions}]
[INFO] [enforcer:enforce {execution: enforce-plugin-versions}]
[INFO] [resources:resources]
[WARNING] Using platform encoding (UTF-8 actually) to copy filtered resources, i.e. build is platform dependent!
[INFO] Copying 2 resources
[INFO] [compiler:compile]
[INFO] Compiling 183 source files to /qa/services/hudson/hudson_workspace/workspace/JBoss-AS-6.0.x/JBossAS_6_0/management/target/classes
[INFO] [rmic:rmic {execution: rmi-compile}]
[INFO] Compiling 1 remote classes
[INFO] [resources:testResources]
[WARNING] Using platform encoding (UTF-8 actually) to copy filtered resources, i.e. build is platform dependent!
[INFO] skip non existing resourceDirectory /qa/services/hudson/hudson_workspace/workspace/JBoss-AS-6.0.x/JBossAS_6_0/management/src/test/resources
[INFO] [compiler:testCompile]
[INFO] No sources to compile
[INFO] [surefire:test]
[INFO] No tests to run.
[INFO] [jar:jar]
[INFO] Building jar: /qa/services/hudson/hudson_workspace/workspace/JBoss-AS-6.0.x/JBossAS_6_0/management/target/jboss-as-management.jar
[INFO] Preparing source:jar
[WARNING] Removing: jar from forked lifecycle, to prevent recursive invocation.
[INFO] [buildnumber:create {execution: set-build-properties}]
[INFO] Checking for local modifications: skipped.
[INFO] Updating project files from SCM: skipped.
[INFO] Storing buildNumber: 88753 at timestamp: May 12, 2009 1:10:34 PM EDT
[INFO] [enforcer:enforce {execution: ban-bad-dependencies}]
[INFO] [enforcer:enforce {execution: enforce-java-maven-versions}]
[INFO] [enforcer:enforce {execution: enforce-plugin-versions}]
[INFO] [source:jar {execution: attach-sources}]
[INFO] Building jar: /qa/services/hudson/hudson_workspace/workspace/JBoss-AS-6.0.x/JBossAS_6_0/management/target/jboss-as-management-sources.jar
[INFO] [assembly:single {execution: assembly}]
[INFO] Building jar: /qa/services/hudson/hudson_workspace/workspace/JBoss-AS-6.0.x/JBossAS_6_0/management/target/jboss-as-management-jsr77-client.jar
[INFO] Building jar: /qa/services/hudson/hudson_workspace/workspace/JBoss-AS-6.0.x/JBossAS_6_0/management/target/jboss-as-management-ejb-management.jar
[INFO] Building jar: /qa/services/hudson/hudson_workspace/workspace/JBoss-AS-6.0.x/JBossAS_6_0/management/target/jboss-as-management-jsr77.jar
[INFO] [antrun:run {execution: create-output}]
[INFO] Executing tasks
[mkdir] Created dir: /qa/services/hudson/hudson_workspace/workspace/JBoss-AS-6.0.x/JBossAS_6_0/management/target/etc
[copy] Copying 2 files to /qa/services/hudson/hudson_workspace/workspace/JBoss-AS-6.0.x/JBossAS_6_0/management/target/etc
[INFO] Executed tasks
[INFO] [install:install]
[INFO] Installing /qa/services/hudson/hudson_workspace/workspace/JBoss-AS-6.0.x/JBossAS_6_0/management/target/jboss-as-management.jar to /home/hudson/.m2/repository/org/jboss/jbossas/jboss-as-management/6.0.0-SNAPSHOT/jboss-as-management-6.0.0-SNAPSHOT.jar
[INFO] Installing /qa/services/hudson/hudson_workspace/workspace/JBoss-AS-6.0.x/JBossAS_6_0/management/target/jboss-as-management-sources.jar to /home/hudson/.m2/repository/org/jboss/jbossas/jboss-as-management/6.0.0-SNAPSHOT/jboss-as-management-6.0.0-SNAPSHOT-sources.jar
[INFO] Installing /qa/services/hudson/hudson_workspace/workspace/JBoss-AS-6.0.x/JBossAS_6_0/management/target/jboss-as-management-jsr77-client.jar to /home/hudson/.m2/repository/org/jboss/jbossas/jboss-as-management/6.0.0-SNAPSHOT/jboss-as-management-6.0.0-SNAPSHOT-jsr77-client.jar
[INFO] Installing /qa/services/hudson/hudson_workspace/workspace/JBoss-AS-6.0.x/JBossAS_6_0/management/target/jboss-as-management-ejb-management.jar to /home/hudson/.m2/repository/org/jboss/jbossas/jboss-as-management/6.0.0-SNAPSHOT/jboss-as-management-6.0.0-SNAPSHOT-ejb-management.jar
[INFO] Installing /qa/services/hudson/hudson_workspace/workspace/JBoss-AS-6.0.x/JBossAS_6_0/management/target/jboss-as-management-jsr77.jar to /home/hudson/.m2/repository/org/jboss/jbossas/jboss-as-management/6.0.0-SNAPSHOT/jboss-as-management-6.0.0-SNAPSHOT-jsr77.jar
[INFO] ------------------------------------------------------------------------
[INFO] Building JBoss Application Server Tomcat
[INFO] task-segment: [install]
[INFO] ------------------------------------------------------------------------
[INFO] [buildnumber:create {execution: set-build-properties}]
[INFO] Checking for local modifications: skipped.
[INFO] Updating project files from SCM: skipped.
[INFO] Storing buildNumber: 88753 at timestamp: May 12, 2009 1:10:44 PM EDT
[INFO] [enforcer:enforce {execution: ban-bad-dependencies}]
[INFO] [enforcer:enforce {execution: enforce-java-maven-versions}]
[INFO] [enforcer:enforce {execution: enforce-plugin-versions}]
[INFO] [resources:resources]
[WARNING] Using platform encoding (UTF-8 actually) to copy filtered resources, i.e. build is platform dependent!
[INFO] Copying 5 resources
[INFO] [compiler:compile]
[INFO] Compiling 137 source files to /qa/services/hudson/hudson_workspace/workspace/JBoss-AS-6.0.x/JBossAS_6_0/tomcat/target/classes
[INFO] [resources:testResources]
[WARNING] Using platform encoding (UTF-8 actually) to copy filtered resources, i.e. build is platform dependent!
[INFO] skip non existing resourceDirectory /qa/services/hudson/hudson_workspace/workspace/JBoss-AS-6.0.x/JBossAS_6_0/tomcat/src/test/resources
[INFO] [compiler:testCompile]
[INFO] No sources to compile
[INFO] [surefire:test]
[INFO] No tests to run.
[INFO] [jar:jar]
[INFO] Building jar: /qa/services/hudson/hudson_workspace/workspace/JBoss-AS-6.0.x/JBossAS_6_0/tomcat/target/jboss-as-tomcat.jar
[INFO] Preparing source:jar
[WARNING] Removing: jar from forked lifecycle, to prevent recursive invocation.
[INFO] [buildnumber:create {execution: set-build-properties}]
[INFO] Checking for local modifications: skipped.
[INFO] Updating project files from SCM: skipped.
[INFO] Storing buildNumber: 88753 at timestamp: May 12, 2009 1:11:13 PM EDT
[INFO] [enforcer:enforce {execution: ban-bad-dependencies}]
[INFO] [enforcer:enforce {execution: enforce-java-maven-versions}]
[INFO] [enforcer:enforce {execution: enforce-plugin-versions}]
[INFO] [source:jar {execution: attach-sources}]
[INFO] Building jar: /qa/services/hudson/hudson_workspace/workspace/JBoss-AS-6.0.x/JBossAS_6_0/tomcat/target/jboss-as-tomcat-sources.jar
[INFO] [assembly:single {execution: assembly}]
[INFO] Building jar: /qa/services/hudson/hudson_workspace/workspace/JBoss-AS-6.0.x/JBossAS_6_0/tomcat/target/jboss-as-tomcat-jboss-web-service.jar
[INFO] Building jar: /qa/services/hudson/hudson_workspace/workspace/JBoss-AS-6.0.x/JBossAS_6_0/tomcat/target/jboss-as-tomcat-jbossweb-cluster-aop.jar
[INFO] Building jar: /qa/services/hudson/hudson_workspace/workspace/JBoss-AS-6.0.x/JBossAS_6_0/tomcat/target/jboss-as-tomcat-jboss-web-deployer.jar
[INFO] Building jar: /qa/services/hudson/hudson_workspace/workspace/JBoss-AS-6.0.x/JBossAS_6_0/tomcat/target/jboss-as-tomcat-jboss-faces.jar
[INFO] [antrun:run {execution: create-output}]
[INFO] Executing tasks
[mkdir] Created dir: /qa/services/hudson/hudson_workspace/workspace/JBoss-AS-6.0.x/JBossAS_6_0/tomcat/target/etc
[copy] Copying 1 file to /qa/services/hudson/hudson_workspace/workspace/JBoss-AS-6.0.x/JBossAS_6_0/tomcat/target/etc
[mkdir] Created dir: /qa/services/hudson/hudson_workspace/workspace/JBoss-AS-6.0.x/JBossAS_6_0/tomcat/target/resources
[copy] Copying 15 files to /qa/services/hudson/hudson_workspace/workspace/JBoss-AS-6.0.x/JBossAS_6_0/tomcat/target/resources
[mkdir] Created dir: /qa/services/hudson/hudson_workspace/workspace/JBoss-AS-6.0.x/JBossAS_6_0/tomcat/target/deploy
[copy] Copying 6 files to /qa/services/hudson/hudson_workspace/workspace/JBoss-AS-6.0.x/JBossAS_6_0/tomcat/target/deploy
[mkdir] Created dir: /qa/services/hudson/hudson_workspace/workspace/JBoss-AS-6.0.x/JBossAS_6_0/tomcat/target/deploy/jboss-web.deployer/META-INF
[copy] Copying 1 file to /qa/services/hudson/hudson_workspace/workspace/JBoss-AS-6.0.x/JBossAS_6_0/tomcat/target/deploy/jboss-web.deployer
[copy] Copying 2 files to /qa/services/hudson/hudson_workspace/workspace/JBoss-AS-6.0.x/JBossAS_6_0/tomcat/target/deploy/jboss-web.deployer/META-INF
[copy] Copying 1 file to /qa/services/hudson/hudson_workspace/workspace/JBoss-AS-6.0.x/JBossAS_6_0/tomcat/target/deploy/jboss-web.deployer
[mkdir] Created dir: /qa/services/hudson/hudson_workspace/workspace/JBoss-AS-6.0.x/JBossAS_6_0/tomcat/target/deploy/jbossweb.sar/META-INF
[copy] Copying 1 file to /qa/services/hudson/hudson_workspace/workspace/JBoss-AS-6.0.x/JBossAS_6_0/tomcat/target/deploy/jbossweb.sar/META-INF
[copy] Copying 1 file to /qa/services/hudson/hudson_workspace/workspace/JBoss-AS-6.0.x/JBossAS_6_0/tomcat/target/deploy/jbossweb.sar/META-INF
[copy] Copying 1 file to /qa/services/hudson/hudson_workspace/workspace/JBoss-AS-6.0.x/JBossAS_6_0/tomcat/target/deploy/jbossweb.sar
[copy] Copying 1 file to /qa/services/hudson/hudson_workspace/workspace/JBoss-AS-6.0.x/JBossAS_6_0/tomcat/target/deploy/jbossweb.sar
[copy] Copying 2 files to /qa/services/hudson/hudson_workspace/workspace/JBoss-AS-6.0.x/JBossAS_6_0/tomcat/target/deploy/jbossweb.sar
[copy] Copying 1 file to /qa/services/hudson/hudson_workspace/workspace/JBoss-AS-6.0.x/JBossAS_6_0/tomcat/target/deploy/jbossweb.sar
[mkdir] Created dir: /qa/services/hudson/hudson_workspace/workspace/JBoss-AS-6.0.x/JBossAS_6_0/tomcat/target/deploy/jbossweb.sar/jsf-libs
[copy] Copying 2 files to /qa/services/hudson/hudson_workspace/workspace/JBoss-AS-6.0.x/JBossAS_6_0/tomcat/target/deploy/jbossweb.sar/jsf-libs
[copy] Copying 1 file to /qa/services/hudson/hudson_workspace/workspace/JBoss-AS-6.0.x/JBossAS_6_0/tomcat/target/deploy/jbossweb.sar/jsf-libs
[copy] Copying 1 file to /qa/services/hudson/hudson_workspace/workspace/JBoss-AS-6.0.x/JBossAS_6_0/tomcat/target/deploy/jbossweb.sar
[copy] Copying 1 file to /qa/services/hudson/hudson_workspace/workspace/JBoss-AS-6.0.x/JBossAS_6_0/tomcat/target
[mkdir] Created dir: /qa/services/hudson/hudson_workspace/workspace/JBoss-AS-6.0.x/JBossAS_6_0/tomcat/target/deploy/cluster
[copy] Copying 1 file to /qa/services/hudson/hudson_workspace/workspace/JBoss-AS-6.0.x/JBossAS_6_0/tomcat/target/deploy/cluster
[INFO] Executed tasks
[INFO] [install:install]
[INFO] Installing /qa/services/hudson/hudson_workspace/workspace/JBoss-AS-6.0.x/JBossAS_6_0/tomcat/target/jboss-as-tomcat.jar to /home/hudson/.m2/repository/org/jboss/jbossas/jboss-as-tomcat/6.0.0-SNAPSHOT/jboss-as-tomcat-6.0.0-SNAPSHOT.jar
[INFO] Installing /qa/services/hudson/hudson_workspace/workspace/JBoss-AS-6.0.x/JBossAS_6_0/tomcat/target/jboss-as-tomcat-sources.jar to /home/hudson/.m2/repository/org/jboss/jbossas/jboss-as-tomcat/6.0.0-SNAPSHOT/jboss-as-tomcat-6.0.0-SNAPSHOT-sources.jar
[INFO] Installing /qa/services/hudson/hudson_workspace/workspace/JBoss-AS-6.0.x/JBossAS_6_0/tomcat/target/jboss-as-tomcat-jboss-web-service.jar to /home/hudson/.m2/repository/org/jboss/jbossas/jboss-as-tomcat/6.0.0-SNAPSHOT/jboss-as-tomcat-6.0.0-SNAPSHOT-jboss-web-service.jar
[INFO] Installing /qa/services/hudson/hudson_workspace/workspace/JBoss-AS-6.0.x/JBossAS_6_0/tomcat/target/jboss-as-tomcat-jbossweb-cluster-aop.jar to /home/hudson/.m2/repository/org/jboss/jbossas/jboss-as-tomcat/6.0.0-SNAPSHOT/jboss-as-tomcat-6.0.0-SNAPSHOT-jbossweb-cluster-aop.jar
[INFO] Installing /qa/services/hudson/hudson_workspace/workspace/JBoss-AS-6.0.x/JBossAS_6_0/tomcat/target/jboss-as-tomcat-jboss-web-deployer.jar to /home/hudson/.m2/repository/org/jboss/jbossas/jboss-as-tomcat/6.0.0-SNAPSHOT/jboss-as-tomcat-6.0.0-SNAPSHOT-jboss-web-deployer.jar
[INFO] Installing /qa/services/hudson/hudson_workspace/workspace/JBoss-AS-6.0.x/JBossAS_6_0/tomcat/target/jboss-as-tomcat-jboss-faces.jar to /home/hudson/.m2/repository/org/jboss/jbossas/jboss-as-tomcat/6.0.0-SNAPSHOT/jboss-as-tomcat-6.0.0-SNAPSHOT-jboss-faces.jar
[INFO] ------------------------------------------------------------------------
[INFO] Building JBoss Application Server Webservices
[INFO] task-segment: [install]
[INFO] ------------------------------------------------------------------------
[INFO] [buildnumber:create {execution: set-build-properties}]
[INFO] Checking for local modifications: skipped.
[INFO] Updating project files from SCM: skipped.
[INFO] Storing buildNumber: 88753 at timestamp: May 12, 2009 1:11:34 PM EDT
[INFO] [enforcer:enforce {execution: ban-bad-dependencies}]
[INFO] [enforcer:enforce {execution: enforce-java-maven-versions}]
[INFO] [enforcer:enforce {execution: enforce-plugin-versions}]
[INFO] [resources:resources]
[WARNING] Using platform encoding (UTF-8 actually) to copy filtered resources, i.e. build is platform dependent!
[INFO] Copying 4 resources
[INFO] [compiler:compile]
[INFO] Compiling 48 source files to /qa/services/hudson/hudson_workspace/workspace/JBoss-AS-6.0.x/JBossAS_6_0/webservices/target/classes
[INFO] ------------------------------------------------------------------------
[ERROR] BUILD FAILURE
[INFO] ------------------------------------------------------------------------
[INFO] Compilation failure
Failure executing javac, but could not parse the error:
The system is out of resources.
Consult the following stack trace for details.
java.lang.OutOfMemoryError: PermGen space
at com.sun.tools.javac.parser.Parser$Factory.newParser(Parser.java:79)
at com.sun.tools.javac.main.JavaCompiler.parse(JavaCompiler.java:508)
at com.sun.tools.javac.main.JavaCompiler.parse(JavaCompiler.java:550)
at com.sun.tools.javac.main.JavaCompiler.parseFiles(JavaCompiler.java:801)
at com.sun.tools.javac.main.JavaCompiler.compile(JavaCompiler.java:727)
at com.sun.tools.javac.main.Main.compile(Main.java:353)
at com.sun.tools.javac.main.Main.compile(Main.java:279)
at com.sun.tools.javac.main.Main.compile(Main.java:270)
at com.sun.tools.javac.Main.compile(Main.java:87)
at sun.reflect.NativeMethodAccessorImpl.invoke0(Native Method)
at sun.reflect.NativeMethodAccessorImpl.invoke(NativeMethodAccessorImpl.java:39)
at sun.reflect.DelegatingMethodAccessorImpl.invoke(DelegatingMethodAccessorImpl.java:25)
at java.lang.reflect.Method.invoke(Method.java:597)
at org.codehaus.plexus.compiler.javac.JavacCompiler.compileInProcess(JavacCompiler.java:420)
at org.codehaus.plexus.compiler.javac.JavacCompiler.compile(JavacCompiler.java:141)
at org.apache.maven.plugin.AbstractCompilerMojo.execute(AbstractCompilerMojo.java:493)
at org.apache.maven.plugin.CompilerMojo.execute(CompilerMojo.java:114)
at org.apache.maven.plugin.DefaultPluginManager.executeMojo(DefaultPluginManager.java:451)
at org.apache.maven.lifecycle.DefaultLifecycleExecutor.executeGoals(DefaultLifecycleExecutor.java:558)
at org.apache.maven.lifecycle.DefaultLifecycleExecutor.executeGoalWithLifecycle(DefaultLifecycleExecutor.java:499)
at org.apache.maven.lifecycle.DefaultLifecycleExecutor.executeGoal(DefaultLifecycleExecutor.java:478)
at org.apache.maven.lifecycle.DefaultLifecycleExecutor.executeGoalAndHandleFailures(DefaultLifecycleExecutor.java:330)
at org.apache.maven.lifecycle.DefaultLifecycleExecutor.executeTaskSegments(DefaultLifecycleExecutor.java:291)
at org.apache.maven.lifecycle.DefaultLifecycleExecutor.execute(DefaultLifecycleExecutor.java:142)
at org.apache.maven.DefaultMaven.doExecute(DefaultMaven.java:336)
at org.apache.maven.DefaultMaven.execute(DefaultMaven.java:129)
at org.apache.maven.cli.MavenCli.main(MavenCli.java:287)
at sun.reflect.NativeMethodAccessorImpl.invoke0(Native Method)
at sun.reflect.NativeMethodAccessorImpl.invoke(NativeMethodAccessorImpl.java:39)
at sun.reflect.DelegatingMethodAccessorImpl.invoke(DelegatingMethodAccessorImpl.java:25)
at java.lang.reflect.Method.invoke(Method.java:597)
at org.codehaus.classworlds.Launcher.launchEnhanced(Launcher.java:315)
Failure executing javac, but could not parse the error:
The system is out of resources.
Consult the following stack trace for details.
java.lang.OutOfMemoryError: PermGen space
at com.sun.tools.javac.parser.Parser$Factory.newParser(Parser.java:79)
at com.sun.tools.javac.main.JavaCompiler.parse(JavaCompiler.java:508)
at com.sun.tools.javac.main.JavaCompiler.parse(JavaCompiler.java:550)
at com.sun.tools.javac.main.JavaCompiler.parseFiles(JavaCompiler.java:801)
at com.sun.tools.javac.main.JavaCompiler.compile(JavaCompiler.java:727)
at com.sun.tools.javac.main.Main.compile(Main.java:353)
at com.sun.tools.javac.main.Main.compile(Main.java:279)
at com.sun.tools.javac.main.Main.compile(Main.java:270)
at com.sun.tools.javac.Main.compile(Main.java:87)
at sun.reflect.NativeMethodAccessorImpl.invoke0(Native Method)
at sun.reflect.NativeMethodAccessorImpl.invoke(NativeMethodAccessorImpl.java:39)
at sun.reflect.DelegatingMethodAccessorImpl.invoke(DelegatingMethodAccessorImpl.java:25)
at java.lang.reflect.Method.invoke(Method.java:597)
at org.codehaus.plexus.compiler.javac.JavacCompiler.compileInProcess(JavacCompiler.java:420)
at org.codehaus.plexus.compiler.javac.JavacCompiler.compile(JavacCompiler.java:141)
at org.apache.maven.plugin.AbstractCompilerMojo.execute(AbstractCompilerMojo.java:493)
at org.apache.maven.plugin.CompilerMojo.execute(CompilerMojo.java:114)
at org.apache.maven.plugin.DefaultPluginManager.executeMojo(DefaultPluginManager.java:451)
at org.apache.maven.lifecycle.DefaultLifecycleExecutor.executeGoals(DefaultLifecycleExecutor.java:558)
at org.apache.maven.lifecycle.DefaultLifecycleExecutor.executeGoalWithLifecycle(DefaultLifecycleExecutor.java:499)
at org.apache.maven.lifecycle.DefaultLifecycleExecutor.executeGoal(DefaultLifecycleExecutor.java:478)
at org.apache.maven.lifecycle.DefaultLifecycleExecutor.executeGoalAndHandleFailures(DefaultLifecycleExecutor.java:330)
at org.apache.maven.lifecycle.DefaultLifecycleExecutor.executeTaskSegments(DefaultLifecycleExecutor.java:291)
at org.apache.maven.lifecycle.DefaultLifecycleExecutor.execute(DefaultLifecycleExecutor.java:142)
at org.apache.maven.DefaultMaven.doExecute(DefaultMaven.java:336)
at org.apache.maven.DefaultMaven.execute(DefaultMaven.java:129)
at org.apache.maven.cli.MavenCli.main(MavenCli.java:287)
at sun.reflect.NativeMethodAccessorImpl.invoke0(Native Method)
at sun.reflect.NativeMethodAccessorImpl.invoke(NativeMethodAccessorImpl.java:39)
at sun.reflect.DelegatingMethodAccessorImpl.invoke(DelegatingMethodAccessorImpl.java:25)
at java.lang.reflect.Method.invoke(Method.java:597)
at org.codehaus.classworlds.Launcher.launchEnhanced(Launcher.java:315)
[INFO] ------------------------------------------------------------------------
[INFO] For more information, run Maven with the -e switch
[INFO] ------------------------------------------------------------------------
[INFO] Total time: 14 minutes 53 seconds
[INFO] Finished at: Tue May 12 13:11:44 EDT 2009
[INFO] Final Memory: 133M/623M
[INFO] ------------------------------------------------------------------------
[JBoss-AS-6.0.x] $ bash -xe /tmp/hudson5335245172409438342.sh
+ kill 25518
Recording fingerprints
Build was marked for publishing on https://hudson.jboss.org/hudson/
Email was triggered for: Failure
There are 1 triggered emails.
Sending email for trigger: Failure
15 years, 9 months
JBoss-AS-6.0.x - Build # 448 - Failure!
by jboss-qa-internal@redhat.com
JBoss-AS-6.0.x - Build # 448 - Failure:
Check console output at https://hudson.jboss.org/hudson//job/JBoss-AS-6.0.x/448 to view the results.
Modifications since last build:
[jaikiran] JBAS-6887 ejb3-endpoint-deployers introduced into the AS
-------------------------------------------------------------------------
[...truncated 14634 lines...]
[INFO] Installing /qa/services/hudson/hudson_workspace/workspace/JBoss-AS-6.0.x/JBossAS_6_0/varia/target/jboss-as-varia-foe-deployer-3.2-sar.jar to /home/hudson/.m2/repository/org/jboss/jbossas/jboss-as-varia/6.0.0-SNAPSHOT/jboss-as-varia-6.0.0-SNAPSHOT-foe-deployer-3.2-sar.jar
[INFO] Installing /qa/services/hudson/hudson_workspace/workspace/JBoss-AS-6.0.x/JBossAS_6_0/varia/target/jboss-as-varia-autonumber-plugin.jar to /home/hudson/.m2/repository/org/jboss/jbossas/jboss-as-varia/6.0.0-SNAPSHOT/jboss-as-varia-6.0.0-SNAPSHOT-autonumber-plugin.jar
[INFO] Installing /qa/services/hudson/hudson_workspace/workspace/JBoss-AS-6.0.x/JBossAS_6_0/varia/target/jboss-as-varia-httpa-invoker-sar.jar to /home/hudson/.m2/repository/org/jboss/jbossas/jboss-as-varia/6.0.0-SNAPSHOT/jboss-as-varia-6.0.0-SNAPSHOT-httpa-invoker-sar.jar
[INFO] Installing /qa/services/hudson/hudson_workspace/workspace/JBoss-AS-6.0.x/JBossAS_6_0/varia/target/jboss-as-varia-deployment-service.jar to /home/hudson/.m2/repository/org/jboss/jbossas/jboss-as-varia/6.0.0-SNAPSHOT/jboss-as-varia-6.0.0-SNAPSHOT-deployment-service.jar
[INFO] Installing /qa/services/hudson/hudson_workspace/workspace/JBoss-AS-6.0.x/JBossAS_6_0/varia/target/jboss-as-varia-mail-plugin.jar to /home/hudson/.m2/repository/org/jboss/jbossas/jboss-as-varia/6.0.0-SNAPSHOT/jboss-as-varia-6.0.0-SNAPSHOT-mail-plugin.jar
[INFO] Installing /qa/services/hudson/hudson_workspace/workspace/JBoss-AS-6.0.x/JBossAS_6_0/varia/target/jboss-as-varia-jbossjmx-ant.jar to /home/hudson/.m2/repository/org/jboss/jbossas/jboss-as-varia/6.0.0-SNAPSHOT/jboss-as-varia-6.0.0-SNAPSHOT-jbossjmx-ant.jar
[INFO] ------------------------------------------------------------------------
[INFO] Building JBoss Application Server Management
[INFO] task-segment: [install]
[INFO] ------------------------------------------------------------------------
[INFO] [buildnumber:create {execution: set-build-properties}]
[INFO] Checking for local modifications: skipped.
[INFO] Updating project files from SCM: skipped.
[INFO] Storing buildNumber: 88715 at timestamp: May 12, 2009 9:24:59 AM EDT
[INFO] [enforcer:enforce {execution: ban-bad-dependencies}]
[INFO] [enforcer:enforce {execution: enforce-java-maven-versions}]
[INFO] [enforcer:enforce {execution: enforce-plugin-versions}]
[INFO] [resources:resources]
[WARNING] Using platform encoding (UTF-8 actually) to copy filtered resources, i.e. build is platform dependent!
[INFO] Copying 2 resources
[INFO] [compiler:compile]
[INFO] Compiling 183 source files to /qa/services/hudson/hudson_workspace/workspace/JBoss-AS-6.0.x/JBossAS_6_0/management/target/classes
[INFO] [rmic:rmic {execution: rmi-compile}]
[INFO] Compiling 1 remote classes
[INFO] [resources:testResources]
[WARNING] Using platform encoding (UTF-8 actually) to copy filtered resources, i.e. build is platform dependent!
[INFO] skip non existing resourceDirectory /qa/services/hudson/hudson_workspace/workspace/JBoss-AS-6.0.x/JBossAS_6_0/management/src/test/resources
[INFO] [compiler:testCompile]
[INFO] No sources to compile
[INFO] [surefire:test]
[INFO] No tests to run.
[INFO] [jar:jar]
[INFO] Building jar: /qa/services/hudson/hudson_workspace/workspace/JBoss-AS-6.0.x/JBossAS_6_0/management/target/jboss-as-management.jar
[INFO] Preparing source:jar
[WARNING] Removing: jar from forked lifecycle, to prevent recursive invocation.
[INFO] [buildnumber:create {execution: set-build-properties}]
[INFO] Checking for local modifications: skipped.
[INFO] Updating project files from SCM: skipped.
[INFO] Storing buildNumber: 88715 at timestamp: May 12, 2009 9:25:09 AM EDT
[INFO] [enforcer:enforce {execution: ban-bad-dependencies}]
[INFO] [enforcer:enforce {execution: enforce-java-maven-versions}]
[INFO] [enforcer:enforce {execution: enforce-plugin-versions}]
[INFO] [source:jar {execution: attach-sources}]
[INFO] Building jar: /qa/services/hudson/hudson_workspace/workspace/JBoss-AS-6.0.x/JBossAS_6_0/management/target/jboss-as-management-sources.jar
[INFO] [assembly:single {execution: assembly}]
[INFO] Building jar: /qa/services/hudson/hudson_workspace/workspace/JBoss-AS-6.0.x/JBossAS_6_0/management/target/jboss-as-management-jsr77-client.jar
[INFO] Building jar: /qa/services/hudson/hudson_workspace/workspace/JBoss-AS-6.0.x/JBossAS_6_0/management/target/jboss-as-management-ejb-management.jar
[INFO] Building jar: /qa/services/hudson/hudson_workspace/workspace/JBoss-AS-6.0.x/JBossAS_6_0/management/target/jboss-as-management-jsr77.jar
[INFO] [antrun:run {execution: create-output}]
[INFO] Executing tasks
[mkdir] Created dir: /qa/services/hudson/hudson_workspace/workspace/JBoss-AS-6.0.x/JBossAS_6_0/management/target/etc
[copy] Copying 2 files to /qa/services/hudson/hudson_workspace/workspace/JBoss-AS-6.0.x/JBossAS_6_0/management/target/etc
[INFO] Executed tasks
[INFO] [install:install]
[INFO] Installing /qa/services/hudson/hudson_workspace/workspace/JBoss-AS-6.0.x/JBossAS_6_0/management/target/jboss-as-management.jar to /home/hudson/.m2/repository/org/jboss/jbossas/jboss-as-management/6.0.0-SNAPSHOT/jboss-as-management-6.0.0-SNAPSHOT.jar
[INFO] Installing /qa/services/hudson/hudson_workspace/workspace/JBoss-AS-6.0.x/JBossAS_6_0/management/target/jboss-as-management-sources.jar to /home/hudson/.m2/repository/org/jboss/jbossas/jboss-as-management/6.0.0-SNAPSHOT/jboss-as-management-6.0.0-SNAPSHOT-sources.jar
[INFO] Installing /qa/services/hudson/hudson_workspace/workspace/JBoss-AS-6.0.x/JBossAS_6_0/management/target/jboss-as-management-jsr77-client.jar to /home/hudson/.m2/repository/org/jboss/jbossas/jboss-as-management/6.0.0-SNAPSHOT/jboss-as-management-6.0.0-SNAPSHOT-jsr77-client.jar
[INFO] Installing /qa/services/hudson/hudson_workspace/workspace/JBoss-AS-6.0.x/JBossAS_6_0/management/target/jboss-as-management-ejb-management.jar to /home/hudson/.m2/repository/org/jboss/jbossas/jboss-as-management/6.0.0-SNAPSHOT/jboss-as-management-6.0.0-SNAPSHOT-ejb-management.jar
[INFO] Installing /qa/services/hudson/hudson_workspace/workspace/JBoss-AS-6.0.x/JBossAS_6_0/management/target/jboss-as-management-jsr77.jar to /home/hudson/.m2/repository/org/jboss/jbossas/jboss-as-management/6.0.0-SNAPSHOT/jboss-as-management-6.0.0-SNAPSHOT-jsr77.jar
[INFO] ------------------------------------------------------------------------
[INFO] Building JBoss Application Server Tomcat
[INFO] task-segment: [install]
[INFO] ------------------------------------------------------------------------
[INFO] [buildnumber:create {execution: set-build-properties}]
[INFO] Checking for local modifications: skipped.
[INFO] Updating project files from SCM: skipped.
[INFO] Storing buildNumber: 88715 at timestamp: May 12, 2009 9:25:15 AM EDT
[INFO] [enforcer:enforce {execution: ban-bad-dependencies}]
[INFO] [enforcer:enforce {execution: enforce-java-maven-versions}]
[INFO] [enforcer:enforce {execution: enforce-plugin-versions}]
[INFO] [resources:resources]
[WARNING] Using platform encoding (UTF-8 actually) to copy filtered resources, i.e. build is platform dependent!
[INFO] Copying 5 resources
[INFO] [compiler:compile]
[INFO] Compiling 137 source files to /qa/services/hudson/hudson_workspace/workspace/JBoss-AS-6.0.x/JBossAS_6_0/tomcat/target/classes
[INFO] [resources:testResources]
[WARNING] Using platform encoding (UTF-8 actually) to copy filtered resources, i.e. build is platform dependent!
[INFO] skip non existing resourceDirectory /qa/services/hudson/hudson_workspace/workspace/JBoss-AS-6.0.x/JBossAS_6_0/tomcat/src/test/resources
[INFO] [compiler:testCompile]
[INFO] No sources to compile
[INFO] [surefire:test]
[INFO] No tests to run.
[INFO] [jar:jar]
[INFO] Building jar: /qa/services/hudson/hudson_workspace/workspace/JBoss-AS-6.0.x/JBossAS_6_0/tomcat/target/jboss-as-tomcat.jar
[INFO] Preparing source:jar
[WARNING] Removing: jar from forked lifecycle, to prevent recursive invocation.
[INFO] [buildnumber:create {execution: set-build-properties}]
[INFO] Checking for local modifications: skipped.
[INFO] Updating project files from SCM: skipped.
[INFO] Storing buildNumber: 88715 at timestamp: May 12, 2009 9:25:32 AM EDT
[INFO] [enforcer:enforce {execution: ban-bad-dependencies}]
[INFO] [enforcer:enforce {execution: enforce-java-maven-versions}]
[INFO] [enforcer:enforce {execution: enforce-plugin-versions}]
[INFO] [source:jar {execution: attach-sources}]
[INFO] Building jar: /qa/services/hudson/hudson_workspace/workspace/JBoss-AS-6.0.x/JBossAS_6_0/tomcat/target/jboss-as-tomcat-sources.jar
[INFO] [assembly:single {execution: assembly}]
[INFO] Building jar: /qa/services/hudson/hudson_workspace/workspace/JBoss-AS-6.0.x/JBossAS_6_0/tomcat/target/jboss-as-tomcat-jboss-web-service.jar
[INFO] Building jar: /qa/services/hudson/hudson_workspace/workspace/JBoss-AS-6.0.x/JBossAS_6_0/tomcat/target/jboss-as-tomcat-jbossweb-cluster-aop.jar
[INFO] Building jar: /qa/services/hudson/hudson_workspace/workspace/JBoss-AS-6.0.x/JBossAS_6_0/tomcat/target/jboss-as-tomcat-jboss-web-deployer.jar
[INFO] Building jar: /qa/services/hudson/hudson_workspace/workspace/JBoss-AS-6.0.x/JBossAS_6_0/tomcat/target/jboss-as-tomcat-jboss-faces.jar
[INFO] [antrun:run {execution: create-output}]
[INFO] Executing tasks
[mkdir] Created dir: /qa/services/hudson/hudson_workspace/workspace/JBoss-AS-6.0.x/JBossAS_6_0/tomcat/target/etc
[copy] Copying 1 file to /qa/services/hudson/hudson_workspace/workspace/JBoss-AS-6.0.x/JBossAS_6_0/tomcat/target/etc
[mkdir] Created dir: /qa/services/hudson/hudson_workspace/workspace/JBoss-AS-6.0.x/JBossAS_6_0/tomcat/target/resources
[copy] Copying 15 files to /qa/services/hudson/hudson_workspace/workspace/JBoss-AS-6.0.x/JBossAS_6_0/tomcat/target/resources
[mkdir] Created dir: /qa/services/hudson/hudson_workspace/workspace/JBoss-AS-6.0.x/JBossAS_6_0/tomcat/target/deploy
[copy] Copying 6 files to /qa/services/hudson/hudson_workspace/workspace/JBoss-AS-6.0.x/JBossAS_6_0/tomcat/target/deploy
[mkdir] Created dir: /qa/services/hudson/hudson_workspace/workspace/JBoss-AS-6.0.x/JBossAS_6_0/tomcat/target/deploy/jboss-web.deployer/META-INF
[copy] Copying 1 file to /qa/services/hudson/hudson_workspace/workspace/JBoss-AS-6.0.x/JBossAS_6_0/tomcat/target/deploy/jboss-web.deployer
[copy] Copying 2 files to /qa/services/hudson/hudson_workspace/workspace/JBoss-AS-6.0.x/JBossAS_6_0/tomcat/target/deploy/jboss-web.deployer/META-INF
[copy] Copying 1 file to /qa/services/hudson/hudson_workspace/workspace/JBoss-AS-6.0.x/JBossAS_6_0/tomcat/target/deploy/jboss-web.deployer
[mkdir] Created dir: /qa/services/hudson/hudson_workspace/workspace/JBoss-AS-6.0.x/JBossAS_6_0/tomcat/target/deploy/jbossweb.sar/META-INF
[copy] Copying 1 file to /qa/services/hudson/hudson_workspace/workspace/JBoss-AS-6.0.x/JBossAS_6_0/tomcat/target/deploy/jbossweb.sar/META-INF
[copy] Copying 1 file to /qa/services/hudson/hudson_workspace/workspace/JBoss-AS-6.0.x/JBossAS_6_0/tomcat/target/deploy/jbossweb.sar/META-INF
[copy] Copying 1 file to /qa/services/hudson/hudson_workspace/workspace/JBoss-AS-6.0.x/JBossAS_6_0/tomcat/target/deploy/jbossweb.sar
[copy] Copying 1 file to /qa/services/hudson/hudson_workspace/workspace/JBoss-AS-6.0.x/JBossAS_6_0/tomcat/target/deploy/jbossweb.sar
[copy] Copying 2 files to /qa/services/hudson/hudson_workspace/workspace/JBoss-AS-6.0.x/JBossAS_6_0/tomcat/target/deploy/jbossweb.sar
[copy] Copying 1 file to /qa/services/hudson/hudson_workspace/workspace/JBoss-AS-6.0.x/JBossAS_6_0/tomcat/target/deploy/jbossweb.sar
[mkdir] Created dir: /qa/services/hudson/hudson_workspace/workspace/JBoss-AS-6.0.x/JBossAS_6_0/tomcat/target/deploy/jbossweb.sar/jsf-libs
[copy] Copying 2 files to /qa/services/hudson/hudson_workspace/workspace/JBoss-AS-6.0.x/JBossAS_6_0/tomcat/target/deploy/jbossweb.sar/jsf-libs
[copy] Copying 1 file to /qa/services/hudson/hudson_workspace/workspace/JBoss-AS-6.0.x/JBossAS_6_0/tomcat/target/deploy/jbossweb.sar/jsf-libs
[copy] Copying 1 file to /qa/services/hudson/hudson_workspace/workspace/JBoss-AS-6.0.x/JBossAS_6_0/tomcat/target/deploy/jbossweb.sar
[copy] Copying 1 file to /qa/services/hudson/hudson_workspace/workspace/JBoss-AS-6.0.x/JBossAS_6_0/tomcat/target
[mkdir] Created dir: /qa/services/hudson/hudson_workspace/workspace/JBoss-AS-6.0.x/JBossAS_6_0/tomcat/target/deploy/cluster
[copy] Copying 1 file to /qa/services/hudson/hudson_workspace/workspace/JBoss-AS-6.0.x/JBossAS_6_0/tomcat/target/deploy/cluster
[INFO] Executed tasks
[INFO] [install:install]
[INFO] Installing /qa/services/hudson/hudson_workspace/workspace/JBoss-AS-6.0.x/JBossAS_6_0/tomcat/target/jboss-as-tomcat.jar to /home/hudson/.m2/repository/org/jboss/jbossas/jboss-as-tomcat/6.0.0-SNAPSHOT/jboss-as-tomcat-6.0.0-SNAPSHOT.jar
[INFO] Installing /qa/services/hudson/hudson_workspace/workspace/JBoss-AS-6.0.x/JBossAS_6_0/tomcat/target/jboss-as-tomcat-sources.jar to /home/hudson/.m2/repository/org/jboss/jbossas/jboss-as-tomcat/6.0.0-SNAPSHOT/jboss-as-tomcat-6.0.0-SNAPSHOT-sources.jar
[INFO] Installing /qa/services/hudson/hudson_workspace/workspace/JBoss-AS-6.0.x/JBossAS_6_0/tomcat/target/jboss-as-tomcat-jboss-web-service.jar to /home/hudson/.m2/repository/org/jboss/jbossas/jboss-as-tomcat/6.0.0-SNAPSHOT/jboss-as-tomcat-6.0.0-SNAPSHOT-jboss-web-service.jar
[INFO] Installing /qa/services/hudson/hudson_workspace/workspace/JBoss-AS-6.0.x/JBossAS_6_0/tomcat/target/jboss-as-tomcat-jbossweb-cluster-aop.jar to /home/hudson/.m2/repository/org/jboss/jbossas/jboss-as-tomcat/6.0.0-SNAPSHOT/jboss-as-tomcat-6.0.0-SNAPSHOT-jbossweb-cluster-aop.jar
[INFO] Installing /qa/services/hudson/hudson_workspace/workspace/JBoss-AS-6.0.x/JBossAS_6_0/tomcat/target/jboss-as-tomcat-jboss-web-deployer.jar to /home/hudson/.m2/repository/org/jboss/jbossas/jboss-as-tomcat/6.0.0-SNAPSHOT/jboss-as-tomcat-6.0.0-SNAPSHOT-jboss-web-deployer.jar
[INFO] Installing /qa/services/hudson/hudson_workspace/workspace/JBoss-AS-6.0.x/JBossAS_6_0/tomcat/target/jboss-as-tomcat-jboss-faces.jar to /home/hudson/.m2/repository/org/jboss/jbossas/jboss-as-tomcat/6.0.0-SNAPSHOT/jboss-as-tomcat-6.0.0-SNAPSHOT-jboss-faces.jar
[INFO] ------------------------------------------------------------------------
[INFO] Building JBoss Application Server Webservices
[INFO] task-segment: [install]
[INFO] ------------------------------------------------------------------------
[INFO] [buildnumber:create {execution: set-build-properties}]
[INFO] Checking for local modifications: skipped.
[INFO] Updating project files from SCM: skipped.
[INFO] Storing buildNumber: 88715 at timestamp: May 12, 2009 9:25:43 AM EDT
[INFO] [enforcer:enforce {execution: ban-bad-dependencies}]
[INFO] [enforcer:enforce {execution: enforce-java-maven-versions}]
[INFO] [enforcer:enforce {execution: enforce-plugin-versions}]
[INFO] [resources:resources]
[WARNING] Using platform encoding (UTF-8 actually) to copy filtered resources, i.e. build is platform dependent!
[INFO] Copying 4 resources
[INFO] [compiler:compile]
[INFO] Compiling 48 source files to /qa/services/hudson/hudson_workspace/workspace/JBoss-AS-6.0.x/JBossAS_6_0/webservices/target/classes
[INFO] ------------------------------------------------------------------------
[ERROR] BUILD FAILURE
[INFO] ------------------------------------------------------------------------
[INFO] Compilation failure
Failure executing javac, but could not parse the error:
The system is out of resources.
Consult the following stack trace for details.
java.lang.OutOfMemoryError: PermGen space
at java.lang.ClassLoader.defineClass1(Native Method)
at java.lang.ClassLoader.defineClass(ClassLoader.java:621)
at java.security.SecureClassLoader.defineClass(SecureClassLoader.java:124)
at java.net.URLClassLoader.defineClass(URLClassLoader.java:260)
at java.net.URLClassLoader.access$000(URLClassLoader.java:56)
at java.net.URLClassLoader$1.run(URLClassLoader.java:195)
at java.security.AccessController.doPrivileged(Native Method)
at java.net.URLClassLoader.findClass(URLClassLoader.java:188)
at org.codehaus.plexus.compiler.javac.IsolatedClassLoader.loadClass(IsolatedClassLoader.java:56)
at java.lang.ClassLoader.loadClassInternal(ClassLoader.java:320)
at com.sun.tools.javac.processing.JavacProcessingEnvironment.<init>(JavacProcessingEnvironment.java:139)
at com.sun.tools.javac.main.JavaCompiler.initProcessAnnotations(JavaCompiler.java:874)
at com.sun.tools.javac.main.JavaCompiler.compile(JavaCompiler.java:724)
at com.sun.tools.javac.main.Main.compile(Main.java:353)
at com.sun.tools.javac.main.Main.compile(Main.java:279)
at com.sun.tools.javac.main.Main.compile(Main.java:270)
at com.sun.tools.javac.Main.compile(Main.java:87)
at sun.reflect.NativeMethodAccessorImpl.invoke0(Native Method)
at sun.reflect.NativeMethodAccessorImpl.invoke(NativeMethodAccessorImpl.java:39)
at sun.reflect.DelegatingMethodAccessorImpl.invoke(DelegatingMethodAccessorImpl.java:25)
at java.lang.reflect.Method.invoke(Method.java:597)
at org.codehaus.plexus.compiler.javac.JavacCompiler.compileInProcess(JavacCompiler.java:420)
at org.codehaus.plexus.compiler.javac.JavacCompiler.compile(JavacCompiler.java:141)
at org.apache.maven.plugin.AbstractCompilerMojo.execute(AbstractCompilerMojo.java:493)
at org.apache.maven.plugin.CompilerMojo.execute(CompilerMojo.java:114)
at org.apache.maven.plugin.DefaultPluginManager.executeMojo(DefaultPluginManager.java:451)
at org.apache.maven.lifecycle.DefaultLifecycleExecutor.executeGoals(DefaultLifecycleExecutor.java:558)
at org.apache.maven.lifecycle.DefaultLifecycleExecutor.executeGoalWithLifecycle(DefaultLifecycleExecutor.java:499)
at org.apache.maven.lifecycle.DefaultLifecycleExecutor.executeGoal(DefaultLifecycleExecutor.java:478)
at org.apache.maven.lifecycle.DefaultLifecycleExecutor.executeGoalAndHandleFailures(DefaultLifecycleExecutor.java:330)
at org.apache.maven.lifecycle.DefaultLifecycleExecutor.executeTaskSegments(DefaultLifecycleExecutor.java:291)
at org.apache.maven.lifecycle.DefaultLifecycleExecutor.execute(DefaultLifecycleExecutor.java:142)
Failure executing javac, but could not parse the error:
The system is out of resources.
Consult the following stack trace for details.
java.lang.OutOfMemoryError: PermGen space
at java.lang.ClassLoader.defineClass1(Native Method)
at java.lang.ClassLoader.defineClass(ClassLoader.java:621)
at java.security.SecureClassLoader.defineClass(SecureClassLoader.java:124)
at java.net.URLClassLoader.defineClass(URLClassLoader.java:260)
at java.net.URLClassLoader.access$000(URLClassLoader.java:56)
at java.net.URLClassLoader$1.run(URLClassLoader.java:195)
at java.security.AccessController.doPrivileged(Native Method)
at java.net.URLClassLoader.findClass(URLClassLoader.java:188)
at org.codehaus.plexus.compiler.javac.IsolatedClassLoader.loadClass(IsolatedClassLoader.java:56)
at java.lang.ClassLoader.loadClassInternal(ClassLoader.java:320)
at com.sun.tools.javac.processing.JavacProcessingEnvironment.<init>(JavacProcessingEnvironment.java:139)
at com.sun.tools.javac.main.JavaCompiler.initProcessAnnotations(JavaCompiler.java:874)
at com.sun.tools.javac.main.JavaCompiler.compile(JavaCompiler.java:724)
at com.sun.tools.javac.main.Main.compile(Main.java:353)
at com.sun.tools.javac.main.Main.compile(Main.java:279)
at com.sun.tools.javac.main.Main.compile(Main.java:270)
at com.sun.tools.javac.Main.compile(Main.java:87)
at sun.reflect.NativeMethodAccessorImpl.invoke0(Native Method)
at sun.reflect.NativeMethodAccessorImpl.invoke(NativeMethodAccessorImpl.java:39)
at sun.reflect.DelegatingMethodAccessorImpl.invoke(DelegatingMethodAccessorImpl.java:25)
at java.lang.reflect.Method.invoke(Method.java:597)
at org.codehaus.plexus.compiler.javac.JavacCompiler.compileInProcess(JavacCompiler.java:420)
at org.codehaus.plexus.compiler.javac.JavacCompiler.compile(JavacCompiler.java:141)
at org.apache.maven.plugin.AbstractCompilerMojo.execute(AbstractCompilerMojo.java:493)
at org.apache.maven.plugin.CompilerMojo.execute(CompilerMojo.java:114)
at org.apache.maven.plugin.DefaultPluginManager.executeMojo(DefaultPluginManager.java:451)
at org.apache.maven.lifecycle.DefaultLifecycleExecutor.executeGoals(DefaultLifecycleExecutor.java:558)
at org.apache.maven.lifecycle.DefaultLifecycleExecutor.executeGoalWithLifecycle(DefaultLifecycleExecutor.java:499)
at org.apache.maven.lifecycle.DefaultLifecycleExecutor.executeGoal(DefaultLifecycleExecutor.java:478)
at org.apache.maven.lifecycle.DefaultLifecycleExecutor.executeGoalAndHandleFailures(DefaultLifecycleExecutor.java:330)
at org.apache.maven.lifecycle.DefaultLifecycleExecutor.executeTaskSegments(DefaultLifecycleExecutor.java:291)
at org.apache.maven.lifecycle.DefaultLifecycleExecutor.execute(DefaultLifecycleExecutor.java:142)
[INFO] ------------------------------------------------------------------------
[INFO] For more information, run Maven with the -e switch
[INFO] ------------------------------------------------------------------------
[INFO] Total time: 10 minutes 32 seconds
[INFO] Finished at: Tue May 12 09:25:49 EDT 2009
[INFO] Final Memory: 152M/623M
[INFO] ------------------------------------------------------------------------
[JBoss-AS-6.0.x] $ bash -xe /tmp/hudson2053255886149901065.sh
+ kill 24102
Recording fingerprints
Build was marked for publishing on https://hudson.jboss.org/hudson/
Email was triggered for: Failure
There are 1 triggered emails.
Sending email for trigger: Failure
15 years, 9 months
[Still Failing] jbosstools-nightly-3.1.0.Alpha1 #160
by jboss-qa-internal@redhat.com
http://hudson.qa.jboss.com/hudson/job/jbosstools-nightly-3.1.0.Alpha1/160/
http://hudson.qa.jboss.com/hudson/job/jbosstools-nightly-3.1.0.Alpha1/160...
http://hudson.qa.jboss.com/hudson/job/jbosstools-nightly-3.1.0.Alpha1/160...
http://hudson.qa.jboss.com/hudson/job/jbosstools-nightly-3.1.0.Alpha1/160...
--------------------------------------------------
Failed Tests:
All tests passed
--------------------------------------------------
Changes:
[dgolovin] fix PMD violations after local build is finally up on Eclipse 3.5M7
--------------------------------------------------
Console log:
[...truncated 14419 lines...]
[java]
[java] gather.bin.parts:
[java] [mkdir] Created dir: /home/hudson/hudson_workspace/workspace/jbosstools-nightly-3.1.0.Alpha1/jbds-build/eclipse/tmp/plugins/org.hibernate.eclipse.console.test_3.1.0.beta5
[java] [copy] Copying 62 files to /home/hudson/hudson_workspace/workspace/jbosstools-nightly-3.1.0.Alpha1/jbds-build/eclipse/tmp/plugins/org.hibernate.eclipse.console.test_3.1.0.beta5
[java] [copy] Copying 564 files to /home/hudson/hudson_workspace/workspace/jbosstools-nightly-3.1.0.Alpha1/jbds-build/eclipse/tmp/plugins/org.hibernate.eclipse.console.test_3.1.0.beta5
[java]
[java] apitools.generation:
[java]
[java] customAssembly:
[java]
[java] properties:
[java]
[java] init:
[java]
[java] gather.bin.parts:
[java] [mkdir] Created dir: /home/hudson/hudson_workspace/workspace/jbosstools-nightly-3.1.0.Alpha1/jbds-build/eclipse/tmp/plugins/org.hibernate.eclipse.jdt.ui.test_1.0.0
[java] [copy] Copying 1 file to /home/hudson/hudson_workspace/workspace/jbosstools-nightly-3.1.0.Alpha1/jbds-build/eclipse/tmp/plugins/org.hibernate.eclipse.jdt.ui.test_1.0.0
[java] [copy] Copying 52 files to /home/hudson/hudson_workspace/workspace/jbosstools-nightly-3.1.0.Alpha1/jbds-build/eclipse/tmp/plugins/org.hibernate.eclipse.jdt.ui.test_1.0.0
[java]
[java] apitools.generation:
[java]
[java] customAssembly:
[java]
[java] init:
[java]
[java] gather.bin.parts:
[java] [mkdir] Created dir: /home/hudson/hudson_workspace/workspace/jbosstools-nightly-3.1.0.Alpha1/jbds-build/eclipse/tmp/features/org.hibernate.eclipse.test.feature_3.1.0.beta7
[java]
[java] children:
[java] [copy] Copying 1 file to /home/hudson/hudson_workspace/workspace/jbosstools-nightly-3.1.0.Alpha1/jbds-build/eclipse/tmp/features/org.hibernate.eclipse.test.feature_3.1.0.beta7
[java]
[java] rootFiles:
[java]
[java] rootFiles*_*_*:
[java]
[java] customAssembly:
[java]
[java] customAssembly:
[java]
[java] jar.processing:
[java]
[java] customAssembly:
[java]
[java] generate.p2.metadata:
[java]
[java] assemble.archive:
[java]
[java] customAssembly:
[java]
[java] cleanup.assembly:
[java] [delete] Deleting directory /home/hudson/hudson_workspace/workspace/jbosstools-nightly-3.1.0.Alpha1/jbds-build/eclipse/tmp
[java]
[java] generate.p2.metadata:
[java]
[java] init:
[java]
[java] assembleElement:
[java]
[java] main:
[java]
[java] assemble.org.jboss.ide.eclipse.as.test.feature:
[java]
[java] main:
[java] [mkdir] Created dir: /home/hudson/hudson_workspace/workspace/jbosstools-nightly-3.1.0.Alpha1/jbds-build/eclipse/tmp
[java]
[java] gather.bin.parts:
[java]
[java] properties:
[java]
[java] init:
[java]
[java] gather.bin.parts:
[java] [mkdir] Created dir: /home/hudson/hudson_workspace/workspace/jbosstools-nightly-3.1.0.Alpha1/jbds-build/eclipse/tmp/plugins/org.jboss.ide.eclipse.as.test_1.0.0
[java] [copy] Copying 1 file to /home/hudson/hudson_workspace/workspace/jbosstools-nightly-3.1.0.Alpha1/jbds-build/eclipse/tmp/plugins/org.jboss.ide.eclipse.as.test_1.0.0
[java] [copy] Copying 40 files to /home/hudson/hudson_workspace/workspace/jbosstools-nightly-3.1.0.Alpha1/jbds-build/eclipse/tmp/plugins/org.jboss.ide.eclipse.as.test_1.0.0
[java] [copy] Copied 31 empty directories to 5 empty directories under /home/hudson/hudson_workspace/workspace/jbosstools-nightly-3.1.0.Alpha1/jbds-build/eclipse/tmp/plugins/org.jboss.ide.eclipse.as.test_1.0.0
[java]
[java] apitools.generation:
[java]
[java] customAssembly:
[java]
[java] properties:
[java]
[java] init:
[java]
[java] gather.bin.parts:
[java] [mkdir] Created dir: /home/hudson/hudson_workspace/workspace/jbosstools-nightly-3.1.0.Alpha1/jbds-build/eclipse/tmp/plugins/org.jboss.tools.jmx.core.test_0.2.2
[java] [copy] Copying 1 file to /home/hudson/hudson_workspace/workspace/jbosstools-nightly-3.1.0.Alpha1/jbds-build/eclipse/tmp/plugins/org.jboss.tools.jmx.core.test_0.2.2
[java] [copy] Copying 23 files to /home/hudson/hudson_workspace/workspace/jbosstools-nightly-3.1.0.Alpha1/jbds-build/eclipse/tmp/plugins/org.jboss.tools.jmx.core.test_0.2.2
[java]
[java] apitools.generation:
[java]
[java] customAssembly:
[java]
[java] properties:
[java]
[java] init:
[java]
[java] gather.bin.parts:
[java] [mkdir] Created dir: /home/hudson/hudson_workspace/workspace/jbosstools-nightly-3.1.0.Alpha1/jbds-build/eclipse/tmp/plugins/org.jboss.ide.eclipse.as.ui.test_1.0.0
[java] [copy] Copying 2 files to /home/hudson/hudson_workspace/workspace/jbosstools-nightly-3.1.0.Alpha1/jbds-build/eclipse/tmp/plugins/org.jboss.ide.eclipse.as.ui.test_1.0.0
[java] [copy] Copying 2 files to /home/hudson/hudson_workspace/workspace/jbosstools-nightly-3.1.0.Alpha1/jbds-build/eclipse/tmp/plugins/org.jboss.ide.eclipse.as.ui.test_1.0.0
[java]
[java] apitools.generation:
[java]
[java] customAssembly:
[java]
[java] init:
[java]
[java] gather.bin.parts:
[java] [mkdir] Created dir: /home/hudson/hudson_workspace/workspace/jbosstools-nightly-3.1.0.Alpha1/jbds-build/eclipse/tmp/features/org.jboss.ide.eclipse.as.test.feature_1.0.0
[java]
[java] children:
[java] [copy] Copying 1 file to /home/hudson/hudson_workspace/workspace/jbosstools-nightly-3.1.0.Alpha1/jbds-build/eclipse/tmp/features/org.jboss.ide.eclipse.as.test.feature_1.0.0
[java]
[java] rootFiles:
[java]
[java] rootFiles*_*_*:
[java]
[java] customAssembly:
[java]
[java] customAssembly:
[java]
[java] jar.processing:
[java]
[java] jarUp:
[java]
[java] jarIng:
[java] [jar] Building jar: /home/hudson/hudson_workspace/workspace/jbosstools-nightly-3.1.0.Alpha1/jbds-build/eclipse/tmp/plugins/org.jboss.ide.eclipse.as.ui.test_1.0.0.jar
[java] [delete] Deleting directory /home/hudson/hudson_workspace/workspace/jbosstools-nightly-3.1.0.Alpha1/jbds-build/eclipse/tmp/plugins/org.jboss.ide.eclipse.as.ui.test_1.0.0
[java]
[java] customAssembly:
[java]
[java] generate.p2.metadata:
[java]
[java] assemble.archive:
[java]
[java] customAssembly:
[java]
[java] cleanup.assembly:
[java] [delete] Deleting directory /home/hudson/hudson_workspace/workspace/jbosstools-nightly-3.1.0.Alpha1/jbds-build/eclipse/tmp
[java]
[java] generate.p2.metadata:
[java]
[java] postAssemble:
[java]
[java] package:
[java]
[java] postBuild:
[java]
[java] postBuild:
[java] BUILD SUCCESSFUL
[java]
[java] BUILD SUCCESSFUL
[java] Total time: 5 minutes 13 seconds
[echo] /home/hudson/hudson_workspace/workspace/jbosstools-nightly-3.1.0.Alpha1/jbds-build/3.1.0.Alpha1/200905120028/tests
[copy] Copying 3 files to /home/hudson/hudson_workspace/workspace/jbosstools-nightly-3.1.0.Alpha1/jbds-build/3.1.0.Alpha1/200905120028/tests
[copy] Copied 4 empty directories to 4 empty directories under /home/hudson/hudson_workspace/workspace/jbosstools-nightly-3.1.0.Alpha1/jbds-build/3.1.0.Alpha1/200905120028/tests
testBuild:
[echo] Extracting test eclipse workbench to /home/hudson/hudson_workspace/workspace/jbosstools-nightly-3.1.0.Alpha1/jbds-build/3.1.0.Alpha1/200905120028/tests
init:
unzipEclipse:
[echo]
[echo] eclipseInstallDir = /home/hudson/hudson_workspace/workspace/jbosstools-nightly-3.1.0.Alpha1/jbds-build/3.1.0.Alpha1/200905120028/tests
[echo] eclipseArchiveName = eclipse-SDK-3.5M7-linux-gtk-x86_64.tar.gz
[untar] Expanding: /home/hudson/hudson_workspace/workspace/jbosstools-nightly-3.1.0.Alpha1/jbds-build/requirements/eclipse/eclipse-SDK-3.5M7-linux-gtk-x86_64.tar.gz into /home/hudson/hudson_workspace/workspace/jbosstools-nightly-3.1.0.Alpha1/jbds-build/3.1.0.Alpha1/200905120028/tests
[echo] Extracting drivers into /home/hudson/hudson_workspace/workspace/jbosstools-nightly-3.1.0.Alpha1/jbds-build/3.1.0.Alpha1/200905120028/tests
[unzip] Expanding: /home/hudson/hudson_workspace/workspace/jbosstools-nightly-3.1.0.Alpha1/jbds-build/requirements/dtp/dtp-1.7.0M7-200905052200.zip into /home/hudson/hudson_workspace/workspace/jbosstools-nightly-3.1.0.Alpha1/jbds-build/3.1.0.Alpha1/200905120028/tests
[unzip] Expanding: /home/hudson/hudson_workspace/workspace/jbosstools-nightly-3.1.0.Alpha1/jbds-build/requirements/emf/emf-runtime-2.5.0M7.zip into /home/hudson/hudson_workspace/workspace/jbosstools-nightly-3.1.0.Alpha1/jbds-build/3.1.0.Alpha1/200905120028/tests
[unzip] Expanding: /home/hudson/hudson_workspace/workspace/jbosstools-nightly-3.1.0.Alpha1/jbds-build/requirements/gef/GEF-runtime-3.5.0M7.zip into /home/hudson/hudson_workspace/workspace/jbosstools-nightly-3.1.0.Alpha1/jbds-build/3.1.0.Alpha1/200905120028/tests
[unzip] Expanding: /home/hudson/hudson_workspace/workspace/jbosstools-nightly-3.1.0.Alpha1/jbds-build/requirements/webtools/wtp-S-3.1M7-20090505073946.zip into /home/hudson/hudson_workspace/workspace/jbosstools-nightly-3.1.0.Alpha1/jbds-build/3.1.0.Alpha1/200905120028/tests
[unzip] Expanding: /home/hudson/hudson_workspace/workspace/jbosstools-nightly-3.1.0.Alpha1/jbds-build/requirements/webtools/wtp-jpt-S-3.1M7-20090505073946.zip into /home/hudson/hudson_workspace/workspace/jbosstools-nightly-3.1.0.Alpha1/jbds-build/3.1.0.Alpha1/200905120028/tests
[unzip] Expanding: /home/hudson/hudson_workspace/workspace/jbosstools-nightly-3.1.0.Alpha1/jbds-build/requirements/xsd/xsd-runtime-2.5.0M7.zip into /home/hudson/hudson_workspace/workspace/jbosstools-nightly-3.1.0.Alpha1/jbds-build/3.1.0.Alpha1/200905120028/tests
[echo] Extracting test framework
[unzip] Expanding: /home/hudson/hudson_workspace/workspace/jbosstools-nightly-3.1.0.Alpha1/jbds-build/requirements/testframework/eclipse-test-framework-3.3.zip into /home/hudson/hudson_workspace/workspace/jbosstools-nightly-3.1.0.Alpha1/jbds-build/3.1.0.Alpha1/200905120028/tests
[echo] Extracting build 3.1.0.Alpha1-N200905120028-H160
[unzip] Expanding: /home/hudson/hudson_workspace/workspace/jbosstools-nightly-3.1.0.Alpha1/jbds-build/3.1.0.Alpha1/200905120028/all/JBossTools-ALL-linux-gtk-3.1.0.Alpha1-N200905120028-H160.zip into /home/hudson/hudson_workspace/workspace/jbosstools-nightly-3.1.0.Alpha1/jbds-build/3.1.0.Alpha1/200905120028/tests
[unzip] Expanding: /home/hudson/hudson_workspace/workspace/jbosstools-nightly-3.1.0.Alpha1/jbds-build/3.1.0.Alpha1/200905120028/all/JBossTools-ALL-linux-gtk-x86_64-3.1.0.Alpha1-N200905120028-H160.zip into /home/hudson/hudson_workspace/workspace/jbosstools-nightly-3.1.0.Alpha1/jbds-build/3.1.0.Alpha1/200905120028/tests
[unzip] Expanding: /home/hudson/hudson_workspace/workspace/jbosstools-nightly-3.1.0.Alpha1/jbds-build/3.1.0.Alpha1/200905120028/all/JBossTools-ALL-macosx-carbon-3.1.0.Alpha1-N200905120028-H160.zip into /home/hudson/hudson_workspace/workspace/jbosstools-nightly-3.1.0.Alpha1/jbds-build/3.1.0.Alpha1/200905120028/tests
[unzip] Expanding: /home/hudson/hudson_workspace/workspace/jbosstools-nightly-3.1.0.Alpha1/jbds-build/3.1.0.Alpha1/200905120028/all/JBossTools-ALL-win32-3.1.0.Alpha1-N200905120028-H160.zip into /home/hudson/hudson_workspace/workspace/jbosstools-nightly-3.1.0.Alpha1/jbds-build/3.1.0.Alpha1/200905120028/tests
[echo] Extracting main tests
[unzip] Expanding: /home/hudson/hudson_workspace/workspace/jbosstools-nightly-3.1.0.Alpha1/jbds-build/3.1.0.Alpha1/200905120028/tests/HibernateTools-Tests-3.0.0.GA-N200905120028-H160.zip into /home/hudson/hudson_workspace/workspace/jbosstools-nightly-3.1.0.Alpha1/jbds-build/3.1.0.Alpha1/200905120028/tests/eclipse
[unzip] Expanding: /home/hudson/hudson_workspace/workspace/jbosstools-nightly-3.1.0.Alpha1/jbds-build/3.1.0.Alpha1/200905120028/tests/JBossASTools-Tests-3.0.0.GA-N200905120028-H160.zip into /home/hudson/hudson_workspace/workspace/jbosstools-nightly-3.1.0.Alpha1/jbds-build/3.1.0.Alpha1/200905120028/tests/eclipse
[unzip] Expanding: /home/hudson/hudson_workspace/workspace/jbosstools-nightly-3.1.0.Alpha1/jbds-build/3.1.0.Alpha1/200905120028/tests/JBossTools-RichFaces-Tests-3.0.0.GA-N200905120028-H160.zip into /home/hudson/hudson_workspace/workspace/jbosstools-nightly-3.1.0.Alpha1/jbds-build/3.1.0.Alpha1/200905120028/tests/eclipse
[echo] Extracting Drools-IDE tests
[unzip] Expanding: /home/hudson/hudson_workspace/workspace/jbosstools-nightly-3.1.0.Alpha1/jbds-build/3.1.0.Alpha1/200905120028/drools-ide/DroolsIDE-Tests-5.0.1.trunk-N200905120028-H160.zip into /home/hudson/hudson_workspace/workspace/jbosstools-nightly-3.1.0.Alpha1/jbds-build/3.1.0.Alpha1/200905120028/tests/eclipse
[echo] Extracting JBossAS
[unzip] Expanding: /home/hudson/hudson_workspace/workspace/jbosstools-nightly-3.1.0.Alpha1/jbds-build/requirements/jbeap/jboss-eap-noauth-4.3.0.GA_CP03.zip into /home/hudson/hudson_workspace/workspace/jbosstools-nightly-3.1.0.Alpha1/jbds-build/3.1.0.Alpha1/200905120028/tests/jboss
[unzip] Expanding: /home/hudson/hudson_workspace/workspace/jbosstools-nightly-3.1.0.Alpha1/jbds-build/requirements/seamfp/jboss-eap-fp-4.3.0.CP03-FP01.zip into /home/hudson/hudson_workspace/workspace/jbosstools-nightly-3.1.0.Alpha1/jbds-build/3.1.0.Alpha1/200905120028/tests/jboss
[unzip] Expanding: /home/hudson/hudson_workspace/workspace/jbosstools-nightly-3.1.0.Alpha1/jbds-build/requirements/seamfp/jbds-seamfp-patch.zip into /home/hudson/hudson_workspace/workspace/jbosstools-nightly-3.1.0.Alpha1/jbds-build/3.1.0.Alpha1/200905120028/tests/jboss
[echo] Applying Seam-gen Patch
[unzip] Expanding: /home/hudson/hudson_workspace/workspace/jbosstools-nightly-3.1.0.Alpha1/jbds-build/requirements/eapseamgen/rhds-seam-gen-patch.zip into /home/hudson/hudson_workspace/workspace/jbosstools-nightly-3.1.0.Alpha1/jbds-build/3.1.0.Alpha1/200905120028/tests/jboss/jboss-eap-4.3/seam
[instr] processing instrumentation path ...
[instr] instrumentation path processed in 18420 ms
[instr] [7376 class(es) instrumented, 4336 resource(s) copied]
[instr] metadata merged into [/home/hudson/hudson_workspace/workspace/jbosstools-nightly-3.1.0.Alpha1/jbds-build/3.1.0.Alpha1/200905120028/tests/eclipse/coverage.em] {in 550 ms}
[echo] Move emma jars to /home/hudson/hudson_workspace/workspace/jbosstools-nightly-3.1.0.Alpha1/jbds-build/3.1.0.Alpha1/200905120028/tests/eclipse
[copy] Copying 1 file to /home/hudson/hudson_workspace/workspace/jbosstools-nightly-3.1.0.Alpha1/jbds-build/3.1.0.Alpha1/200905120028/tests/eclipse
[disableExtensionPoint] Removing extension point 'org.eclipse.ui.intro' from plugin 'org.eclipse.sdk'
BUILD FAILED
/qa/services/hudson/hudson_workspace/workspace/jbosstools-nightly-3.1.0.Alpha1/org.jboss.ide.eclipse.releng/builders/buildNightly.xml:12: The following error occurred while executing this line:
/qa/services/hudson/hudson_workspace/workspace/jbosstools-nightly-3.1.0.Alpha1/org.jboss.ide.eclipse.releng/builders/build.xml:69: The following error occurred while executing this line:
/qa/services/hudson/hudson_workspace/workspace/jbosstools-nightly-3.1.0.Alpha1/org.jboss.ide.eclipse.releng/builders/build.xml:27: The following error occurred while executing this line:
/qa/services/hudson/hudson_workspace/workspace/jbosstools-nightly-3.1.0.Alpha1/org.jboss.ide.eclipse.releng/builders/build.xml:39: The following error occurred while executing this line:
/qa/services/hudson/hudson_workspace/workspace/jbosstools-nightly-3.1.0.Alpha1/org.jboss.ide.eclipse.releng/builders/product/productBuild.xml:93: The following error occurred while executing this line:
/qa/services/hudson/hudson_workspace/workspace/jbosstools-nightly-3.1.0.Alpha1/org.jboss.ide.eclipse.releng/builders/product/productBuild.xml:162: The following error occurred while executing this line:
/home/hudson/hudson_workspace/workspace/jbosstools-nightly-3.1.0.Alpha1/org.jboss.ide.eclipse.releng/builders/tests/testBuild.xml:132: java.io.FileNotFoundException: /home/hudson/hudson_workspace/workspace/jbosstools-nightly-3.1.0.Alpha1/jbds-build/3.1.0.Alpha1/200905120028/tests/eclipse/plugins/org.eclipse.sdk_3.5.0.v200904302300.jar/plugin.xml (Not a directory)
Total time: 64 minutes 13 seconds
+ cd ../configs/jbds
+ zip build.log.zip build.log
updating: build.log (deflated 95%)
+ cd ../..
+ [[ '' == \l\o\c\a\l ]]
++ cat /home/hudson/hudson_workspace/workspace/jbosstools-nightly-3.1.0.Alpha1/jbds-build/buildData.properties
++ grep product.releaseNumber
++ perl -ne 's/[\s\t]+product.releaseNumber=//g;print;'
+ version=3.1.0.Alpha1
++ cat /home/hudson/hudson_workspace/workspace/jbosstools-nightly-3.1.0.Alpha1/jbds-build/buildData.properties
++ grep upload.to
++ perl -ne 's/[\s\t]+upload.to=//g;print;'
+ builddir=nightly/3.1.0.Alpha1/200905120028
++ cat /home/hudson/hudson_workspace/workspace/jbosstools-nightly-3.1.0.Alpha1/jbds-build/buildData.properties
++ grep product.buildDesc
++ perl -ne 's/[\s\t]+product.buildDesc=//g; print;'
+ buildtype=nightly
++ cat /home/hudson/hudson_workspace/workspace/jbosstools-nightly-3.1.0.Alpha1/jbds-build/buildData.properties
++ grep product.releaseNumber
++ perl -ne 's/[\s\t]+product.releaseNumber=//g; print;'
+ releaseNumber=3.1.0.Alpha1
+ DESTINATION=jbossqa@download.jboss.org:/htdocs/jbosstools
+ scp -r /home/hudson/hudson_workspace/workspace/jbosstools-nightly-3.1.0.Alpha1/jbds-build/3.1.0.Alpha1 jbossqa@download.jboss.org:/htdocs/jbosstools/builds/nightly/
+ scp configs/jbds/build.log.zip jbossqa@download.jboss.org:/htdocs/jbosstools/builds/nightly/3.1.0.Alpha1/200905120028/
+ scp /home/hudson/hudson_workspace/workspace/jbosstools-nightly-3.1.0.Alpha1/jbds-build/latestBuild.html jbossqa@download.jboss.org:/htdocs/jbosstools/builds/nightly/
/home/hudson/hudson_workspace/workspace/jbosstools-nightly-3.1.0.Alpha1/jbds-build/latestBuild.html: No such file or directory
Terminating xvnc
[jbosstools-nightly-3.1.0.Alpha1] $ vncserver -kill :24
Killing Xvnc process ID 4469
[jbosstools-nightly-3.1.0.Alpha1] $ bash -xe /tmp/hudson7803986171837275321.sh
+ kill 4450
Recording test results
Recording Emma reports jbds-build/coverage.xml
Email was triggered for: Failure
There are 1 triggered emails.
Sending email for trigger: Failure
--------------------------------------------------
15 years, 9 months