[Still Unstable] jbosstools-nightly-3.0.x #71
by jboss-qa-internal@redhat.com
Public:
https://hudson.jboss.org/hudson//job/jbosstools-nightly-3.0.x/71
https://hudson.jboss.org/hudson//job/jbosstools-nightly-3.0.x/71/testReport
https://hudson.jboss.org/hudson//job/jbosstools-nightly-3.0.x/71/changes
https://hudson.jboss.org/hudson//job/jbosstools-nightly-3.0.x/71/console
Internal:
http://hudson.qa.jboss.com/hudson/job/jbosstools-nightly-3.0.x/71/
http://hudson.qa.jboss.com/hudson/job/jbosstools-nightly-3.0.x/71//testRe...
http://hudson.qa.jboss.com/hudson/job/jbosstools-nightly-3.0.x/71//changes
http://hudson.qa.jboss.com/hudson/job/jbosstools-nightly-3.0.x/71//console
--------------------------------------------------
Failed Tests:
22 tests failed.
REGRESSION: ArchivesTestSuite
Error Message:
null
Stack Trace:
junit.framework.AssertionFailedError
at org.jboss.ide.eclipse.archives.test.model.ModelCreationTest.testArchiveClashingArchiveInModel(ModelCreationTest.java:491)
at org.eclipse.test.EclipseTestRunner.run(EclipseTestRunner.java:354)
at org.eclipse.test.EclipseTestRunner.run(EclipseTestRunner.java:206)
at org.eclipse.test.UITestApplication$3.run(UITestApplication.java:195)
at org.eclipse.swt.widgets.RunnableLock.run(RunnableLock.java:35)
at org.eclipse.swt.widgets.Synchronizer.runAsyncMessages(Synchronizer.java:133)
at org.eclipse.swt.widgets.Display.runAsyncMessages(Display.java:3378)
at org.eclipse.swt.widgets.Display.readAndDispatch(Display.java:3036)
at org.eclipse.ui.internal.Workbench.runEventLoop(Workbench.java:2384)
at org.eclipse.ui.internal.Workbench.runUI(Workbench.java:2348)
at org.eclipse.ui.internal.Workbench.access$4(Workbench.java:2200)
at org.eclipse.ui.internal.Workbench$5.run(Workbench.java:495)
at org.eclipse.core.databinding.observable.Realm.runWithDefault(Realm.java:288)
at org.eclipse.ui.internal.Workbench.createAndRunWorkbench(Workbench.java:490)
at org.eclipse.ui.PlatformUI.createAndRunWorkbench(PlatformUI.java:149)
at org.eclipse.ui.internal.ide.application.IDEApplication.start(IDEApplication.java:113)
at org.eclipse.test.UITestApplication.runApplication(UITestApplication.java:138)
at org.eclipse.test.UITestApplication.run(UITestApplication.java:60)
at org.eclipse.test.UITestApplication.start(UITestApplication.java:210)
at org.eclipse.equinox.internal.app.EclipseAppHandle.run(EclipseAppHandle.java:193)
at org.eclipse.core.runtime.internal.adaptor.EclipseAppLauncher.runApplication(EclipseAppLauncher.java:110)
at org.eclipse.core.runtime.internal.adaptor.EclipseAppLauncher.start(EclipseAppLauncher.java:79)
at org.eclipse.core.runtime.adaptor.EclipseStarter.run(EclipseStarter.java:386)
at org.eclipse.core.runtime.adaptor.EclipseStarter.run(EclipseStarter.java:179)
at org.eclipse.equinox.launcher.Main.invokeFramework(Main.java:549)
at org.eclipse.equinox.launcher.Main.basicRun(Main.java:504)
at org.eclipse.equinox.launcher.Main.run(Main.java:1236)
at org.eclipse.equinox.launcher.Main.main(Main.java:1212)
at org.eclipse.core.launcher.Main.main(Main.java:30)
FAILED: JsfAllTests
Error Message:
null
Stack Trace:
org.eclipse.jface.text.BadLocationException
at org.eclipse.wst.sse.core.internal.text.MinimalDocument.get(MinimalDocument.java:144)
at org.eclipse.wst.sse.core.internal.text.BasicStructuredDocumentRegion.getText(BasicStructuredDocumentRegion.java:287)
at org.eclipse.wst.xml.core.internal.document.StructuredDocumentRegionUtil.getAttrValue(StructuredDocumentRegionUtil.java:37)
at org.eclipse.wst.xml.core.internal.document.AttrImpl.getValueSource(AttrImpl.java:435)
at org.eclipse.wst.xml.core.internal.document.AttrImpl.getValue(AttrImpl.java:334)
at org.eclipse.wst.xml.core.internal.contentmodel.util.NamespaceAttributeVisitor.visitElement(NamespaceAttributeVisitor.java:86)
at org.eclipse.wst.xml.core.internal.contentmodel.util.NamespaceTable.addElement(NamespaceTable.java:212)
at org.eclipse.wst.xml.core.internal.contentmodel.modelqueryimpl.XMLAssociationProvider.getCMElementDeclaration(XMLAssociationProvider.java:210)
at org.eclipse.wst.html.core.internal.modelquery.HTMLModelQueryImpl.getCMElementDeclaration(HTMLModelQueryImpl.java:153)
at org.eclipse.wst.html.core.internal.validate.CMUtil.getDeclaration(CMUtil.java:47)
at org.eclipse.wst.html.core.internal.validate.NamespaceValidator.isUnknownElement(NamespaceValidator.java:87)
at org.eclipse.wst.html.core.internal.validate.NamespaceValidator.hasUnknownPrefix(NamespaceValidator.java:83)
at org.eclipse.wst.html.core.internal.validate.NamespaceValidator.validate(NamespaceValidator.java:40)
at org.eclipse.wst.html.core.internal.validate.CompositeValidator.validate(CompositeValidator.java:54)
at org.eclipse.wst.xml.core.internal.validate.AbstractPropagatingValidator.validate(AbstractPropagatingValidator.java:38)
at org.eclipse.wst.xml.core.internal.validate.AbstractPropagatingValidator.propagateToChildElements(AbstractPropagatingValidator.java:60)
at org.eclipse.wst.xml.core.internal.validate.AbstractPropagatingValidator.validate(AbstractPropagatingValidator.java:40)
at org.eclipse.wst.xml.core.internal.validate.AbstractPropagatingValidator.propagateToChildElements(AbstractPropagatingValidator.java:60)
at org.eclipse.wst.xml.core.internal.validate.AbstractPropagatingValidator.validate(AbstractPropagatingValidator.java:40)
at org.eclipse.wst.xml.core.internal.validate.AbstractPropagatingValidator.propagateToChildElements(AbstractPropagatingValidator.java:60)
at org.eclipse.wst.xml.core.internal.validate.AbstractPropagatingValidator.validate(AbstractPropagatingValidator.java:40)
at org.eclipse.wst.xml.core.internal.validate.AbstractPropagatingValidator.propagateToChildElements(AbstractPropagatingValidator.java:60)
at org.eclipse.wst.xml.core.internal.validate.AbstractPropagatingValidator.validate(AbstractPropagatingValidator.java:40)
at org.eclipse.wst.xml.core.internal.validate.AbstractPropagatingValidator.propagateToChildElements(AbstractPropagatingValidator.java:60)
at org.eclipse.wst.xml.core.internal.validate.AbstractPropagatingValidator.validate(AbstractPropagatingValidator.java:40)
at org.eclipse.wst.xml.core.internal.validate.AbstractPropagatingValidator.propagateToChildElements(AbstractPropagatingValidator.java:60)
at org.eclipse.wst.xml.core.internal.validate.AbstractPropagatingValidator.validate(AbstractPropagatingValidator.java:40)
at org.eclipse.wst.xml.core.internal.validate.AbstractPropagatingValidator.propagateToChildElements(AbstractPropagatingValidator.java:60)
at org.eclipse.wst.xml.core.internal.validate.AbstractPropagatingValidator.validate(AbstractPropagatingValidator.java:40)
at org.eclipse.wst.xml.core.internal.validate.AbstractPropagatingValidator.propagateToChildElements(AbstractPropagatingValidator.java:60)
at org.eclipse.wst.xml.core.internal.validate.AbstractPropagatingValidator.validate(AbstractPropagatingValidator.java:40)
at org.eclipse.wst.xml.core.internal.validate.AbstractPropagatingValidator.propagateToChildElements(AbstractPropagatingValidator.java:60)
at org.eclipse.wst.xml.core.internal.validate.AbstractPropagatingValidator.validate(AbstractPropagatingValidator.java:40)
at org.eclipse.wst.xml.core.internal.validate.AbstractPropagatingValidator.propagateToChildElements(AbstractPropagatingValidator.java:60)
at org.eclipse.wst.xml.core.internal.validate.AbstractPropagatingValidator.validate(AbstractPropagatingValidator.java:40)
at org.eclipse.wst.xml.core.internal.validate.AbstractPropagatingValidator.propagateToChildElements(AbstractPropagatingValidator.java:60)
at org.eclipse.wst.xml.core.internal.validate.AbstractPropagatingValidator.validate(AbstractPropagatingValidator.java:40)
at org.eclipse.wst.xml.core.internal.validate.AbstractPropagatingValidator.propagateToChildElements(AbstractPropagatingValidator.java:60)
at org.eclipse.wst.xml.core.internal.validate.AbstractPropagatingValidator.validate(AbstractPropagatingValidator.java:40)
at org.eclipse.wst.html.core.internal.validate.DocumentPropagatingValidator.validate(DocumentPropagatingValidator.java:32)
at org.eclipse.wst.html.internal.validation.HTMLValidator.validate(HTMLValidator.java:432)
at org.eclipse.wst.html.internal.validation.HTMLValidator.validateFile(HTMLValidator.java:494)
at org.eclipse.wst.html.internal.validation.HTMLValidator.validateDelta(HTMLValidator.java:476)
at org.eclipse.wst.html.internal.validation.HTMLValidator.validate(HTMLValidator.java:239)
at org.eclipse.wst.sse.ui.internal.reconcile.validator.ReconcileStepForValidator.validate(ReconcileStepForValidator.java:292)
at org.eclipse.wst.sse.ui.internal.reconcile.validator.ReconcileStepForValidator.reconcileModel(ReconcileStepForValidator.java:258)
at org.eclipse.jface.text.reconciler.AbstractReconcileStep.reconcile(AbstractReconcileStep.java:96)
at org.eclipse.wst.sse.ui.internal.reconcile.validator.ValidatorStrategy.reconcile(ValidatorStrategy.java:229)
at org.eclipse.wst.sse.ui.internal.reconcile.DocumentRegionProcessor.process(DocumentRegionProcessor.java:191)
at org.eclipse.wst.sse.ui.internal.reconcile.StructuredRegionProcessor.process(StructuredRegionProcessor.java:252)
at org.eclipse.wst.sse.ui.internal.reconcile.DirtyRegionProcessor.run(DirtyRegionProcessor.java:638)
at org.eclipse.core.internal.jobs.Worker.run(Worker.java:55)
FAILED: JsfAllTests
Error Message:
Cursor position doesn't equals expected:<242> but was:<241>
Stack Trace:
junit.framework.AssertionFailedError: Cursor position doesn't equals expected:<242> but was:<241>
at org.jboss.tools.jsf.vpe.jsf.test.jbide.JBIDE2505Test.testCaretManupulationWithoutElSubstitution(JBIDE2505Test.java:111)
at org.jboss.tools.jsf.vpe.jsf.test.jbide.JBIDE2505Test.testCursorForJSPElements(JBIDE2505Test.java:47)
at junit.extensions.TestDecorator.basicRun(TestDecorator.java:24)
at junit.extensions.TestSetup$1.protect(TestSetup.java:21)
at junit.extensions.TestSetup.run(TestSetup.java:25)
at org.eclipse.test.EclipseTestRunner.run(EclipseTestRunner.java:354)
at org.eclipse.test.EclipseTestRunner.run(EclipseTestRunner.java:206)
at org.eclipse.test.UITestApplication$3.run(UITestApplication.java:195)
at org.eclipse.swt.widgets.RunnableLock.run(RunnableLock.java:35)
at org.eclipse.swt.widgets.Synchronizer.runAsyncMessages(Synchronizer.java:133)
at org.eclipse.swt.widgets.Display.runAsyncMessages(Display.java:3378)
at org.eclipse.swt.widgets.Display.readAndDispatch(Display.java:3036)
at org.eclipse.ui.internal.Workbench.runEventLoop(Workbench.java:2384)
at org.eclipse.ui.internal.Workbench.runUI(Workbench.java:2348)
at org.eclipse.ui.internal.Workbench.access$4(Workbench.java:2200)
at org.eclipse.ui.internal.Workbench$5.run(Workbench.java:495)
at org.eclipse.core.databinding.observable.Realm.runWithDefault(Realm.java:288)
at org.eclipse.ui.internal.Workbench.createAndRunWorkbench(Workbench.java:490)
at org.eclipse.ui.PlatformUI.createAndRunWorkbench(PlatformUI.java:149)
at org.eclipse.ui.internal.ide.application.IDEApplication.start(IDEApplication.java:113)
at org.eclipse.test.UITestApplication.runApplication(UITestApplication.java:138)
at org.eclipse.test.UITestApplication.run(UITestApplication.java:60)
at org.eclipse.test.UITestApplication.start(UITestApplication.java:210)
at org.eclipse.equinox.internal.app.EclipseAppHandle.run(EclipseAppHandle.java:193)
at org.eclipse.core.runtime.internal.adaptor.EclipseAppLauncher.runApplication(EclipseAppLauncher.java:110)
at org.eclipse.core.runtime.internal.adaptor.EclipseAppLauncher.start(EclipseAppLauncher.java:79)
at org.eclipse.core.runtime.adaptor.EclipseStarter.run(EclipseStarter.java:386)
at org.eclipse.core.runtime.adaptor.EclipseStarter.run(EclipseStarter.java:179)
at org.eclipse.equinox.launcher.Main.invokeFramework(Main.java:549)
at org.eclipse.equinox.launcher.Main.basicRun(Main.java:504)
at org.eclipse.equinox.launcher.Main.run(Main.java:1236)
at org.eclipse.equinox.launcher.Main.main(Main.java:1212)
at org.eclipse.core.launcher.Main.main(Main.java:30)
REGRESSION: JstJspAllTests
Error Message:
Content Assistant returned no proposals of type CustomCompletionProposal.
Stack Trace:
junit.framework.AssertionFailedError: Content Assistant returned no proposals of type CustomCompletionProposal.
at org.jboss.tools.jst.jsp.test.ca.JstJspJbide1759Test.testJstJspJbide1641(JstJspJbide1759Test.java:97)
at org.jboss.tools.jst.jsp.test.ca.JstJspJbide1759Test.testJstJspJbide1641(JstJspJbide1759Test.java:51)
at org.eclipse.test.EclipseTestRunner.run(EclipseTestRunner.java:354)
at org.eclipse.test.EclipseTestRunner.run(EclipseTestRunner.java:206)
at org.eclipse.test.UITestApplication$3.run(UITestApplication.java:195)
at org.eclipse.swt.widgets.RunnableLock.run(RunnableLock.java:35)
at org.eclipse.swt.widgets.Synchronizer.runAsyncMessages(Synchronizer.java:133)
at org.eclipse.swt.widgets.Display.runAsyncMessages(Display.java:3378)
at org.eclipse.swt.widgets.Display.readAndDispatch(Display.java:3036)
at org.eclipse.ui.internal.Workbench.runEventLoop(Workbench.java:2384)
at org.eclipse.ui.internal.Workbench.runUI(Workbench.java:2348)
at org.eclipse.ui.internal.Workbench.access$4(Workbench.java:2200)
at org.eclipse.ui.internal.Workbench$5.run(Workbench.java:495)
at org.eclipse.core.databinding.observable.Realm.runWithDefault(Realm.java:288)
at org.eclipse.ui.internal.Workbench.createAndRunWorkbench(Workbench.java:490)
at org.eclipse.ui.PlatformUI.createAndRunWorkbench(PlatformUI.java:149)
at org.eclipse.ui.internal.ide.application.IDEApplication.start(IDEApplication.java:113)
at org.eclipse.test.UITestApplication.runApplication(UITestApplication.java:138)
at org.eclipse.test.UITestApplication.run(UITestApplication.java:60)
at org.eclipse.test.UITestApplication.start(UITestApplication.java:210)
at org.eclipse.equinox.internal.app.EclipseAppHandle.run(EclipseAppHandle.java:193)
at org.eclipse.core.runtime.internal.adaptor.EclipseAppLauncher.runApplication(EclipseAppLauncher.java:110)
at org.eclipse.core.runtime.internal.adaptor.EclipseAppLauncher.start(EclipseAppLauncher.java:79)
at org.eclipse.core.runtime.adaptor.EclipseStarter.run(EclipseStarter.java:386)
at org.eclipse.core.runtime.adaptor.EclipseStarter.run(EclipseStarter.java:179)
at org.eclipse.equinox.launcher.Main.invokeFramework(Main.java:549)
at org.eclipse.equinox.launcher.Main.basicRun(Main.java:504)
at org.eclipse.equinox.launcher.Main.run(Main.java:1236)
at org.eclipse.equinox.launcher.Main.main(Main.java:1212)
at org.eclipse.core.launcher.Main.main(Main.java:30)
REGRESSION: SeamCoreAllTests
Error Message:
Marker matches the 'Stateful component "testComponentJBIDE1696" must have a method marked @Remove' pattern wasn't found
Stack Trace:
junit.framework.AssertionFailedError: Marker matches the 'Stateful component "testComponentJBIDE1696" must have a method marked @Remove' pattern wasn't found
at org.jboss.tools.tests.AbstractResourceMarkerTest.assertMarkerIsCreated(AbstractResourceMarkerTest.java:76)
at org.jboss.tools.seam.core.test.SeamValidatorsTest.testJiraJbide1696(SeamValidatorsTest.java:110)
at junit.extensions.TestDecorator.basicRun(TestDecorator.java:24)
at junit.extensions.TestSetup$1.protect(TestSetup.java:21)
at junit.extensions.TestSetup.run(TestSetup.java:25)
at org.eclipse.test.EclipseTestRunner.run(EclipseTestRunner.java:354)
at org.eclipse.test.EclipseTestRunner.run(EclipseTestRunner.java:206)
at org.eclipse.test.UITestApplication$3.run(UITestApplication.java:195)
at org.eclipse.swt.widgets.RunnableLock.run(RunnableLock.java:35)
at org.eclipse.swt.widgets.Synchronizer.runAsyncMessages(Synchronizer.java:133)
at org.eclipse.swt.widgets.Display.runAsyncMessages(Display.java:3378)
at org.eclipse.swt.widgets.Display.readAndDispatch(Display.java:3036)
at org.eclipse.ui.internal.Workbench.runEventLoop(Workbench.java:2384)
at org.eclipse.ui.internal.Workbench.runUI(Workbench.java:2348)
at org.eclipse.ui.internal.Workbench.access$4(Workbench.java:2200)
at org.eclipse.ui.internal.Workbench$5.run(Workbench.java:495)
at org.eclipse.core.databinding.observable.Realm.runWithDefault(Realm.java:288)
at org.eclipse.ui.internal.Workbench.createAndRunWorkbench(Workbench.java:490)
at org.eclipse.ui.PlatformUI.createAndRunWorkbench(PlatformUI.java:149)
at org.eclipse.ui.internal.ide.application.IDEApplication.start(IDEApplication.java:113)
at org.eclipse.test.UITestApplication.runApplication(UITestApplication.java:138)
at org.eclipse.test.UITestApplication.run(UITestApplication.java:60)
at org.eclipse.test.UITestApplication.start(UITestApplication.java:210)
at org.eclipse.equinox.internal.app.EclipseAppHandle.run(EclipseAppHandle.java:193)
at org.eclipse.core.runtime.internal.adaptor.EclipseAppLauncher.runApplication(EclipseAppLauncher.java:110)
at org.eclipse.core.runtime.internal.adaptor.EclipseAppLauncher.start(EclipseAppLauncher.java:79)
at org.eclipse.core.runtime.adaptor.EclipseStarter.run(EclipseStarter.java:386)
at org.eclipse.core.runtime.adaptor.EclipseStarter.run(EclipseStarter.java:179)
at org.eclipse.equinox.launcher.Main.invokeFramework(Main.java:549)
at org.eclipse.equinox.launcher.Main.basicRun(Main.java:504)
at org.eclipse.equinox.launcher.Main.run(Main.java:1236)
at org.eclipse.equinox.launcher.Main.main(Main.java:1212)
at org.eclipse.core.launcher.Main.main(Main.java:30)
FAILED: ArchivesTestSuite
Error Message:
null
Stack Trace:
junit.framework.AssertionFailedError
at org.jboss.ide.eclipse.archives.test.projects.JBIDE2296Test.testJBIDE2311(JBIDE2296Test.java:45)
at org.eclipse.test.EclipseTestRunner.run(EclipseTestRunner.java:354)
at org.eclipse.test.EclipseTestRunner.run(EclipseTestRunner.java:206)
at org.eclipse.test.UITestApplication$3.run(UITestApplication.java:195)
at org.eclipse.swt.widgets.RunnableLock.run(RunnableLock.java:35)
at org.eclipse.swt.widgets.Synchronizer.runAsyncMessages(Synchronizer.java:133)
at org.eclipse.swt.widgets.Display.runAsyncMessages(Display.java:3378)
at org.eclipse.swt.widgets.Display.readAndDispatch(Display.java:3036)
at org.eclipse.ui.internal.Workbench.runEventLoop(Workbench.java:2384)
at org.eclipse.ui.internal.Workbench.runUI(Workbench.java:2348)
at org.eclipse.ui.internal.Workbench.access$4(Workbench.java:2200)
at org.eclipse.ui.internal.Workbench$5.run(Workbench.java:495)
at org.eclipse.core.databinding.observable.Realm.runWithDefault(Realm.java:288)
at org.eclipse.ui.internal.Workbench.createAndRunWorkbench(Workbench.java:490)
at org.eclipse.ui.PlatformUI.createAndRunWorkbench(PlatformUI.java:149)
at org.eclipse.ui.internal.ide.application.IDEApplication.start(IDEApplication.java:113)
at org.eclipse.test.UITestApplication.runApplication(UITestApplication.java:138)
at org.eclipse.test.UITestApplication.run(UITestApplication.java:60)
at org.eclipse.test.UITestApplication.start(UITestApplication.java:210)
at org.eclipse.equinox.internal.app.EclipseAppHandle.run(EclipseAppHandle.java:193)
at org.eclipse.core.runtime.internal.adaptor.EclipseAppLauncher.runApplication(EclipseAppLauncher.java:110)
at org.eclipse.core.runtime.internal.adaptor.EclipseAppLauncher.start(EclipseAppLauncher.java:79)
at org.eclipse.core.runtime.adaptor.EclipseStarter.run(EclipseStarter.java:386)
at org.eclipse.core.runtime.adaptor.EclipseStarter.run(EclipseStarter.java:179)
at org.eclipse.equinox.launcher.Main.invokeFramework(Main.java:549)
at org.eclipse.equinox.launcher.Main.basicRun(Main.java:504)
at org.eclipse.equinox.launcher.Main.run(Main.java:1236)
at org.eclipse.equinox.launcher.Main.main(Main.java:1212)
at org.eclipse.core.launcher.Main.main(Main.java:30)
FAILED: ASTestSuite
Error Message:
Neither vm install nor configuration is set - should not be able to validate expected:<0> but was:<4>
Stack Trace:
junit.framework.AssertionFailedError: Neither vm install nor configuration is set - should not be able to validate expected:<0> but was:<4>
at org.jboss.ide.eclipse.as.test.classpath.RuntimeServerModelTest.testCreateBrokenRuntime(RuntimeServerModelTest.java:68)
at org.eclipse.test.EclipseTestRunner.run(EclipseTestRunner.java:354)
at org.eclipse.test.EclipseTestRunner.run(EclipseTestRunner.java:206)
at org.eclipse.test.UITestApplication$3.run(UITestApplication.java:195)
at org.eclipse.swt.widgets.RunnableLock.run(RunnableLock.java:35)
at org.eclipse.swt.widgets.Synchronizer.runAsyncMessages(Synchronizer.java:133)
at org.eclipse.swt.widgets.Display.runAsyncMessages(Display.java:3378)
at org.eclipse.swt.widgets.Display.readAndDispatch(Display.java:3036)
at org.eclipse.ui.internal.Workbench.runEventLoop(Workbench.java:2384)
at org.eclipse.ui.internal.Workbench.runUI(Workbench.java:2348)
at org.eclipse.ui.internal.Workbench.access$4(Workbench.java:2200)
at org.eclipse.ui.internal.Workbench$5.run(Workbench.java:495)
at org.eclipse.core.databinding.observable.Realm.runWithDefault(Realm.java:288)
at org.eclipse.ui.internal.Workbench.createAndRunWorkbench(Workbench.java:490)
at org.eclipse.ui.PlatformUI.createAndRunWorkbench(PlatformUI.java:149)
at org.eclipse.ui.internal.ide.application.IDEApplication.start(IDEApplication.java:113)
at org.eclipse.test.UITestApplication.runApplication(UITestApplication.java:138)
at org.eclipse.test.UITestApplication.run(UITestApplication.java:60)
at org.eclipse.test.UITestApplication.start(UITestApplication.java:210)
at org.eclipse.equinox.internal.app.EclipseAppHandle.run(EclipseAppHandle.java:193)
at org.eclipse.core.runtime.internal.adaptor.EclipseAppLauncher.runApplication(EclipseAppLauncher.java:110)
at org.eclipse.core.runtime.internal.adaptor.EclipseAppLauncher.start(EclipseAppLauncher.java:79)
at org.eclipse.core.runtime.adaptor.EclipseStarter.run(EclipseStarter.java:386)
at org.eclipse.core.runtime.adaptor.EclipseStarter.run(EclipseStarter.java:179)
at org.eclipse.equinox.launcher.Main.invokeFramework(Main.java:549)
at org.eclipse.equinox.launcher.Main.basicRun(Main.java:504)
at org.eclipse.equinox.launcher.Main.run(Main.java:1236)
at org.eclipse.equinox.launcher.Main.main(Main.java:1212)
at org.eclipse.core.launcher.Main.main(Main.java:30)
FAILED: ASTestSuite
Error Message:
expected:<3> but was:<4>
Stack Trace:
junit.framework.AssertionFailedError: expected:<3> but was:<4>
at org.jboss.ide.eclipse.as.test.classpath.ProjectRuntimeTest.verifyPostRuntimeCPE(ProjectRuntimeTest.java:80)
at org.jboss.ide.eclipse.as.test.classpath.ProjectRuntimeTest.testProjectRuntime(ProjectRuntimeTest.java:64)
at org.eclipse.test.EclipseTestRunner.run(EclipseTestRunner.java:354)
at org.eclipse.test.EclipseTestRunner.run(EclipseTestRunner.java:206)
at org.eclipse.test.UITestApplication$3.run(UITestApplication.java:195)
at org.eclipse.swt.widgets.RunnableLock.run(RunnableLock.java:35)
at org.eclipse.swt.widgets.Synchronizer.runAsyncMessages(Synchronizer.java:133)
at org.eclipse.swt.widgets.Display.runAsyncMessages(Display.java:3378)
at org.eclipse.swt.widgets.Display.readAndDispatch(Display.java:3036)
at org.eclipse.ui.internal.Workbench.runEventLoop(Workbench.java:2384)
at org.eclipse.ui.internal.Workbench.runUI(Workbench.java:2348)
at org.eclipse.ui.internal.Workbench.access$4(Workbench.java:2200)
at org.eclipse.ui.internal.Workbench$5.run(Workbench.java:495)
at org.eclipse.core.databinding.observable.Realm.runWithDefault(Realm.java:288)
at org.eclipse.ui.internal.Workbench.createAndRunWorkbench(Workbench.java:490)
at org.eclipse.ui.PlatformUI.createAndRunWorkbench(PlatformUI.java:149)
at org.eclipse.ui.internal.ide.application.IDEApplication.start(IDEApplication.java:113)
at org.eclipse.test.UITestApplication.runApplication(UITestApplication.java:138)
at org.eclipse.test.UITestApplication.run(UITestApplication.java:60)
at org.eclipse.test.UITestApplication.start(UITestApplication.java:210)
at org.eclipse.equinox.internal.app.EclipseAppHandle.run(EclipseAppHandle.java:193)
at org.eclipse.core.runtime.internal.adaptor.EclipseAppLauncher.runApplication(EclipseAppLauncher.java:110)
at org.eclipse.core.runtime.internal.adaptor.EclipseAppLauncher.start(EclipseAppLauncher.java:79)
at org.eclipse.core.runtime.adaptor.EclipseStarter.run(EclipseStarter.java:386)
at org.eclipse.core.runtime.adaptor.EclipseStarter.run(EclipseStarter.java:179)
at org.eclipse.equinox.launcher.Main.invokeFramework(Main.java:549)
at org.eclipse.equinox.launcher.Main.basicRun(Main.java:504)
at org.eclipse.equinox.launcher.Main.run(Main.java:1236)
at org.eclipse.equinox.launcher.Main.main(Main.java:1212)
at org.eclipse.core.launcher.Main.main(Main.java:30)
FAILED: ASTestSuite
Error Message:
null
Stack Trace:
junit.framework.AssertionFailedError
at org.jboss.ide.eclipse.as.test.publishing.JBIDE2512aTest.testJBIDE2512a(JBIDE2512aTest.java:40)
at org.eclipse.test.EclipseTestRunner.run(EclipseTestRunner.java:354)
at org.eclipse.test.EclipseTestRunner.run(EclipseTestRunner.java:206)
at org.eclipse.test.UITestApplication$3.run(UITestApplication.java:195)
at org.eclipse.swt.widgets.RunnableLock.run(RunnableLock.java:35)
at org.eclipse.swt.widgets.Synchronizer.runAsyncMessages(Synchronizer.java:133)
at org.eclipse.swt.widgets.Display.runAsyncMessages(Display.java:3378)
at org.eclipse.swt.widgets.Display.readAndDispatch(Display.java:3036)
at org.eclipse.ui.internal.Workbench.runEventLoop(Workbench.java:2384)
at org.eclipse.ui.internal.Workbench.runUI(Workbench.java:2348)
at org.eclipse.ui.internal.Workbench.access$4(Workbench.java:2200)
at org.eclipse.ui.internal.Workbench$5.run(Workbench.java:495)
at org.eclipse.core.databinding.observable.Realm.runWithDefault(Realm.java:288)
at org.eclipse.ui.internal.Workbench.createAndRunWorkbench(Workbench.java:490)
at org.eclipse.ui.PlatformUI.createAndRunWorkbench(PlatformUI.java:149)
at org.eclipse.ui.internal.ide.application.IDEApplication.start(IDEApplication.java:113)
at org.eclipse.test.UITestApplication.runApplication(UITestApplication.java:138)
at org.eclipse.test.UITestApplication.run(UITestApplication.java:60)
at org.eclipse.test.UITestApplication.start(UITestApplication.java:210)
at org.eclipse.equinox.internal.app.EclipseAppHandle.run(EclipseAppHandle.java:193)
at org.eclipse.core.runtime.internal.adaptor.EclipseAppLauncher.runApplication(EclipseAppLauncher.java:110)
at org.eclipse.core.runtime.internal.adaptor.EclipseAppLauncher.start(EclipseAppLauncher.java:79)
at org.eclipse.core.runtime.adaptor.EclipseStarter.run(EclipseStarter.java:386)
at org.eclipse.core.runtime.adaptor.EclipseStarter.run(EclipseStarter.java:179)
at org.eclipse.equinox.launcher.Main.invokeFramework(Main.java:549)
at org.eclipse.equinox.launcher.Main.basicRun(Main.java:504)
at org.eclipse.equinox.launcher.Main.run(Main.java:1236)
at org.eclipse.equinox.launcher.Main.main(Main.java:1212)
at org.eclipse.core.launcher.Main.main(Main.java:30)
FAILED: ASTestSuite
Error Message:
null
Stack Trace:
junit.framework.AssertionFailedError
at org.jboss.ide.eclipse.as.test.publishing.JBIDE2512bTest.testJBIDE2512b(JBIDE2512bTest.java:37)
at org.eclipse.test.EclipseTestRunner.run(EclipseTestRunner.java:354)
at org.eclipse.test.EclipseTestRunner.run(EclipseTestRunner.java:206)
at org.eclipse.test.UITestApplication$3.run(UITestApplication.java:195)
at org.eclipse.swt.widgets.RunnableLock.run(RunnableLock.java:35)
at org.eclipse.swt.widgets.Synchronizer.runAsyncMessages(Synchronizer.java:133)
at org.eclipse.swt.widgets.Display.runAsyncMessages(Display.java:3378)
at org.eclipse.swt.widgets.Display.readAndDispatch(Display.java:3036)
at org.eclipse.ui.internal.Workbench.runEventLoop(Workbench.java:2384)
at org.eclipse.ui.internal.Workbench.runUI(Workbench.java:2348)
at org.eclipse.ui.internal.Workbench.access$4(Workbench.java:2200)
at org.eclipse.ui.internal.Workbench$5.run(Workbench.java:495)
at org.eclipse.core.databinding.observable.Realm.runWithDefault(Realm.java:288)
at org.eclipse.ui.internal.Workbench.createAndRunWorkbench(Workbench.java:490)
at org.eclipse.ui.PlatformUI.createAndRunWorkbench(PlatformUI.java:149)
at org.eclipse.ui.internal.ide.application.IDEApplication.start(IDEApplication.java:113)
at org.eclipse.test.UITestApplication.runApplication(UITestApplication.java:138)
at org.eclipse.test.UITestApplication.run(UITestApplication.java:60)
at org.eclipse.test.UITestApplication.start(UITestApplication.java:210)
at org.eclipse.equinox.internal.app.EclipseAppHandle.run(EclipseAppHandle.java:193)
at org.eclipse.core.runtime.internal.adaptor.EclipseAppLauncher.runApplication(EclipseAppLauncher.java:110)
at org.eclipse.core.runtime.internal.adaptor.EclipseAppLauncher.start(EclipseAppLauncher.java:79)
at org.eclipse.core.runtime.adaptor.EclipseStarter.run(EclipseStarter.java:386)
at org.eclipse.core.runtime.adaptor.EclipseStarter.run(EclipseStarter.java:179)
at org.eclipse.equinox.launcher.Main.invokeFramework(Main.java:549)
at org.eclipse.equinox.launcher.Main.basicRun(Main.java:504)
at org.eclipse.equinox.launcher.Main.run(Main.java:1236)
at org.eclipse.equinox.launcher.Main.main(Main.java:1212)
at org.eclipse.core.launcher.Main.main(Main.java:30)
FAILED: JsfUiAllTests
Error Message:
No tests found in org.jboss.tools.jsf.ui.preferences.JSFCapabilitiesPreferencesPage
Stack Trace:
junit.framework.AssertionFailedError: No tests found in org.jboss.tools.jsf.ui.preferences.JSFCapabilitiesPreferencesPage
at junit.extensions.TestDecorator.basicRun(TestDecorator.java:24)
at junit.extensions.TestSetup$1.protect(TestSetup.java:21)
at junit.extensions.TestSetup.run(TestSetup.java:25)
at org.eclipse.test.EclipseTestRunner.run(EclipseTestRunner.java:354)
at org.eclipse.test.EclipseTestRunner.run(EclipseTestRunner.java:206)
at org.eclipse.test.UITestApplication$3.run(UITestApplication.java:195)
at org.eclipse.swt.widgets.RunnableLock.run(RunnableLock.java:35)
at org.eclipse.swt.widgets.Synchronizer.runAsyncMessages(Synchronizer.java:133)
at org.eclipse.swt.widgets.Display.runAsyncMessages(Display.java:3378)
at org.eclipse.swt.widgets.Display.readAndDispatch(Display.java:3036)
at org.eclipse.ui.internal.Workbench.runEventLoop(Workbench.java:2384)
at org.eclipse.ui.internal.Workbench.runUI(Workbench.java:2348)
at org.eclipse.ui.internal.Workbench.access$4(Workbench.java:2200)
at org.eclipse.ui.internal.Workbench$5.run(Workbench.java:495)
at org.eclipse.core.databinding.observable.Realm.runWithDefault(Realm.java:288)
at org.eclipse.ui.internal.Workbench.createAndRunWorkbench(Workbench.java:490)
at org.eclipse.ui.PlatformUI.createAndRunWorkbench(PlatformUI.java:149)
at org.eclipse.ui.internal.ide.application.IDEApplication.start(IDEApplication.java:113)
at org.eclipse.test.UITestApplication.runApplication(UITestApplication.java:138)
at org.eclipse.test.UITestApplication.run(UITestApplication.java:60)
at org.eclipse.test.UITestApplication.start(UITestApplication.java:210)
at org.eclipse.equinox.internal.app.EclipseAppHandle.run(EclipseAppHandle.java:193)
at org.eclipse.core.runtime.internal.adaptor.EclipseAppLauncher.runApplication(EclipseAppLauncher.java:110)
at org.eclipse.core.runtime.internal.adaptor.EclipseAppLauncher.start(EclipseAppLauncher.java:79)
at org.eclipse.core.runtime.adaptor.EclipseStarter.run(EclipseStarter.java:386)
at org.eclipse.core.runtime.adaptor.EclipseStarter.run(EclipseStarter.java:179)
at org.eclipse.equinox.launcher.Main.invokeFramework(Main.java:549)
at org.eclipse.equinox.launcher.Main.basicRun(Main.java:504)
at org.eclipse.equinox.launcher.Main.run(Main.java:1236)
at org.eclipse.equinox.launcher.Main.main(Main.java:1212)
at org.eclipse.core.launcher.Main.main(Main.java:30)
FAILED: JsfUiAllTests
Error Message:
null
Stack Trace:
java.lang.NullPointerException
at org.eclipse.jface.wizard.WizardDialog.updateButtons(WizardDialog.java:1247)
at org.jboss.tools.jst.web.ui.wizards.css.NewCSSClassWizard$NewCSSClassWizardPage$1.throwMessage(NewCSSClassWizard.java:166)
at org.jboss.tools.jst.jsp.outline.cssdialog.CSSClassDialog.notifyListeners(CSSClassDialog.java:778)
at org.jboss.tools.jst.jsp.outline.cssdialog.CSSClassDialog.access$10(CSSClassDialog.java:775)
at org.jboss.tools.jst.jsp.outline.cssdialog.CSSClassDialog$3.modifyText(CSSClassDialog.java:312)
at org.eclipse.swt.widgets.TypedListener.handleEvent(TypedListener.java:167)
at org.eclipse.swt.widgets.EventTable.sendEvent(EventTable.java:84)
at org.eclipse.swt.widgets.Widget.sendEvent(Widget.java:1158)
at org.eclipse.swt.widgets.Widget.sendEvent(Widget.java:1182)
at org.eclipse.swt.widgets.Widget.sendEvent(Widget.java:1163)
at org.eclipse.swt.widgets.Text.setText(Text.java:1928)
at org.jboss.tools.jst.jsp.outline.cssdialog.CSSClassDialog.initCSSModel(CSSClassDialog.java:560)
at org.jboss.tools.jst.jsp.outline.cssdialog.CSSClassDialog.createDialogComposite(CSSClassDialog.java:274)
at org.jboss.tools.jst.jsp.outline.cssdialog.CSSClassDialog.createDialogArea(CSSClassDialog.java:188)
at org.jboss.tools.jst.jsp.outline.cssdialog.CSSClassDialog.createDialog(CSSClassDialog.java:193)
at org.jboss.tools.jst.web.ui.wizards.css.NewCSSClassWizard$NewCSSClassWizardPage.createControl(NewCSSClassWizard.java:171)
at org.eclipse.jface.wizard.Wizard.createPageControls(Wizard.java:170)
at org.eclipse.jface.wizard.WizardDialog.createPageControls(WizardDialog.java:669)
at org.eclipse.jface.wizard.WizardDialog.createContents(WizardDialog.java:543)
at org.eclipse.jface.window.Window.create(Window.java:431)
at org.eclipse.jface.dialogs.Dialog.create(Dialog.java:1089)
at org.eclipse.jface.window.Window.open(Window.java:790)
at org.jboss.tools.jsf.ui.test.CssClassNewWizardTest.testCssClassEditing(CssClassNewWizardTest.java:81)
at junit.extensions.TestDecorator.basicRun(TestDecorator.java:24)
at junit.extensions.TestSetup$1.protect(TestSetup.java:21)
at junit.extensions.TestSetup.run(TestSetup.java:25)
at org.eclipse.test.EclipseTestRunner.run(EclipseTestRunner.java:354)
at org.eclipse.test.EclipseTestRunner.run(EclipseTestRunner.java:206)
at org.eclipse.test.UITestApplication$3.run(UITestApplication.java:195)
at org.eclipse.swt.widgets.RunnableLock.run(RunnableLock.java:35)
at org.eclipse.swt.widgets.Synchronizer.runAsyncMessages(Synchronizer.java:133)
at org.eclipse.swt.widgets.Display.runAsyncMessages(Display.java:3378)
at org.eclipse.swt.widgets.Display.readAndDispatch(Display.java:3036)
at org.eclipse.ui.internal.Workbench.runEventLoop(Workbench.java:2384)
at org.eclipse.ui.internal.Workbench.runUI(Workbench.java:2348)
at org.eclipse.ui.internal.Workbench.access$4(Workbench.java:2200)
at org.eclipse.ui.internal.Workbench$5.run(Workbench.java:495)
at org.eclipse.core.databinding.observable.Realm.runWithDefault(Realm.java:288)
at org.eclipse.ui.internal.Workbench.createAndRunWorkbench(Workbench.java:490)
at org.eclipse.ui.PlatformUI.createAndRunWorkbench(PlatformUI.java:149)
at org.eclipse.ui.internal.ide.application.IDEApplication.start(IDEApplication.java:113)
at org.eclipse.test.UITestApplication.runApplication(UITestApplication.java:138)
at org.eclipse.test.UITestApplication.run(UITestApplication.java:60)
at org.eclipse.test.UITestApplication.start(UITestApplication.java:210)
at org.eclipse.equinox.internal.app.EclipseAppHandle.run(EclipseAppHandle.java:193)
at org.eclipse.core.runtime.internal.adaptor.EclipseAppLauncher.runApplication(EclipseAppLauncher.java:110)
at org.eclipse.core.runtime.internal.adaptor.EclipseAppLauncher.start(EclipseAppLauncher.java:79)
at org.eclipse.core.runtime.adaptor.EclipseStarter.run(EclipseStarter.java:386)
at org.eclipse.core.runtime.adaptor.EclipseStarter.run(EclipseStarter.java:179)
at org.eclipse.equinox.launcher.Main.invokeFramework(Main.java:549)
at org.eclipse.equinox.launcher.Main.basicRun(Main.java:504)
at org.eclipse.equinox.launcher.Main.run(Main.java:1236)
at org.eclipse.equinox.launcher.Main.main(Main.java:1212)
at org.eclipse.core.launcher.Main.main(Main.java:30)
FAILED: JsfUiAllTests
Error Message:
null
Stack Trace:
java.lang.NullPointerException
at org.eclipse.jface.wizard.WizardDialog.updateButtons(WizardDialog.java:1247)
at org.jboss.tools.jst.web.ui.wizards.css.NewCSSClassWizard$NewCSSClassWizardPage$1.throwMessage(NewCSSClassWizard.java:166)
at org.jboss.tools.jst.jsp.outline.cssdialog.CSSClassDialog.notifyListeners(CSSClassDialog.java:778)
at org.jboss.tools.jst.jsp.outline.cssdialog.CSSClassDialog.access$10(CSSClassDialog.java:775)
at org.jboss.tools.jst.jsp.outline.cssdialog.CSSClassDialog$3.modifyText(CSSClassDialog.java:312)
at org.eclipse.swt.widgets.TypedListener.handleEvent(TypedListener.java:167)
at org.eclipse.swt.widgets.EventTable.sendEvent(EventTable.java:84)
at org.eclipse.swt.widgets.Widget.sendEvent(Widget.java:1158)
at org.eclipse.swt.widgets.Widget.sendEvent(Widget.java:1182)
at org.eclipse.swt.widgets.Widget.sendEvent(Widget.java:1163)
at org.eclipse.swt.widgets.Text.setText(Text.java:1928)
at org.jboss.tools.jst.jsp.outline.cssdialog.CSSClassDialog.initCSSModel(CSSClassDialog.java:560)
at org.jboss.tools.jst.jsp.outline.cssdialog.CSSClassDialog.createDialogComposite(CSSClassDialog.java:274)
at org.jboss.tools.jst.jsp.outline.cssdialog.CSSClassDialog.createDialogArea(CSSClassDialog.java:188)
at org.jboss.tools.jst.jsp.outline.cssdialog.CSSClassDialog.createDialog(CSSClassDialog.java:193)
at org.jboss.tools.jst.web.ui.wizards.css.NewCSSClassWizard$NewCSSClassWizardPage.createControl(NewCSSClassWizard.java:171)
at org.eclipse.jface.wizard.Wizard.createPageControls(Wizard.java:170)
at org.eclipse.jface.wizard.WizardDialog.createPageControls(WizardDialog.java:669)
at org.eclipse.jface.wizard.WizardDialog.createContents(WizardDialog.java:543)
at org.eclipse.jface.window.Window.create(Window.java:431)
at org.eclipse.jface.dialogs.Dialog.create(Dialog.java:1089)
at org.eclipse.jface.window.Window.open(Window.java:790)
at org.jboss.tools.jsf.ui.test.CssClassNewWizardTest.testCssClassWithEditor(CssClassNewWizardTest.java:112)
at junit.extensions.TestDecorator.basicRun(TestDecorator.java:24)
at junit.extensions.TestSetup$1.protect(TestSetup.java:21)
at junit.extensions.TestSetup.run(TestSetup.java:25)
at org.eclipse.test.EclipseTestRunner.run(EclipseTestRunner.java:354)
at org.eclipse.test.EclipseTestRunner.run(EclipseTestRunner.java:206)
at org.eclipse.test.UITestApplication$3.run(UITestApplication.java:195)
at org.eclipse.swt.widgets.RunnableLock.run(RunnableLock.java:35)
at org.eclipse.swt.widgets.Synchronizer.runAsyncMessages(Synchronizer.java:133)
at org.eclipse.swt.widgets.Display.runAsyncMessages(Display.java:3378)
at org.eclipse.swt.widgets.Display.readAndDispatch(Display.java:3036)
at org.eclipse.ui.internal.Workbench.runEventLoop(Workbench.java:2384)
at org.eclipse.ui.internal.Workbench.runUI(Workbench.java:2348)
at org.eclipse.ui.internal.Workbench.access$4(Workbench.java:2200)
at org.eclipse.ui.internal.Workbench$5.run(Workbench.java:495)
at org.eclipse.core.databinding.observable.Realm.runWithDefault(Realm.java:288)
at org.eclipse.ui.internal.Workbench.createAndRunWorkbench(Workbench.java:490)
at org.eclipse.ui.PlatformUI.createAndRunWorkbench(PlatformUI.java:149)
at org.eclipse.ui.internal.ide.application.IDEApplication.start(IDEApplication.java:113)
at org.eclipse.test.UITestApplication.runApplication(UITestApplication.java:138)
at org.eclipse.test.UITestApplication.run(UITestApplication.java:60)
at org.eclipse.test.UITestApplication.start(UITestApplication.java:210)
at org.eclipse.equinox.internal.app.EclipseAppHandle.run(EclipseAppHandle.java:193)
at org.eclipse.core.runtime.internal.adaptor.EclipseAppLauncher.runApplication(EclipseAppLauncher.java:110)
at org.eclipse.core.runtime.internal.adaptor.EclipseAppLauncher.start(EclipseAppLauncher.java:79)
at org.eclipse.core.runtime.adaptor.EclipseStarter.run(EclipseStarter.java:386)
at org.eclipse.core.runtime.adaptor.EclipseStarter.run(EclipseStarter.java:179)
at org.eclipse.equinox.launcher.Main.invokeFramework(Main.java:549)
at org.eclipse.equinox.launcher.Main.basicRun(Main.java:504)
at org.eclipse.equinox.launcher.Main.run(Main.java:1236)
at org.eclipse.equinox.launcher.Main.main(Main.java:1212)
at org.eclipse.core.launcher.Main.main(Main.java:30)
FAILED: RichFacesAllTests
Error Message:
Size should be equals expected:<13> but was:<12>
Stack Trace:
junit.framework.AssertionFailedError: Size should be equals expected:<13> but was:<12>
at org.jboss.tools.jsf.vpe.richfaces.test.jbide.JBIDE1605Test.testJBIDE1605(JBIDE1605Test.java:75)
at junit.extensions.TestDecorator.basicRun(TestDecorator.java:24)
at junit.extensions.TestSetup$1.protect(TestSetup.java:21)
at junit.extensions.TestSetup.run(TestSetup.java:25)
at org.eclipse.test.EclipseTestRunner.run(EclipseTestRunner.java:354)
at org.eclipse.test.EclipseTestRunner.run(EclipseTestRunner.java:206)
at org.eclipse.test.UITestApplication$3.run(UITestApplication.java:195)
at org.eclipse.swt.widgets.RunnableLock.run(RunnableLock.java:35)
at org.eclipse.swt.widgets.Synchronizer.runAsyncMessages(Synchronizer.java:133)
at org.eclipse.swt.widgets.Display.runAsyncMessages(Display.java:3378)
at org.eclipse.swt.widgets.Display.readAndDispatch(Display.java:3036)
at org.eclipse.ui.internal.Workbench.runEventLoop(Workbench.java:2384)
at org.eclipse.ui.internal.Workbench.runUI(Workbench.java:2348)
at org.eclipse.ui.internal.Workbench.access$4(Workbench.java:2200)
at org.eclipse.ui.internal.Workbench$5.run(Workbench.java:495)
at org.eclipse.core.databinding.observable.Realm.runWithDefault(Realm.java:288)
at org.eclipse.ui.internal.Workbench.createAndRunWorkbench(Workbench.java:490)
at org.eclipse.ui.PlatformUI.createAndRunWorkbench(PlatformUI.java:149)
at org.eclipse.ui.internal.ide.application.IDEApplication.start(IDEApplication.java:113)
at org.eclipse.test.UITestApplication.runApplication(UITestApplication.java:138)
at org.eclipse.test.UITestApplication.run(UITestApplication.java:60)
at org.eclipse.test.UITestApplication.start(UITestApplication.java:210)
at org.eclipse.equinox.internal.app.EclipseAppHandle.run(EclipseAppHandle.java:193)
at org.eclipse.core.runtime.internal.adaptor.EclipseAppLauncher.runApplication(EclipseAppLauncher.java:110)
at org.eclipse.core.runtime.internal.adaptor.EclipseAppLauncher.start(EclipseAppLauncher.java:79)
at org.eclipse.core.runtime.adaptor.EclipseStarter.run(EclipseStarter.java:386)
at org.eclipse.core.runtime.adaptor.EclipseStarter.run(EclipseStarter.java:179)
at org.eclipse.equinox.launcher.Main.invokeFramework(Main.java:549)
at org.eclipse.equinox.launcher.Main.basicRun(Main.java:504)
at org.eclipse.equinox.launcher.Main.run(Main.java:1236)
at org.eclipse.equinox.launcher.Main.main(Main.java:1212)
at org.eclipse.core.launcher.Main.main(Main.java:30)
FAILED: RichFacesAllTests
Error Message:
string is"file:///qa/services/hudson/hudson_workspace/workspace/jbosstools-nightly-3.0.x/jbds-build/3.0.2.GA/200906181031/tests/eclipse/plugins/org.jboss.tools.jsf.vpe.richfaces_3.0.1.GA-N200906181031-H71/resources/pickList/arrow_remove.gif" but pattern is ".*resources/pickList/arrow_copy.gif"
Stack Trace:
junit.framework.AssertionFailedError: string is"file:///qa/services/hudson/hudson_workspace/workspace/jbosstools-nightly-3.0.x/jbds-build/3.0.2.GA/200906181031/tests/eclipse/plugins/org.jboss.tools.jsf.vpe.richfaces_3.0.1.GA-N200906181031-H71/resources/pickList/arrow_remove.gif" but pattern is ".*resources/pickList/arrow_copy.gif"
at org.jboss.tools.vpe.ui.test.ComponentContentTest.compareElements(ComponentContentTest.java:138)
at org.jboss.tools.vpe.ui.test.ComponentContentTest.performContentTest(ComponentContentTest.java:97)
at org.jboss.tools.jsf.vpe.richfaces.test.RichFacesComponentContentTest.testPickList(RichFacesComponentContentTest.java:247)
at junit.extensions.TestDecorator.basicRun(TestDecorator.java:24)
at junit.extensions.TestSetup$1.protect(TestSetup.java:21)
at junit.extensions.TestSetup.run(TestSetup.java:25)
at org.eclipse.test.EclipseTestRunner.run(EclipseTestRunner.java:354)
at org.eclipse.test.EclipseTestRunner.run(EclipseTestRunner.java:206)
at org.eclipse.test.UITestApplication$3.run(UITestApplication.java:195)
at org.eclipse.swt.widgets.RunnableLock.run(RunnableLock.java:35)
at org.eclipse.swt.widgets.Synchronizer.runAsyncMessages(Synchronizer.java:133)
at org.eclipse.swt.widgets.Display.runAsyncMessages(Display.java:3378)
at org.eclipse.swt.widgets.Display.readAndDispatch(Display.java:3036)
at org.eclipse.ui.internal.Workbench.runEventLoop(Workbench.java:2384)
at org.eclipse.ui.internal.Workbench.runUI(Workbench.java:2348)
at org.eclipse.ui.internal.Workbench.access$4(Workbench.java:2200)
at org.eclipse.ui.internal.Workbench$5.run(Workbench.java:495)
at org.eclipse.core.databinding.observable.Realm.runWithDefault(Realm.java:288)
at org.eclipse.ui.internal.Workbench.createAndRunWorkbench(Workbench.java:490)
at org.eclipse.ui.PlatformUI.createAndRunWorkbench(PlatformUI.java:149)
at org.eclipse.ui.internal.ide.application.IDEApplication.start(IDEApplication.java:113)
at org.eclipse.test.UITestApplication.runApplication(UITestApplication.java:138)
at org.eclipse.test.UITestApplication.run(UITestApplication.java:60)
at org.eclipse.test.UITestApplication.start(UITestApplication.java:210)
at org.eclipse.equinox.internal.app.EclipseAppHandle.run(EclipseAppHandle.java:193)
at org.eclipse.core.runtime.internal.adaptor.EclipseAppLauncher.runApplication(EclipseAppLauncher.java:110)
at org.eclipse.core.runtime.internal.adaptor.EclipseAppLauncher.start(EclipseAppLauncher.java:79)
at org.eclipse.core.runtime.adaptor.EclipseStarter.run(EclipseStarter.java:386)
at org.eclipse.core.runtime.adaptor.EclipseStarter.run(EclipseStarter.java:179)
at org.eclipse.equinox.launcher.Main.invokeFramework(Main.java:549)
at org.eclipse.equinox.launcher.Main.basicRun(Main.java:504)
at org.eclipse.equinox.launcher.Main.run(Main.java:1236)
at org.eclipse.equinox.launcher.Main.main(Main.java:1212)
at org.eclipse.core.launcher.Main.main(Main.java:30)
FAILED: JstJspAllTests
Error Message:
Proposal #{applicationScope} not found!
Stack Trace:
junit.framework.AssertionFailedError: Proposal #{applicationScope} not found!
at org.jboss.tools.jst.jsp.test.ca.ContentAssistantTestCase.checkProposals(ContentAssistantTestCase.java:86)
at org.jboss.tools.jst.jsp.test.ca.JsfJspJbide1813Test.testJsfJspJbide1813Test(JsfJspJbide1813Test.java:39)
at org.eclipse.test.EclipseTestRunner.run(EclipseTestRunner.java:354)
at org.eclipse.test.EclipseTestRunner.run(EclipseTestRunner.java:206)
at org.eclipse.test.UITestApplication$3.run(UITestApplication.java:195)
at org.eclipse.swt.widgets.RunnableLock.run(RunnableLock.java:35)
at org.eclipse.swt.widgets.Synchronizer.runAsyncMessages(Synchronizer.java:133)
at org.eclipse.swt.widgets.Display.runAsyncMessages(Display.java:3378)
at org.eclipse.swt.widgets.Display.readAndDispatch(Display.java:3036)
at org.eclipse.ui.internal.Workbench.runEventLoop(Workbench.java:2384)
at org.eclipse.ui.internal.Workbench.runUI(Workbench.java:2348)
at org.eclipse.ui.internal.Workbench.access$4(Workbench.java:2200)
at org.eclipse.ui.internal.Workbench$5.run(Workbench.java:495)
at org.eclipse.core.databinding.observable.Realm.runWithDefault(Realm.java:288)
at org.eclipse.ui.internal.Workbench.createAndRunWorkbench(Workbench.java:490)
at org.eclipse.ui.PlatformUI.createAndRunWorkbench(PlatformUI.java:149)
at org.eclipse.ui.internal.ide.application.IDEApplication.start(IDEApplication.java:113)
at org.eclipse.test.UITestApplication.runApplication(UITestApplication.java:138)
at org.eclipse.test.UITestApplication.run(UITestApplication.java:60)
at org.eclipse.test.UITestApplication.start(UITestApplication.java:210)
at org.eclipse.equinox.internal.app.EclipseAppHandle.run(EclipseAppHandle.java:193)
at org.eclipse.core.runtime.internal.adaptor.EclipseAppLauncher.runApplication(EclipseAppLauncher.java:110)
at org.eclipse.core.runtime.internal.adaptor.EclipseAppLauncher.start(EclipseAppLauncher.java:79)
at org.eclipse.core.runtime.adaptor.EclipseStarter.run(EclipseStarter.java:386)
at org.eclipse.core.runtime.adaptor.EclipseStarter.run(EclipseStarter.java:179)
at org.eclipse.equinox.launcher.Main.invokeFramework(Main.java:549)
at org.eclipse.equinox.launcher.Main.basicRun(Main.java:504)
at org.eclipse.equinox.launcher.Main.run(Main.java:1236)
at org.eclipse.equinox.launcher.Main.main(Main.java:1212)
at org.eclipse.core.launcher.Main.main(Main.java:30)
FAILED: JstJspAllTests
Error Message:
Content Assistant returned no proposals
Stack Trace:
junit.framework.AssertionFailedError: Content Assistant returned no proposals
at org.jboss.tools.jst.jsp.test.ca.ContentAssistantTestCase.checkProposals(ContentAssistantTestCase.java:79)
at org.jboss.tools.jst.jsp.test.ca.JsfJspJbide1807Test.testJsfJspJbide1807Test(JsfJspJbide1807Test.java:37)
at org.eclipse.test.EclipseTestRunner.run(EclipseTestRunner.java:354)
at org.eclipse.test.EclipseTestRunner.run(EclipseTestRunner.java:206)
at org.eclipse.test.UITestApplication$3.run(UITestApplication.java:195)
at org.eclipse.swt.widgets.RunnableLock.run(RunnableLock.java:35)
at org.eclipse.swt.widgets.Synchronizer.runAsyncMessages(Synchronizer.java:133)
at org.eclipse.swt.widgets.Display.runAsyncMessages(Display.java:3378)
at org.eclipse.swt.widgets.Display.readAndDispatch(Display.java:3036)
at org.eclipse.ui.internal.Workbench.runEventLoop(Workbench.java:2384)
at org.eclipse.ui.internal.Workbench.runUI(Workbench.java:2348)
at org.eclipse.ui.internal.Workbench.access$4(Workbench.java:2200)
at org.eclipse.ui.internal.Workbench$5.run(Workbench.java:495)
at org.eclipse.core.databinding.observable.Realm.runWithDefault(Realm.java:288)
at org.eclipse.ui.internal.Workbench.createAndRunWorkbench(Workbench.java:490)
at org.eclipse.ui.PlatformUI.createAndRunWorkbench(PlatformUI.java:149)
at org.eclipse.ui.internal.ide.application.IDEApplication.start(IDEApplication.java:113)
at org.eclipse.test.UITestApplication.runApplication(UITestApplication.java:138)
at org.eclipse.test.UITestApplication.run(UITestApplication.java:60)
at org.eclipse.test.UITestApplication.start(UITestApplication.java:210)
at org.eclipse.equinox.internal.app.EclipseAppHandle.run(EclipseAppHandle.java:193)
at org.eclipse.core.runtime.internal.adaptor.EclipseAppLauncher.runApplication(EclipseAppLauncher.java:110)
at org.eclipse.core.runtime.internal.adaptor.EclipseAppLauncher.start(EclipseAppLauncher.java:79)
at org.eclipse.core.runtime.adaptor.EclipseStarter.run(EclipseStarter.java:386)
at org.eclipse.core.runtime.adaptor.EclipseStarter.run(EclipseStarter.java:179)
at org.eclipse.equinox.launcher.Main.invokeFramework(Main.java:549)
at org.eclipse.equinox.launcher.Main.basicRun(Main.java:504)
at org.eclipse.equinox.launcher.Main.run(Main.java:1236)
at org.eclipse.equinox.launcher.Main.main(Main.java:1212)
at org.eclipse.core.launcher.Main.main(Main.java:30)
FAILED: JstJspAllTests
Error Message:
Content Assistant peturned no proposals for template paths.
Stack Trace:
junit.framework.AssertionFailedError: Content Assistant peturned no proposals for template paths.
at org.jboss.tools.jst.jsp.test.ca.JsfJspJbide2437Test.testJsfJspJbide2437(JsfJspJbide2437Test.java:72)
at org.eclipse.test.EclipseTestRunner.run(EclipseTestRunner.java:354)
at org.eclipse.test.EclipseTestRunner.run(EclipseTestRunner.java:206)
at org.eclipse.test.UITestApplication$3.run(UITestApplication.java:195)
at org.eclipse.swt.widgets.RunnableLock.run(RunnableLock.java:35)
at org.eclipse.swt.widgets.Synchronizer.runAsyncMessages(Synchronizer.java:133)
at org.eclipse.swt.widgets.Display.runAsyncMessages(Display.java:3378)
at org.eclipse.swt.widgets.Display.readAndDispatch(Display.java:3036)
at org.eclipse.ui.internal.Workbench.runEventLoop(Workbench.java:2384)
at org.eclipse.ui.internal.Workbench.runUI(Workbench.java:2348)
at org.eclipse.ui.internal.Workbench.access$4(Workbench.java:2200)
at org.eclipse.ui.internal.Workbench$5.run(Workbench.java:495)
at org.eclipse.core.databinding.observable.Realm.runWithDefault(Realm.java:288)
at org.eclipse.ui.internal.Workbench.createAndRunWorkbench(Workbench.java:490)
at org.eclipse.ui.PlatformUI.createAndRunWorkbench(PlatformUI.java:149)
at org.eclipse.ui.internal.ide.application.IDEApplication.start(IDEApplication.java:113)
at org.eclipse.test.UITestApplication.runApplication(UITestApplication.java:138)
at org.eclipse.test.UITestApplication.run(UITestApplication.java:60)
at org.eclipse.test.UITestApplication.start(UITestApplication.java:210)
at org.eclipse.equinox.internal.app.EclipseAppHandle.run(EclipseAppHandle.java:193)
at org.eclipse.core.runtime.internal.adaptor.EclipseAppLauncher.runApplication(EclipseAppLauncher.java:110)
at org.eclipse.core.runtime.internal.adaptor.EclipseAppLauncher.start(EclipseAppLauncher.java:79)
at org.eclipse.core.runtime.adaptor.EclipseStarter.run(EclipseStarter.java:386)
at org.eclipse.core.runtime.adaptor.EclipseStarter.run(EclipseStarter.java:179)
at org.eclipse.equinox.launcher.Main.invokeFramework(Main.java:549)
at org.eclipse.equinox.launcher.Main.basicRun(Main.java:504)
at org.eclipse.equinox.launcher.Main.run(Main.java:1236)
at org.eclipse.equinox.launcher.Main.main(Main.java:1212)
at org.eclipse.core.launcher.Main.main(Main.java:30)
FAILED: JstWebAllTests
Error Message:
TLD list does not contain expected TLD in XModel.
Stack Trace:
junit.framework.AssertionFailedError: TLD list does not contain expected TLD in XModel.
at org.jboss.tools.jst.web.test.WebContentAssistProviderTest.testTlds(WebContentAssistProviderTest.java:66)
at org.eclipse.test.EclipseTestRunner.run(EclipseTestRunner.java:354)
at org.eclipse.test.EclipseTestRunner.run(EclipseTestRunner.java:206)
at org.eclipse.test.UITestApplication$3.run(UITestApplication.java:195)
at org.eclipse.swt.widgets.RunnableLock.run(RunnableLock.java:35)
at org.eclipse.swt.widgets.Synchronizer.runAsyncMessages(Synchronizer.java:133)
at org.eclipse.swt.widgets.Display.runAsyncMessages(Display.java:3378)
at org.eclipse.swt.widgets.Display.readAndDispatch(Display.java:3036)
at org.eclipse.ui.internal.Workbench.runEventLoop(Workbench.java:2384)
at org.eclipse.ui.internal.Workbench.runUI(Workbench.java:2348)
at org.eclipse.ui.internal.Workbench.access$4(Workbench.java:2200)
at org.eclipse.ui.internal.Workbench$5.run(Workbench.java:495)
at org.eclipse.core.databinding.observable.Realm.runWithDefault(Realm.java:288)
at org.eclipse.ui.internal.Workbench.createAndRunWorkbench(Workbench.java:490)
at org.eclipse.ui.PlatformUI.createAndRunWorkbench(PlatformUI.java:149)
at org.eclipse.ui.internal.ide.application.IDEApplication.start(IDEApplication.java:113)
at org.eclipse.test.UITestApplication.runApplication(UITestApplication.java:138)
at org.eclipse.test.UITestApplication.run(UITestApplication.java:60)
at org.eclipse.test.UITestApplication.start(UITestApplication.java:210)
at org.eclipse.equinox.internal.app.EclipseAppHandle.run(EclipseAppHandle.java:193)
at org.eclipse.core.runtime.internal.adaptor.EclipseAppLauncher.runApplication(EclipseAppLauncher.java:110)
at org.eclipse.core.runtime.internal.adaptor.EclipseAppLauncher.start(EclipseAppLauncher.java:79)
at org.eclipse.core.runtime.adaptor.EclipseStarter.run(EclipseStarter.java:386)
at org.eclipse.core.runtime.adaptor.EclipseStarter.run(EclipseStarter.java:179)
at org.eclipse.equinox.launcher.Main.invokeFramework(Main.java:549)
at org.eclipse.equinox.launcher.Main.basicRun(Main.java:504)
at org.eclipse.equinox.launcher.Main.run(Main.java:1236)
at org.eclipse.equinox.launcher.Main.main(Main.java:1212)
at org.eclipse.core.launcher.Main.main(Main.java:30)
FAILED: JBossWSCoreAllTests
Error Message:
Error: Could not generate. (use --show-traces to see full traces) Error: com/sun/codemodel/JExpression
Stack Trace:
junit.framework.AssertionFailedError: Error: Could not generate. (use --show-traces to see full traces)
Error: com/sun/codemodel/JExpression
at org.jboss.tools.ws.core.test.command.JBossWSJavaFirstCommandTest.testWSProviderInvokeCommand(JBossWSJavaFirstCommandTest.java:142)
at org.eclipse.test.EclipseTestRunner.run(EclipseTestRunner.java:354)
at org.eclipse.test.EclipseTestRunner.run(EclipseTestRunner.java:206)
at org.eclipse.test.UITestApplication$3.run(UITestApplication.java:195)
at org.eclipse.swt.widgets.RunnableLock.run(RunnableLock.java:35)
at org.eclipse.swt.widgets.Synchronizer.runAsyncMessages(Synchronizer.java:133)
at org.eclipse.swt.widgets.Display.runAsyncMessages(Display.java:3378)
at org.eclipse.swt.widgets.Display.readAndDispatch(Display.java:3036)
at org.eclipse.ui.internal.Workbench.runEventLoop(Workbench.java:2384)
at org.eclipse.ui.internal.Workbench.runUI(Workbench.java:2348)
at org.eclipse.ui.internal.Workbench.access$4(Workbench.java:2200)
at org.eclipse.ui.internal.Workbench$5.run(Workbench.java:495)
at org.eclipse.core.databinding.observable.Realm.runWithDefault(Realm.java:288)
at org.eclipse.ui.internal.Workbench.createAndRunWorkbench(Workbench.java:490)
at org.eclipse.ui.PlatformUI.createAndRunWorkbench(PlatformUI.java:149)
at org.eclipse.ui.internal.ide.application.IDEApplication.start(IDEApplication.java:113)
at org.eclipse.test.UITestApplication.runApplication(UITestApplication.java:138)
at org.eclipse.test.UITestApplication.run(UITestApplication.java:60)
at org.eclipse.test.UITestApplication.start(UITestApplication.java:210)
at org.eclipse.equinox.internal.app.EclipseAppHandle.run(EclipseAppHandle.java:193)
at org.eclipse.core.runtime.internal.adaptor.EclipseAppLauncher.runApplication(EclipseAppLauncher.java:110)
at org.eclipse.core.runtime.internal.adaptor.EclipseAppLauncher.start(EclipseAppLauncher.java:79)
at org.eclipse.core.runtime.adaptor.EclipseStarter.run(EclipseStarter.java:386)
at org.eclipse.core.runtime.adaptor.EclipseStarter.run(EclipseStarter.java:179)
at org.eclipse.equinox.launcher.Main.invokeFramework(Main.java:549)
at org.eclipse.equinox.launcher.Main.basicRun(Main.java:504)
at org.eclipse.equinox.launcher.Main.run(Main.java:1236)
at org.eclipse.equinox.launcher.Main.main(Main.java:1212)
at org.eclipse.core.launcher.Main.main(Main.java:30)
FAILED: JBossWSCoreAllTests
Error Message:
Error: Could not generate. (use --show-traces to see full traces) Error: com/sun/codemodel/JExpression
Stack Trace:
junit.framework.AssertionFailedError: Error: Could not generate. (use --show-traces to see full traces)
Error: com/sun/codemodel/JExpression
at org.jboss.tools.ws.core.test.command.JBossWSJavaFirstCommandTest.testDeployResult(JBossWSJavaFirstCommandTest.java:170)
at org.eclipse.test.EclipseTestRunner.run(EclipseTestRunner.java:354)
at org.eclipse.test.EclipseTestRunner.run(EclipseTestRunner.java:206)
at org.eclipse.test.UITestApplication$3.run(UITestApplication.java:195)
at org.eclipse.swt.widgets.RunnableLock.run(RunnableLock.java:35)
at org.eclipse.swt.widgets.Synchronizer.runAsyncMessages(Synchronizer.java:133)
at org.eclipse.swt.widgets.Display.runAsyncMessages(Display.java:3378)
at org.eclipse.swt.widgets.Display.readAndDispatch(Display.java:3036)
at org.eclipse.ui.internal.Workbench.runEventLoop(Workbench.java:2384)
at org.eclipse.ui.internal.Workbench.runUI(Workbench.java:2348)
at org.eclipse.ui.internal.Workbench.access$4(Workbench.java:2200)
at org.eclipse.ui.internal.Workbench$5.run(Workbench.java:495)
at org.eclipse.core.databinding.observable.Realm.runWithDefault(Realm.java:288)
at org.eclipse.ui.internal.Workbench.createAndRunWorkbench(Workbench.java:490)
at org.eclipse.ui.PlatformUI.createAndRunWorkbench(PlatformUI.java:149)
at org.eclipse.ui.internal.ide.application.IDEApplication.start(IDEApplication.java:113)
at org.eclipse.test.UITestApplication.runApplication(UITestApplication.java:138)
at org.eclipse.test.UITestApplication.run(UITestApplication.java:60)
at org.eclipse.test.UITestApplication.start(UITestApplication.java:210)
at org.eclipse.equinox.internal.app.EclipseAppHandle.run(EclipseAppHandle.java:193)
at org.eclipse.core.runtime.internal.adaptor.EclipseAppLauncher.runApplication(EclipseAppLauncher.java:110)
at org.eclipse.core.runtime.internal.adaptor.EclipseAppLauncher.start(EclipseAppLauncher.java:79)
at org.eclipse.core.runtime.adaptor.EclipseStarter.run(EclipseStarter.java:386)
at org.eclipse.core.runtime.adaptor.EclipseStarter.run(EclipseStarter.java:179)
at org.eclipse.equinox.launcher.Main.invokeFramework(Main.java:549)
at org.eclipse.equinox.launcher.Main.basicRun(Main.java:504)
at org.eclipse.equinox.launcher.Main.run(Main.java:1236)
at org.eclipse.equinox.launcher.Main.main(Main.java:1212)
at org.eclipse.core.launcher.Main.main(Main.java:30)
FAILED: JBossWSCoreAllTests
Error Message:
Failed to generate implementation class
Stack Trace:
junit.framework.AssertionFailedError: Failed to generate implementation class
at org.jboss.tools.ws.core.test.command.JBossWSTopDownCommandTest.testDeployResult(JBossWSTopDownCommandTest.java:220)
at org.eclipse.test.EclipseTestRunner.run(EclipseTestRunner.java:354)
at org.eclipse.test.EclipseTestRunner.run(EclipseTestRunner.java:206)
at org.eclipse.test.UITestApplication$3.run(UITestApplication.java:195)
at org.eclipse.swt.widgets.RunnableLock.run(RunnableLock.java:35)
at org.eclipse.swt.widgets.Synchronizer.runAsyncMessages(Synchronizer.java:133)
at org.eclipse.swt.widgets.Display.runAsyncMessages(Display.java:3378)
at org.eclipse.swt.widgets.Display.readAndDispatch(Display.java:3036)
at org.eclipse.ui.internal.Workbench.runEventLoop(Workbench.java:2384)
at org.eclipse.ui.internal.Workbench.runUI(Workbench.java:2348)
at org.eclipse.ui.internal.Workbench.access$4(Workbench.java:2200)
at org.eclipse.ui.internal.Workbench$5.run(Workbench.java:495)
at org.eclipse.core.databinding.observable.Realm.runWithDefault(Realm.java:288)
at org.eclipse.ui.internal.Workbench.createAndRunWorkbench(Workbench.java:490)
at org.eclipse.ui.PlatformUI.createAndRunWorkbench(PlatformUI.java:149)
at org.eclipse.ui.internal.ide.application.IDEApplication.start(IDEApplication.java:113)
at org.eclipse.test.UITestApplication.runApplication(UITestApplication.java:138)
at org.eclipse.test.UITestApplication.run(UITestApplication.java:60)
at org.eclipse.test.UITestApplication.start(UITestApplication.java:210)
at org.eclipse.equinox.internal.app.EclipseAppHandle.run(EclipseAppHandle.java:193)
at org.eclipse.core.runtime.internal.adaptor.EclipseAppLauncher.runApplication(EclipseAppLauncher.java:110)
at org.eclipse.core.runtime.internal.adaptor.EclipseAppLauncher.start(EclipseAppLauncher.java:79)
at org.eclipse.core.runtime.adaptor.EclipseStarter.run(EclipseStarter.java:386)
at org.eclipse.core.runtime.adaptor.EclipseStarter.run(EclipseStarter.java:179)
at org.eclipse.equinox.launcher.Main.invokeFramework(Main.java:549)
at org.eclipse.equinox.launcher.Main.basicRun(Main.java:504)
at org.eclipse.equinox.launcher.Main.run(Main.java:1236)
at org.eclipse.equinox.launcher.Main.main(Main.java:1212)
at org.eclipse.core.launcher.Main.main(Main.java:30)
--------------------------------------------------
Changes:
[rob.stryker(a)jboss.com] JBIDE-4410 in branch
[rob.stryker(a)jboss.com] JBIDE-4505
[rob.stryker(a)jboss.com] JBIDE-4490 fixed in branch
--------------------------------------------------
Console log:
[...truncated 19612 lines...]
[jar] Building jar: /home/hudson/hudson_workspace/workspace/jbosstools-nightly-3.0.x/jbds-build/site/eclipse/plugins/org.jboss.tools.vpe.docbook_3.0.1.GA-N200906181031-H71.jar
[delete] Deleting 5 files from /home/hudson/hudson_workspace/workspace/jbosstools-nightly-3.0.x/jbds-build/site/eclipse/plugins/org.jboss.tools.vpe.docbook_3.0.1.GA-N200906181031-H71
[delete] Deleted 3 directories from /home/hudson/hudson_workspace/workspace/jbosstools-nightly-3.0.x/jbds-build/site/eclipse/plugins/org.jboss.tools.vpe.docbook_3.0.1.GA-N200906181031-H71
[jar] Building jar: /home/hudson/hudson_workspace/workspace/jbosstools-nightly-3.0.x/jbds-build/site/eclipse/plugins/org.jboss.tools.vpe.html_3.0.1.GA-N200906181031-H71.jar
[delete] Deleting 11 files from /home/hudson/hudson_workspace/workspace/jbosstools-nightly-3.0.x/jbds-build/site/eclipse/plugins/org.jboss.tools.vpe.html_3.0.1.GA-N200906181031-H71
[delete] Deleted 9 directories from /home/hudson/hudson_workspace/workspace/jbosstools-nightly-3.0.x/jbds-build/site/eclipse/plugins/org.jboss.tools.vpe.html_3.0.1.GA-N200906181031-H71
[jar] Building jar: /home/hudson/hudson_workspace/workspace/jbosstools-nightly-3.0.x/jbds-build/site/eclipse/plugins/org.jboss.tools.vpe.jsp_3.0.1.GA-N200906181031-H71.jar
[delete] Deleting 6 files from /home/hudson/hudson_workspace/workspace/jbosstools-nightly-3.0.x/jbds-build/site/eclipse/plugins/org.jboss.tools.vpe.jsp_3.0.1.GA-N200906181031-H71
[delete] Deleted 8 directories from /home/hudson/hudson_workspace/workspace/jbosstools-nightly-3.0.x/jbds-build/site/eclipse/plugins/org.jboss.tools.vpe.jsp_3.0.1.GA-N200906181031-H71
[jar] Building jar: /home/hudson/hudson_workspace/workspace/jbosstools-nightly-3.0.x/jbds-build/site/eclipse/plugins/org.jboss.tools.vpe.ui.palette_3.0.1.GA-N200906181031-H71.jar
[delete] Deleting 4 files from /home/hudson/hudson_workspace/workspace/jbosstools-nightly-3.0.x/jbds-build/site/eclipse/plugins/org.jboss.tools.vpe.ui.palette_3.0.1.GA-N200906181031-H71
[delete] Deleted 2 directories from /home/hudson/hudson_workspace/workspace/jbosstools-nightly-3.0.x/jbds-build/site/eclipse/plugins/org.jboss.tools.vpe.ui.palette_3.0.1.GA-N200906181031-H71
[jar] Building jar: /home/hudson/hudson_workspace/workspace/jbosstools-nightly-3.0.x/jbds-build/site/eclipse/plugins/org.jboss.tools.vpe_3.0.1.GA-N200906181031-H71.jar
[delete] Deleting 15 files from /home/hudson/hudson_workspace/workspace/jbosstools-nightly-3.0.x/jbds-build/site/eclipse/plugins/org.jboss.tools.vpe_3.0.1.GA-N200906181031-H71
[delete] Deleted 5 directories from /home/hudson/hudson_workspace/workspace/jbosstools-nightly-3.0.x/jbds-build/site/eclipse/plugins/org.jboss.tools.vpe_3.0.1.GA-N200906181031-H71
[jar] Building jar: /home/hudson/hudson_workspace/workspace/jbosstools-nightly-3.0.x/jbds-build/site/eclipse/plugins/org.jboss.tools.xulrunner_1.0.0.GA-N200906181031-H71.jar
[delete] Deleting 6 files from /home/hudson/hudson_workspace/workspace/jbosstools-nightly-3.0.x/jbds-build/site/eclipse/plugins/org.jboss.tools.xulrunner_1.0.0.GA-N200906181031-H71
[delete] Deleted 2 directories from /home/hudson/hudson_workspace/workspace/jbosstools-nightly-3.0.x/jbds-build/site/eclipse/plugins/org.jboss.tools.xulrunner_1.0.0.GA-N200906181031-H71
[jar] Building jar: /home/hudson/hudson_workspace/workspace/jbosstools-nightly-3.0.x/jbds-build/site/eclipse/plugins/org.mozilla.xpcom_1.8.1.3-20070904.jar
[delete] Deleting 2 files from /home/hudson/hudson_workspace/workspace/jbosstools-nightly-3.0.x/jbds-build/site/eclipse/plugins/org.mozilla.xpcom_1.8.1.3-20070904
[delete] Deleted 2 directories from /home/hudson/hudson_workspace/workspace/jbosstools-nightly-3.0.x/jbds-build/site/eclipse/plugins/org.mozilla.xpcom_1.8.1.3-20070904
[jar] Building jar: /home/hudson/hudson_workspace/workspace/jbosstools-nightly-3.0.x/jbds-build/site/eclipse/plugins/org.mozilla.xulrunner.carbon.macosx_1.8.1.3-20070904.jar
[delete] Deleting 298 files from /home/hudson/hudson_workspace/workspace/jbosstools-nightly-3.0.x/jbds-build/site/eclipse/plugins/org.mozilla.xulrunner.carbon.macosx_1.8.1.3-20070904
[delete] Deleted 42 directories from /home/hudson/hudson_workspace/workspace/jbosstools-nightly-3.0.x/jbds-build/site/eclipse/plugins/org.mozilla.xulrunner.carbon.macosx_1.8.1.3-20070904
[jar] Building jar: /home/hudson/hudson_workspace/workspace/jbosstools-nightly-3.0.x/jbds-build/site/eclipse/plugins/org.mozilla.xulrunner.gtk.linux.x86_1.8.1.3-20070904.jar
[delete] Deleting 292 files from /home/hudson/hudson_workspace/workspace/jbosstools-nightly-3.0.x/jbds-build/site/eclipse/plugins/org.mozilla.xulrunner.gtk.linux.x86_1.8.1.3-20070904
[delete] Deleted 22 directories from /home/hudson/hudson_workspace/workspace/jbosstools-nightly-3.0.x/jbds-build/site/eclipse/plugins/org.mozilla.xulrunner.gtk.linux.x86_1.8.1.3-20070904
[jar] Building jar: /home/hudson/hudson_workspace/workspace/jbosstools-nightly-3.0.x/jbds-build/site/eclipse/plugins/org.mozilla.xulrunner.gtk.linux.x86_64_1.8.1.4-20080112.jar
[delete] Deleting 379 files from /home/hudson/hudson_workspace/workspace/jbosstools-nightly-3.0.x/jbds-build/site/eclipse/plugins/org.mozilla.xulrunner.gtk.linux.x86_64_1.8.1.4-20080112
[delete] Deleted 24 directories from /home/hudson/hudson_workspace/workspace/jbosstools-nightly-3.0.x/jbds-build/site/eclipse/plugins/org.mozilla.xulrunner.gtk.linux.x86_64_1.8.1.4-20080112
[jar] Building jar: /home/hudson/hudson_workspace/workspace/jbosstools-nightly-3.0.x/jbds-build/site/eclipse/plugins/org.mozilla.xulrunner.win32.win32.x86_1.8.1.3-20070904.jar
[delete] Deleting 277 files from /home/hudson/hudson_workspace/workspace/jbosstools-nightly-3.0.x/jbds-build/site/eclipse/plugins/org.mozilla.xulrunner.win32.win32.x86_1.8.1.3-20070904
[delete] Deleted 19 directories from /home/hudson/hudson_workspace/workspace/jbosstools-nightly-3.0.x/jbds-build/site/eclipse/plugins/org.mozilla.xulrunner.win32.win32.x86_1.8.1.3-20070904
load.properties:
[echo] Getting version for 'jmx' builder to property 'jmx.versionTag' from /qa/services/hudson/hudson_workspace/workspace/jbosstools-nightly-3.0.x/org.jboss.ide.eclipse.releng/builders/product/versionTags/jbosstools/3.0.2.GA.tags
[echo]
[echo] jbds-jmx-filename=JMX-1.0.0.GA-N200906181031-H71.zip
[echo] jbds-jmx-nodeps-filename=JMX-nodeps-1.0.0.GA-N200906181031-H71.zip
[echo]
[echo] Getting version for 'examples' builder to property 'examples.versionTag' from /qa/services/hudson/hudson_workspace/workspace/jbosstools-nightly-3.0.x/org.jboss.ide.eclipse.releng/builders/product/versionTags/jbosstools/3.0.2.GA.tags
[echo]
[echo] jbds-examples-filename=JBossTools-Examples-1.0.0.GA-N200906181031-H71.zip
[echo] jbds-examples-nodeps-filename=JBossTools-Examples-nodeps-1.0.0.GA-N200906181031-H71.zip
[echo]
[echo] Getting version for 'drools-ide' builder to property 'drools-ide.versionTag' from /qa/services/hudson/hudson_workspace/workspace/jbosstools-nightly-3.0.x/org.jboss.ide.eclipse.releng/builders/product/versionTags/jbosstools/3.0.2.GA.tags
[echo]
[echo] jbds-drools-ide-filename=DroolsIDE-5.0.1.26597-FINAL-N200906181031-H71.zip
[echo] jbds-drools-ide-nodeps-filename=DroolsIDE-nodeps-5.0.1.26597-FINAL-N200906181031-H71.zip
[echo]
[echo] Getting version for 'archives' builder to property 'archives.versionTag' from /qa/services/hudson/hudson_workspace/workspace/jbosstools-nightly-3.0.x/org.jboss.ide.eclipse.releng/builders/product/versionTags/jbosstools/3.0.2.GA.tags
[echo]
[echo] jbds-archives-filename=JBossTools-Archives-3.0.1.GA-N200906181031-H71.zip
[echo] jbds-archives-nodeps-filename=JBossTools-Archives-nodeps-3.0.1.GA-N200906181031-H71.zip
[echo]
[echo] Getting version for 'xulrunner' builder to property 'xulrunner.versionTag' from /qa/services/hudson/hudson_workspace/workspace/jbosstools-nightly-3.0.x/org.jboss.ide.eclipse.releng/builders/product/versionTags/jbosstools/3.0.2.GA.tags
[echo]
[echo] jbds-xulrunner-win32-filename=XulRunner-win32-1.0.0.GA-N200906181031-H71.zip
[echo] jbds-xulrunner-win32-nodeps-filename=XulRunner-win32-nodeps-1.0.0.GA-N200906181031-H71.zip
[echo]
[echo] Getting version for 'xulrunner' builder to property 'xulrunner.versionTag' from /qa/services/hudson/hudson_workspace/workspace/jbosstools-nightly-3.0.x/org.jboss.ide.eclipse.releng/builders/product/versionTags/jbosstools/3.0.2.GA.tags
[echo]
[echo] jbds-xulrunner-linux-gtk-filename=XulRunner-linux-gtk-1.0.0.GA-N200906181031-H71.zip
[echo] jbds-xulrunner-linux-gtk-nodeps-filename=XulRunner-linux-gtk-nodeps-1.0.0.GA-N200906181031-H71.zip
[echo]
[echo] Getting version for 'richfaces' builder to property 'richfaces.versionTag' from /qa/services/hudson/hudson_workspace/workspace/jbosstools-nightly-3.0.x/org.jboss.ide.eclipse.releng/builders/product/versionTags/jbosstools/3.0.2.GA.tags
[echo]
[echo] jbds-richfaces-win32-filename=RichFaces-VPE-win32-3.0.1.GA-N200906181031-H71.zip
[echo] jbds-richfaces-win32-nodeps-filename=RichFaces-VPE-win32-nodeps-3.0.1.GA-N200906181031-H71.zip
[echo]
[echo] Getting version for 'richfaces' builder to property 'richfaces.versionTag' from /qa/services/hudson/hudson_workspace/workspace/jbosstools-nightly-3.0.x/org.jboss.ide.eclipse.releng/builders/product/versionTags/jbosstools/3.0.2.GA.tags
[echo]
[echo] jbds-richfaces-linux-gtk-filename=RichFaces-VPE-linux-gtk-3.0.1.GA-N200906181031-H71.zip
[echo] jbds-richfaces-linux-gtk-nodeps-filename=RichFaces-VPE-linux-gtk-nodeps-3.0.1.GA-N200906181031-H71.zip
[echo]
[echo] Getting version for 'jbpm-convert' builder to property 'jbpm-convert.versionTag' from /qa/services/hudson/hudson_workspace/workspace/jbosstools-nightly-3.0.x/org.jboss.ide.eclipse.releng/builders/product/versionTags/jbosstools/3.0.2.GA.tags
[echo]
[echo] jbds-jbpm-convert-filename=jBPM-Convert-1.0.0.GA-N200906181031-H71.zip
[echo] jbds-jbpm-convert-nodeps-filename=jBPM-Convert-nodeps-1.0.0.GA-N200906181031-H71.zip
[echo]
[echo] Getting version for 'freemarker' builder to property 'freemarker.versionTag' from /qa/services/hudson/hudson_workspace/workspace/jbosstools-nightly-3.0.x/org.jboss.ide.eclipse.releng/builders/product/versionTags/jbosstools/3.0.2.GA.tags
[echo]
[echo] jbds-freemarker-filename=FreeMarkerIDE-1.0.2.GA-N200906181031-H71.zip
[echo] jbds-freemarker-nodeps-filename=
[echo]
[echo] Getting version for 'hibernate-tools' builder to property 'hibernate-tools.versionTag' from /qa/services/hudson/hudson_workspace/workspace/jbosstools-nightly-3.0.x/org.jboss.ide.eclipse.releng/builders/product/versionTags/jbosstools/3.0.2.GA.tags
[echo]
[echo] jbds-hibernate-tools-filename=HibernateTools-3.2.4.GA-N200906181031-H71.zip
[echo] jbds-hibernate-tools-nodeps-filename=HibernateTools-nodeps-3.2.4.GA-N200906181031-H71.zip
[echo]
[echo] Getting version for 'struts' builder to property 'struts.versionTag' from /qa/services/hudson/hudson_workspace/workspace/jbosstools-nightly-3.0.x/org.jboss.ide.eclipse.releng/builders/product/versionTags/jbosstools/3.0.2.GA.tags
[echo]
[echo] jbds-struts-filename=StrutsTools-3.0.0.GA-N200906181031-H71.zip
[echo] jbds-struts-nodeps-filename=StrutsTools-nodeps-3.0.0.GA-N200906181031-H71.zip
[echo]
[echo] Getting version for 'jbpm' builder to property 'jbpm.versionTag' from /qa/services/hudson/hudson_workspace/workspace/jbosstools-nightly-3.0.x/org.jboss.ide.eclipse.releng/builders/product/versionTags/jbosstools/3.0.2.GA.tags
[echo]
[echo] jbds-jbpm-filename=jBPM-Designer-3.1.7.GA-N200906181031-H71.zip
[echo] jbds-jbpm-nodeps-filename=jBPM-Designer-nodeps-3.1.7.GA-N200906181031-H71.zip
[echo]
[echo] Getting version for 'as' builder to property 'as.versionTag' from /qa/services/hudson/hudson_workspace/workspace/jbosstools-nightly-3.0.x/org.jboss.ide.eclipse.releng/builders/product/versionTags/jbosstools/3.0.2.GA.tags
[echo]
[echo] jbds-as-filename=JBossAS-Tools-2.0.1.GA-N200906181031-H71.zip
[echo] jbds-as-nodeps-filename=JBossAS-Tools-nodeps-2.0.1.GA-N200906181031-H71.zip
[echo]
[echo] Getting version for 'seam' builder to property 'seam.versionTag' from /qa/services/hudson/hudson_workspace/workspace/jbosstools-nightly-3.0.x/org.jboss.ide.eclipse.releng/builders/product/versionTags/jbosstools/3.0.2.GA.tags
[echo]
[echo] jbds-seam-filename=SeamTools-3.0.1.GA-N200906181031-H71.zip
[echo] jbds-seam-nodeps-filename=SeamTools-nodeps-3.0.1.GA-N200906181031-H71.zip
[echo]
[echo] Getting version for 'esb' builder to property 'esb.versionTag' from /qa/services/hudson/hudson_workspace/workspace/jbosstools-nightly-3.0.x/org.jboss.ide.eclipse.releng/builders/product/versionTags/jbosstools/3.0.2.GA.tags
[echo]
[echo] jbds-esb-filename=JBossTools-ESB-1.1.1.GA-N200906181031-H71.zip
[echo] jbds-esb-nodeps-filename=JBossTools-ESB-nodeps-1.1.1.GA-N200906181031-H71.zip
[echo]
[echo] Getting version for 'ws' builder to property 'ws.versionTag' from /qa/services/hudson/hudson_workspace/workspace/jbosstools-nightly-3.0.x/org.jboss.ide.eclipse.releng/builders/product/versionTags/jbosstools/3.0.2.GA.tags
[echo]
[echo] jbds-ws-filename=JBossWS-Tools-1.0.1.GA-N200906181031-H71.zip
[echo] jbds-ws-nodeps-filename=JBossWS-Tools-nodeps-1.0.1.GA-N200906181031-H71.zip
[echo]
[echo] Getting version for 'birt' builder to property 'birt.versionTag' from /qa/services/hudson/hudson_workspace/workspace/jbosstools-nightly-3.0.x/org.jboss.ide.eclipse.releng/builders/product/versionTags/jbosstools/3.0.2.GA.tags
[echo]
[echo] jbds-birt-filename=JBossTools-BIRT-1.0.0.GA-N200906181031-H71.zip
[echo] jbds-birt-nodeps-filename=JBossTools-BIRT-nodeps-1.0.0.GA-N200906181031-H71.zip
[echo]
[echo] Getting version for 'portlet' builder to property 'portlet.versionTag' from /qa/services/hudson/hudson_workspace/workspace/jbosstools-nightly-3.0.x/org.jboss.ide.eclipse.releng/builders/product/versionTags/jbosstools/3.0.2.GA.tags
[echo]
[echo] jbds-portlet-filename=JBoss-Portlet-Tools-1.0.1.GA-N200906181031-H71.zip
[echo] jbds-portlet-nodeps-filename=JBoss-Portlet-Tools-nodeps-1.0.1.GA-N200906181031-H71.zip
[echo]
[echo] Getting version for 'smooks' builder to property 'smooks.versionTag' from /qa/services/hudson/hudson_workspace/workspace/jbosstools-nightly-3.0.x/org.jboss.ide.eclipse.releng/builders/product/versionTags/jbosstools/3.0.2.GA.tags
[echo]
[echo] jbds-smooks-filename=JBossTools-Smooks-1.0.0.GA-N200906181031-H71.zip
[echo] jbds-smooks-nodeps-filename=JBossTools-Smooks-nodeps-1.0.0.GA-N200906181031-H71.zip
[echo]
[echo] Getting version for 'tptp' builder to property 'tptp.versionTag' from /qa/services/hudson/hudson_workspace/workspace/jbosstools-nightly-3.0.x/org.jboss.ide.eclipse.releng/builders/product/versionTags/jbosstools/3.0.2.GA.tags
[echo]
[echo] jbds-tptp-filename=JBoss-TPTP-Tools-1.0.0.GA-N200906181031-H71.zip
[echo] jbds-tptp-nodeps-filename=JBoss-TPTP-Tools-nodeps-1.0.0.GA-N200906181031-H71.zip
[echo]
pack200:
[echo] Using /qa/tools/opt/x86_64/jdk1.6.0_11/jre/bin/pack200 to pack update site jars...
[mkdir] Created dir: /qa/services/hudson/hudson_workspace/workspace/jbosstools-nightly-3.0.x/org.jboss.ide.eclipse.releng/builders/product/updateSite/updateSitePackTmp/output
[mkdir] Created dir: /qa/services/hudson/hudson_workspace/workspace/jbosstools-nightly-3.0.x/org.jboss.ide.eclipse.releng/builders/product/updateSite/updateSitePackTmp/input
[echo] Zip update jars in /home/hudson/hudson_workspace/workspace/jbosstools-nightly-3.0.x/jbds-build/site to temporary Master zip (to avoid packing nested jars) ...
[zip] Building zip: /qa/services/hudson/hudson_workspace/workspace/jbosstools-nightly-3.0.x/org.jboss.ide.eclipse.releng/builders/product/updateSite/updateSitePackTmp/input/Master.zip
[exec] 112M updateSite/updateSitePackTmp/input/Master.zip
[echo] Pack jars ...
[echo] Run jarprocessor.pack200 using launcherjar = /home/hudson/hudson_workspace/workspace/jbosstools-nightly-3.0.x/jbds-build/clean-eclipse/eclipse/plugins/org.eclipse.equinox.launcher_1.0.101.R34x_v20081125.jar
[exec] 180M updateSite/updateSitePackTmp/output/Master.zip
[unzip] Expanding: /qa/services/hudson/hudson_workspace/workspace/jbosstools-nightly-3.0.x/org.jboss.ide.eclipse.releng/builders/product/updateSite/updateSitePackTmp/output/Master.zip into /home/hudson/hudson_workspace/workspace/jbosstools-nightly-3.0.x/jbds-build/site
[delete] Deleting directory /qa/services/hudson/hudson_workspace/workspace/jbosstools-nightly-3.0.x/org.jboss.ide.eclipse.releng/builders/product/updateSite/updateSitePackTmp
copy.site.rootfiles:
[echo] Build nightly jbosstools update site...
[copy] Copying 4 files to /home/hudson/hudson_workspace/workspace/jbosstools-nightly-3.0.x/jbds-build/site/eclipse
p2:
[echo] Run p2 metadata generator using launcherjar = /home/hudson/hudson_workspace/workspace/jbosstools-nightly-3.0.x/jbds-build/clean-eclipse/eclipse/plugins/org.eclipse.equinox.launcher_1.0.101.R34x_v20081125.jar
[p2] Generating metadata for /home/hudson/hudson_workspace/workspace/jbosstools-nightly-3.0.x/jbds-build/site/eclipse.
[p2] Generation completed with success [3 seconds].
build.metadata:
publish.site:
post-build:
publish.results:
send.notification.email:
[mail] Failed to initialise MIME mail: javax/mail/MessagingException
[mail] Sending email: JBossTools nightly build 3.0.2.GA-N200906181031-H71 results
[mail] Sent email with 0 attachments
publish.log:
init:
clean.all.subfolders:
BUILD SUCCESSFUL
Total time: 196 minutes 30 seconds
++ cd ../configs/jbds
++ zip build.log.zip build.log
updating: build.log (deflated 95%)
++ cd ../..
++ [[ '' == \l\o\c\a\l ]]
+++ cat /home/hudson/hudson_workspace/workspace/jbosstools-nightly-3.0.x/jbds-build/buildData.properties
+++ grep product.releaseNumber
+++ perl -ne 's/[\s\t]+product.releaseNumber=//g;print;'
++ version=3.0.2.GA
+++ cat /home/hudson/hudson_workspace/workspace/jbosstools-nightly-3.0.x/jbds-build/buildData.properties
+++ grep upload.to
+++ perl -ne 's/[\s\t]+upload.to=//g;print;'
++ builddir=nightly/3.0.2.GA/200906181031
+++ cat /home/hudson/hudson_workspace/workspace/jbosstools-nightly-3.0.x/jbds-build/buildData.properties
+++ grep product.buildDesc
+++ perl -ne 's/[\s\t]+product.buildDesc=//g; print;'
++ buildtype=nightly
+++ cat /home/hudson/hudson_workspace/workspace/jbosstools-nightly-3.0.x/jbds-build/buildData.properties
+++ grep product.releaseNumber
+++ perl -ne 's/[\s\t]+product.releaseNumber=//g; print;'
++ releaseNumber=3.0.2.GA
++ DESTINATION=jbossqa@download.jboss.org:/htdocs/jbosstools
++ scp -r /home/hudson/hudson_workspace/workspace/jbosstools-nightly-3.0.x/jbds-build/3.0.2.GA jbossqa@download.jboss.org:/htdocs/jbosstools/builds/nightly/
++ scp configs/jbds/build.log.zip jbossqa@download.jboss.org:/htdocs/jbosstools/builds/nightly/3.0.2.GA/200906181031/
++ scp /home/hudson/hudson_workspace/workspace/jbosstools-nightly-3.0.x/jbds-build/latestBuild.html jbossqa@download.jboss.org:/htdocs/jbosstools/builds/nightly/latestBuild-3.0.x.html
++ [[ -d /home/hudson/hudson_workspace/workspace/jbosstools-nightly-3.0.x/jbds-build/site/eclipse ]]
++ mkdir -p /home/hudson/hudson_workspace/workspace/jbosstools-nightly-3.0.x/jbds-build/site/nightly/3.0.x
++ mv /home/hudson/hudson_workspace/workspace/jbosstools-nightly-3.0.x/jbds-build/site/eclipse/artifacts.jar /home/hudson/hudson_workspace/workspace/jbosstools-nightly-3.0.x/jbds-build/site/eclipse/associateSites.xml /home/hudson/hudson_workspace/workspace/jbosstools-nightly-3.0.x/jbds-build/site/eclipse/content.jar /home/hudson/hudson_workspace/workspace/jbosstools-nightly-3.0.x/jbds-build/site/eclipse/features /home/hudson/hudson_workspace/workspace/jbosstools-nightly-3.0.x/jbds-build/site/eclipse/index.html /home/hudson/hudson_workspace/workspace/jbosstools-nightly-3.0.x/jbds-build/site/eclipse/plugins /home/hudson/hudson_workspace/workspace/jbosstools-nightly-3.0.x/jbds-build/site/eclipse/site.xml /home/hudson/hudson_workspace/workspace/jbosstools-nightly-3.0.x/jbds-build/site/eclipse/web /home/hudson/hudson_workspace/workspace/jbosstools-nightly-3.0.x/jbds-build/site/nightly/3.0.x
+++ find /home/hudson/hudson_workspace/workspace/jbosstools-nightly-3.0.x/jbds-build/site/nightly/3.0.x/features -name '*.jar'
++ [[ -n /home/hudson/hudson_workspace/workspace/jbosstools-nightly-3.0.x/jbds-build/site/nightly/3.0.x/features/org.jbpm.gd.jpdl.feature_3.1.7.GA-N200906181031-H71.jar
/home/hudson/hudson_workspace/workspace/jbosstools-nightly-3.0.x/jbds-build/site/nightly/3.0.x/features/org.jboss.tools.xulrunner.feature_1.8.1.3-20070904.jar
/home/hudson/hudson_workspace/workspace/jbosstools-nightly-3.0.x/jbds-build/site/nightly/3.0.x/features/org.jboss.tools.ws.feature_1.0.1.GA-N200906181031-H71.jar
/home/hudson/hudson_workspace/workspace/jbosstools-nightly-3.0.x/jbds-build/site/nightly/3.0.x/features/org.jboss.tools.tptp.feature_1.0.0.GA-N200906181031-H71.jar
/home/hudson/hudson_workspace/workspace/jbosstools-nightly-3.0.x/jbds-build/site/nightly/3.0.x/features/org.jboss.tools.struts_feature_3.0.0.GA-N200906181031-H71.jar
/home/hudson/hudson_workspace/workspace/jbosstools-nightly-3.0.x/jbds-build/site/nightly/3.0.x/features/org.jboss.tools.smooks.feature_1.0.0.GA-N200906181031-H71.jar
/home/hudson/hudson_workspace/workspace/jbosstools-nightly-3.0.x/jbds-build/site/nightly/3.0.x/features/org.jboss.tools.seam.feature_3.0.1.GA-N200906181031-H71.jar
/home/hudson/hudson_workspace/workspace/jbosstools-nightly-3.0.x/jbds-build/site/nightly/3.0.x/features/org.jboss.tools.richfaces.feature_3.0.1.GA-N200906181031-H71.jar
/home/hudson/hudson_workspace/workspace/jbosstools-nightly-3.0.x/jbds-build/site/nightly/3.0.x/features/org.jboss.tools.portlet.feature_1.0.1.GA-N200906181031-H71.jar
/home/hudson/hudson_workspace/workspace/jbosstools-nightly-3.0.x/jbds-build/site/nightly/3.0.x/features/org.jboss.tools.jmx.feature_1.0.0.GA-N200906181031-H71.jar
/home/hudson/hudson_workspace/workspace/jbosstools-nightly-3.0.x/jbds-build/site/nightly/3.0.x/features/org.jboss.tools.esb.feature_1.1.1.GA-N200906181031-H71.jar
/home/hudson/hudson_workspace/workspace/jbosstools-nightly-3.0.x/jbds-build/site/nightly/3.0.x/features/org.jboss.tools.birt.feature_1.0.0.GA-N200906181031-H71.jar
/home/hudson/hudson_workspace/workspace/jbosstools-nightly-3.0.x/jbds-build/site/nightly/3.0.x/features/org.jboss.tools.jbpm.convert.feature_1.0.0.GA-N200906181031-H71.jar
/home/hudson/hudson_workspace/workspace/jbosstools-nightly-3.0.x/jbds-build/site/nightly/3.0.x/features/org.jboss.ide.eclipse.as.feature_2.0.1.GA-N200906181031-H71.jar
/home/hudson/hudson_workspace/workspace/jbosstools-nightly-3.0.x/jbds-build/site/nightly/3.0.x/features/org.jboss.ide.eclipse.freemarker.feature_1.0.2.GA-N200906181031-H71.jar
/home/hudson/hudson_workspace/workspace/jbosstools-nightly-3.0.x/jbds-build/site/nightly/3.0.x/features/org.hibernate.eclipse.feature_3.2.4.GA-N200906181031-H71.jar
/home/hudson/hudson_workspace/workspace/jbosstools-nightly-3.0.x/jbds-build/site/nightly/3.0.x/features/org.guvnor.tools.feature_5.0.1.26597-FINAL-N200906181031-H71.jar
/home/hudson/hudson_workspace/workspace/jbosstools-nightly-3.0.x/jbds-build/site/nightly/3.0.x/features/org.jboss.ide.eclipse.archives.feature_3.0.1.GA-N200906181031-H71.jar
/home/hudson/hudson_workspace/workspace/jbosstools-nightly-3.0.x/jbds-build/site/nightly/3.0.x/features/org.drools.eclipse.feature_5.0.1.26597-FINAL-N200906181031-H71.jar
/home/hudson/hudson_workspace/workspace/jbosstools-nightly-3.0.x/jbds-build/site/nightly/3.0.x/features/org.drools.eclipse.task.feature_5.0.1.26597-FINAL-N200906181031-H71.jar
/home/hudson/hudson_workspace/workspace/jbosstools-nightly-3.0.x/jbds-build/site/nightly/3.0.x/features/org.jboss.tools.project.examples.feature_1.0.0.GA-N200906181031-H71.jar ]]
++ mkdir -p jbossqa@download.jboss.org:/htdocs/jbosstools/updates/nightly/
++ rsync -arz --delete /home/hudson/hudson_workspace/workspace/jbosstools-nightly-3.0.x/jbds-build/site/nightly/3.0.x jbossqa@download.jboss.org:/htdocs/jbosstools/updates/nightly/
Terminating xvnc
[jbosstools-nightly-3.0.x] $ vncserver -kill :16
Killing Xvnc process ID 21494
[jbosstools-nightly-3.0.x] $ bash -xe /tmp/hudson847681292728091287.sh
+ kill 21475
Recording test results
Recording Emma reports jbds-build/coverage.xml
Build was marked for publishing on https://hudson.jboss.org/hudson/
Email was triggered for: Unstable
Email was triggered for: Still Unstable
Trigger Unstable was overridden by another trigger and will not send an email.
There are 1 triggered emails.
Sending email for trigger: Still Unstable
--------------------------------------------------
15 years, 8 months
[Failure] jbosstools-nightly-3.1.0.M2 #274
by jboss-qa-internal@redhat.com
Public:
https://hudson.jboss.org/hudson//job/jbosstools-nightly-3.1.0.M2/274
https://hudson.jboss.org/hudson//job/jbosstools-nightly-3.1.0.M2/274/test...
https://hudson.jboss.org/hudson//job/jbosstools-nightly-3.1.0.M2/274/changes
https://hudson.jboss.org/hudson//job/jbosstools-nightly-3.1.0.M2/274/console
Internal:
http://hudson.qa.jboss.com/hudson/job/jbosstools-nightly-3.1.0.M2/274/
http://hudson.qa.jboss.com/hudson/job/jbosstools-nightly-3.1.0.M2/274//te...
http://hudson.qa.jboss.com/hudson/job/jbosstools-nightly-3.1.0.M2/274//ch...
http://hudson.qa.jboss.com/hudson/job/jbosstools-nightly-3.1.0.M2/274//co...
--------------------------------------------------
Failed Tests:
5 tests failed.
FAILED: org.drools.eclipse.AllTests
Error Message:
java.lang.Exception: Could not find plugin "org.drools.eclipse.test"
Stack Trace:
org.eclipse.test.EclipseTestRunner$TestFailedException: java.lang.Exception: Could not find plugin "org.drools.eclipse.test"
at org.eclipse.test.EclipseTestRunner.runFailed(EclipseTestRunner.java:288)
at org.eclipse.test.EclipseTestRunner.getTest(EclipseTestRunner.java:240)
at org.eclipse.test.EclipseTestRunner.<init>(EclipseTestRunner.java:220)
at org.eclipse.test.EclipseTestRunner.run(EclipseTestRunner.java:204)
at org.eclipse.test.UITestApplication$3.run(UITestApplication.java:195)
at org.eclipse.swt.widgets.RunnableLock.run(RunnableLock.java:35)
at org.eclipse.swt.widgets.Synchronizer.runAsyncMessages(Synchronizer.java:134)
at org.eclipse.swt.widgets.Display.runAsyncMessages(Display.java:3468)
at org.eclipse.swt.widgets.Display.readAndDispatch(Display.java:3115)
at org.eclipse.ui.internal.Workbench.runEventLoop(Workbench.java:2405)
at org.eclipse.ui.internal.Workbench.runUI(Workbench.java:2369)
at org.eclipse.ui.internal.Workbench.access$4(Workbench.java:2221)
at org.eclipse.ui.internal.Workbench$5.run(Workbench.java:500)
at org.eclipse.core.databinding.observable.Realm.runWithDefault(Realm.java:332)
at org.eclipse.ui.internal.Workbench.createAndRunWorkbench(Workbench.java:493)
at org.eclipse.ui.PlatformUI.createAndRunWorkbench(PlatformUI.java:149)
at org.eclipse.ui.internal.ide.application.IDEApplication.start(IDEApplication.java:113)
at org.eclipse.test.UITestApplication.runApplication(UITestApplication.java:138)
at org.eclipse.test.UITestApplication.run(UITestApplication.java:60)
at org.eclipse.test.UITestApplication.start(UITestApplication.java:210)
at org.eclipse.equinox.internal.app.EclipseAppHandle.run(EclipseAppHandle.java:194)
at org.eclipse.core.runtime.internal.adaptor.EclipseAppLauncher.runApplication(EclipseAppLauncher.java:110)
at org.eclipse.core.runtime.internal.adaptor.EclipseAppLauncher.start(EclipseAppLauncher.java:79)
at org.eclipse.core.runtime.adaptor.EclipseStarter.run(EclipseStarter.java:368)
at org.eclipse.core.runtime.adaptor.EclipseStarter.run(EclipseStarter.java:179)
at org.eclipse.equinox.launcher.Main.invokeFramework(Main.java:559)
at org.eclipse.equinox.launcher.Main.basicRun(Main.java:514)
at org.eclipse.equinox.launcher.Main.run(Main.java:1311)
at org.eclipse.equinox.launcher.Main.main(Main.java:1287)
at org.eclipse.core.launcher.Main.main(Main.java:34)
Caused by: java.lang.Exception: Could not find plugin "org.drools.eclipse.test"
at org.eclipse.test.EclipseTestRunner.loadSuiteClass(EclipseTestRunner.java:304)
at org.eclipse.test.EclipseTestRunner.getTest(EclipseTestRunner.java:237)
FAILED: ASTestSuite
Error Message:
null
Stack Trace:
junit.framework.AssertionFailedError
at org.jboss.ide.eclipse.as.test.publishing.JBIDE2512bTest.testJBIDE2512b(JBIDE2512bTest.java:48)
at org.eclipse.test.EclipseTestRunner.run(EclipseTestRunner.java:354)
at org.eclipse.test.EclipseTestRunner.run(EclipseTestRunner.java:206)
at org.eclipse.test.UITestApplication$3.run(UITestApplication.java:195)
at org.eclipse.swt.widgets.RunnableLock.run(RunnableLock.java:35)
at org.eclipse.swt.widgets.Synchronizer.runAsyncMessages(Synchronizer.java:134)
at org.eclipse.swt.widgets.Display.runAsyncMessages(Display.java:3468)
at org.eclipse.swt.widgets.Display.readAndDispatch(Display.java:3115)
at org.eclipse.ui.internal.Workbench.runEventLoop(Workbench.java:2405)
at org.eclipse.ui.internal.Workbench.runUI(Workbench.java:2369)
at org.eclipse.ui.internal.Workbench.access$4(Workbench.java:2221)
at org.eclipse.ui.internal.Workbench$5.run(Workbench.java:500)
at org.eclipse.core.databinding.observable.Realm.runWithDefault(Realm.java:332)
at org.eclipse.ui.internal.Workbench.createAndRunWorkbench(Workbench.java:493)
at org.eclipse.ui.PlatformUI.createAndRunWorkbench(PlatformUI.java:149)
at org.eclipse.ui.internal.ide.application.IDEApplication.start(IDEApplication.java:113)
at org.eclipse.test.UITestApplication.runApplication(UITestApplication.java:138)
at org.eclipse.test.UITestApplication.run(UITestApplication.java:60)
at org.eclipse.test.UITestApplication.start(UITestApplication.java:210)
at org.eclipse.equinox.internal.app.EclipseAppHandle.run(EclipseAppHandle.java:194)
at org.eclipse.core.runtime.internal.adaptor.EclipseAppLauncher.runApplication(EclipseAppLauncher.java:110)
at org.eclipse.core.runtime.internal.adaptor.EclipseAppLauncher.start(EclipseAppLauncher.java:79)
at org.eclipse.core.runtime.adaptor.EclipseStarter.run(EclipseStarter.java:368)
at org.eclipse.core.runtime.adaptor.EclipseStarter.run(EclipseStarter.java:179)
at org.eclipse.equinox.launcher.Main.invokeFramework(Main.java:559)
at org.eclipse.equinox.launcher.Main.basicRun(Main.java:514)
at org.eclipse.equinox.launcher.Main.run(Main.java:1311)
at org.eclipse.equinox.launcher.Main.main(Main.java:1287)
at org.eclipse.core.launcher.Main.main(Main.java:34)
FAILED: org.jboss.tools.jsf.vpe.jstl.test.JstlAllTests
Error Message:
java.lang.Exception: Could not find plugin "org.jboss.tools.jsf.vpe.jstl.test"
Stack Trace:
org.eclipse.test.EclipseTestRunner$TestFailedException: java.lang.Exception: Could not find plugin "org.jboss.tools.jsf.vpe.jstl.test"
at org.eclipse.test.EclipseTestRunner.runFailed(EclipseTestRunner.java:288)
at org.eclipse.test.EclipseTestRunner.getTest(EclipseTestRunner.java:240)
at org.eclipse.test.EclipseTestRunner.<init>(EclipseTestRunner.java:220)
at org.eclipse.test.EclipseTestRunner.run(EclipseTestRunner.java:204)
at org.eclipse.test.UITestApplication$3.run(UITestApplication.java:195)
at org.eclipse.swt.widgets.RunnableLock.run(RunnableLock.java:35)
at org.eclipse.swt.widgets.Synchronizer.runAsyncMessages(Synchronizer.java:134)
at org.eclipse.swt.widgets.Display.runAsyncMessages(Display.java:3468)
at org.eclipse.swt.widgets.Display.readAndDispatch(Display.java:3115)
at org.eclipse.ui.internal.Workbench.runEventLoop(Workbench.java:2405)
at org.eclipse.ui.internal.Workbench.runUI(Workbench.java:2369)
at org.eclipse.ui.internal.Workbench.access$4(Workbench.java:2221)
at org.eclipse.ui.internal.Workbench$5.run(Workbench.java:500)
at org.eclipse.core.databinding.observable.Realm.runWithDefault(Realm.java:332)
at org.eclipse.ui.internal.Workbench.createAndRunWorkbench(Workbench.java:493)
at org.eclipse.ui.PlatformUI.createAndRunWorkbench(PlatformUI.java:149)
at org.eclipse.ui.internal.ide.application.IDEApplication.start(IDEApplication.java:113)
at org.eclipse.test.UITestApplication.runApplication(UITestApplication.java:138)
at org.eclipse.test.UITestApplication.run(UITestApplication.java:60)
at org.eclipse.test.UITestApplication.start(UITestApplication.java:210)
at org.eclipse.equinox.internal.app.EclipseAppHandle.run(EclipseAppHandle.java:194)
at org.eclipse.core.runtime.internal.adaptor.EclipseAppLauncher.runApplication(EclipseAppLauncher.java:110)
at org.eclipse.core.runtime.internal.adaptor.EclipseAppLauncher.start(EclipseAppLauncher.java:79)
at org.eclipse.core.runtime.adaptor.EclipseStarter.run(EclipseStarter.java:368)
at org.eclipse.core.runtime.adaptor.EclipseStarter.run(EclipseStarter.java:179)
at org.eclipse.equinox.launcher.Main.invokeFramework(Main.java:559)
at org.eclipse.equinox.launcher.Main.basicRun(Main.java:514)
at org.eclipse.equinox.launcher.Main.run(Main.java:1311)
at org.eclipse.equinox.launcher.Main.main(Main.java:1287)
at org.eclipse.core.launcher.Main.main(Main.java:34)
Caused by: java.lang.Exception: Could not find plugin "org.jboss.tools.jsf.vpe.jstl.test"
at org.eclipse.test.EclipseTestRunner.loadSuiteClass(EclipseTestRunner.java:304)
at org.eclipse.test.EclipseTestRunner.getTest(EclipseTestRunner.java:237)
FAILED: SeamCoreAllTests
Error Message:
There should be the only one error marker in DuplicateComponent.java. expected:<1> but was:<0>
Stack Trace:
junit.framework.AssertionFailedError: There should be the only one error marker in DuplicateComponent.java. expected:<1> but was:<0>
at org.jboss.tools.seam.core.test.SeamValidatorsTest.testDuplicateComponents(SeamValidatorsTest.java:848)
at junit.extensions.TestDecorator.basicRun(TestDecorator.java:24)
at junit.extensions.TestSetup$1.protect(TestSetup.java:21)
at junit.extensions.TestSetup.run(TestSetup.java:25)
at org.eclipse.test.EclipseTestRunner.run(EclipseTestRunner.java:354)
at org.eclipse.test.EclipseTestRunner.run(EclipseTestRunner.java:206)
at org.eclipse.test.UITestApplication$3.run(UITestApplication.java:195)
at org.eclipse.swt.widgets.RunnableLock.run(RunnableLock.java:35)
at org.eclipse.swt.widgets.Synchronizer.runAsyncMessages(Synchronizer.java:134)
at org.eclipse.swt.widgets.Display.runAsyncMessages(Display.java:3468)
at org.eclipse.swt.widgets.Display.readAndDispatch(Display.java:3115)
at org.eclipse.ui.internal.Workbench.runEventLoop(Workbench.java:2405)
at org.eclipse.ui.internal.Workbench.runUI(Workbench.java:2369)
at org.eclipse.ui.internal.Workbench.access$4(Workbench.java:2221)
at org.eclipse.ui.internal.Workbench$5.run(Workbench.java:500)
at org.eclipse.core.databinding.observable.Realm.runWithDefault(Realm.java:332)
at org.eclipse.ui.internal.Workbench.createAndRunWorkbench(Workbench.java:493)
at org.eclipse.ui.PlatformUI.createAndRunWorkbench(PlatformUI.java:149)
at org.eclipse.ui.internal.ide.application.IDEApplication.start(IDEApplication.java:113)
at org.eclipse.test.UITestApplication.runApplication(UITestApplication.java:138)
at org.eclipse.test.UITestApplication.run(UITestApplication.java:60)
at org.eclipse.test.UITestApplication.start(UITestApplication.java:210)
at org.eclipse.equinox.internal.app.EclipseAppHandle.run(EclipseAppHandle.java:194)
at org.eclipse.core.runtime.internal.adaptor.EclipseAppLauncher.runApplication(EclipseAppLauncher.java:110)
at org.eclipse.core.runtime.internal.adaptor.EclipseAppLauncher.start(EclipseAppLauncher.java:79)
at org.eclipse.core.runtime.adaptor.EclipseStarter.run(EclipseStarter.java:368)
at org.eclipse.core.runtime.adaptor.EclipseStarter.run(EclipseStarter.java:179)
at org.eclipse.equinox.launcher.Main.invokeFramework(Main.java:559)
at org.eclipse.equinox.launcher.Main.basicRun(Main.java:514)
at org.eclipse.equinox.launcher.Main.run(Main.java:1311)
at org.eclipse.equinox.launcher.Main.main(Main.java:1287)
at org.eclipse.core.launcher.Main.main(Main.java:34)
FAILED: SeamCoreAllTests
Error Message:
Component org.jboss.seam.mail.mailSession does not have java declaration.
Stack Trace:
junit.framework.AssertionFailedError: Component org.jboss.seam.mail.mailSession does not have java declaration.
at org.jboss.tools.seam.core.test.refactoring.SeamComponentRefactoringTest.renameComponent(SeamComponentRefactoringTest.java:152)
at org.jboss.tools.seam.core.test.refactoring.SeamComponentRefactoringTest.testJBIDE4447(SeamComponentRefactoringTest.java:133)
at junit.extensions.TestDecorator.basicRun(TestDecorator.java:24)
at junit.extensions.TestSetup$1.protect(TestSetup.java:21)
at junit.extensions.TestSetup.run(TestSetup.java:25)
at org.eclipse.test.EclipseTestRunner.run(EclipseTestRunner.java:354)
at org.eclipse.test.EclipseTestRunner.run(EclipseTestRunner.java:206)
at org.eclipse.test.UITestApplication$3.run(UITestApplication.java:195)
at org.eclipse.swt.widgets.RunnableLock.run(RunnableLock.java:35)
at org.eclipse.swt.widgets.Synchronizer.runAsyncMessages(Synchronizer.java:134)
at org.eclipse.swt.widgets.Display.runAsyncMessages(Display.java:3468)
at org.eclipse.swt.widgets.Display.readAndDispatch(Display.java:3115)
at org.eclipse.ui.internal.Workbench.runEventLoop(Workbench.java:2405)
at org.eclipse.ui.internal.Workbench.runUI(Workbench.java:2369)
at org.eclipse.ui.internal.Workbench.access$4(Workbench.java:2221)
at org.eclipse.ui.internal.Workbench$5.run(Workbench.java:500)
at org.eclipse.core.databinding.observable.Realm.runWithDefault(Realm.java:332)
at org.eclipse.ui.internal.Workbench.createAndRunWorkbench(Workbench.java:493)
at org.eclipse.ui.PlatformUI.createAndRunWorkbench(PlatformUI.java:149)
at org.eclipse.ui.internal.ide.application.IDEApplication.start(IDEApplication.java:113)
at org.eclipse.test.UITestApplication.runApplication(UITestApplication.java:138)
at org.eclipse.test.UITestApplication.run(UITestApplication.java:60)
at org.eclipse.test.UITestApplication.start(UITestApplication.java:210)
at org.eclipse.equinox.internal.app.EclipseAppHandle.run(EclipseAppHandle.java:194)
at org.eclipse.core.runtime.internal.adaptor.EclipseAppLauncher.runApplication(EclipseAppLauncher.java:110)
at org.eclipse.core.runtime.internal.adaptor.EclipseAppLauncher.start(EclipseAppLauncher.java:79)
at org.eclipse.core.runtime.adaptor.EclipseStarter.run(EclipseStarter.java:368)
at org.eclipse.core.runtime.adaptor.EclipseStarter.run(EclipseStarter.java:179)
at org.eclipse.equinox.launcher.Main.invokeFramework(Main.java:559)
at org.eclipse.equinox.launcher.Main.basicRun(Main.java:514)
at org.eclipse.equinox.launcher.Main.run(Main.java:1311)
at org.eclipse.equinox.launcher.Main.main(Main.java:1287)
at org.eclipse.core.launcher.Main.main(Main.java:34)
--------------------------------------------------
Changes:
[vyemialyanchyk] https://jira.jboss.org/jira/browse/JBIDE-4499 - made model structure more clear (parent-child relations) and format code in one style
[dazarov] https://jira.jboss.org/jira/browse/JBIDE-4406
[rob.stryker(a)jboss.com] JBIDE-4410 in trunk
[dazarov] https://jira.jboss.org/jira/browse/JBIDE-4406
[rob.stryker(a)jboss.com] JBIDE-4507 - wrong suffix on standalone utility jars
[snjeza] https://jira.jboss.org/jira/browse/JBIDE-3874 Maven integration
[rob.stryker(a)jboss.com] JBIDE-4505
[Grid.Qian] JBDS-673: modify the pic's size
[rob.stryker(a)jboss.com] JBIDE-4504
[rob.stryker(a)jboss.com] JBIDE-4490 - action bug in opening xpath dialog
[Grid.Qian]
[DartPeng] JBIDE-4501
DONE
--------------------------------------------------
Console log:
[...truncated 184674 lines...]
[java] !MESSAGE The installable unit org.jboss.tools.jmx.ui.test.translated_host_properties is missing the filename property.
[java]
[java] !ENTRY org.eclipse.equinox.p2.directorywatcher 4 0 2009-06-18 13:01:48.634
[java] !MESSAGE The installable unit org.eclipse.test.performance.win32.translated_host_properties is missing the filename property.
[java]
[java] !ENTRY org.eclipse.equinox.p2.directorywatcher 4 0 2009-06-18 13:01:49.113
[java] !MESSAGE The installable unit org.jboss.tools.jmx.ui.test.translated_host_properties is missing the filename property.
[java]
[java] !ENTRY org.eclipse.equinox.p2.directorywatcher 4 0 2009-06-18 13:01:49.116
[java] !MESSAGE The installable unit org.eclipse.test.performance.win32.translated_host_properties is missing the filename property.
[java]
[java] !ENTRY org.eclipse.equinox.p2.directorywatcher 4 0 2009-06-18 13:01:51.086
[java] !MESSAGE The installable unit org.jboss.tools.jmx.ui.test.translated_host_properties is missing the filename property.
[java]
[java] !ENTRY org.eclipse.equinox.p2.directorywatcher 4 0 2009-06-18 13:01:51.089
[java] !MESSAGE The installable unit org.eclipse.test.performance.win32.translated_host_properties is missing the filename property.
[java]
[java] !ENTRY org.eclipse.equinox.p2.directorywatcher 4 0 2009-06-18 13:01:51.152
[java] !MESSAGE The installable unit org.jboss.tools.jmx.ui.test.translated_host_properties is missing the filename property.
[java]
[java] !ENTRY org.eclipse.equinox.p2.directorywatcher 4 0 2009-06-18 13:01:51.160
[java] !MESSAGE The installable unit org.eclipse.test.performance.win32.translated_host_properties is missing the filename property.
[java] EMMA: collecting runtime coverage data ...
[java] EMMA: runtime coverage data merged into [/qa/services/hudson/hudson_workspace/workspace/jbosstools-nightly-3.1.0.M2/jbds-build/3.1.0.M2/200906180912/tests/eclipse/coverage.ec] {in 9 ms}
[echo] Copy .log files to /home/hudson/hudson_workspace/workspace/jbosstools-nightly-3.1.0.M2/org.jboss.ide.eclipse.releng/../jvmerrors
[mkdir] Created dir: /home/hudson/hudson_workspace/workspace/jbosstools-nightly-3.1.0.M2/jbds-build/3.1.0.M2/200906180912/tests/test-results/emma-coverage
[merge] processing input files ...
[merge] 2 file(s) read and merged in 1903 ms
[merge] merged/compacted data written to [/qa/services/hudson/hudson_workspace/workspace/jbosstools-nightly-3.1.0.M2/jbds-build/3.1.0.M2/200906180912/tests/test-results/emma-coverage/coverage.es] {in 553 ms}
[report] processing input files ...
[report] 1 file(s) read and merged in 621 ms
[report] writing [xml] report to [/home/hudson/hudson_workspace/workspace/jbosstools-nightly-3.1.0.M2/jbds-build/coverage.xml] ...
[report] writing [html] report to [/home/hudson/hudson_workspace/workspace/jbosstools-nightly-3.1.0.M2/jbds-build/3.1.0.M2/200906180912/tests/test-results/emma-coverage/index.html] ...
append-test-log:
collect:
[junitreport] the file /home/hudson/hudson_workspace/workspace/jbosstools-nightly-3.1.0.M2/jbds-build/3.1.0.M2/200906180912/tests/eclipse/org.jboss.tools.jmx.core.JMXCoreAllTests-default.xml is empty.
[junitreport] This can be caused by the test JVM exiting unexpectedly
apply-stylesheet:
[style] Warning: the task name <style> is deprecated. Use <xslt> instead.
[style] Transforming into /home/hudson/hudson_workspace/workspace/jbosstools-nightly-3.1.0.M2/jbds-build/3.1.0.M2/200906180912/tests/test-results
[style] Processing /home/hudson/hudson_workspace/workspace/jbosstools-nightly-3.1.0.M2/jbds-build/3.1.0.M2/200906180912/tests/test-results/org.jboss.ide.eclipse.tests.xml to /home/hudson/hudson_workspace/workspace/jbosstools-nightly-3.1.0.M2/jbds-build/3.1.0.M2/200906180912/tests/test-results/org.jboss.ide.eclipse.tests.html
[style] Loading stylesheet /home/hudson/hudson_workspace/workspace/jbosstools-nightly-3.1.0.M2/org.jboss.ide.eclipse.releng/builders/tests/junit.xsl
[style] Warning: the task name <style> is deprecated. Use <xslt> instead.
[style] Transforming into /home/hudson/hudson_workspace/workspace/jbosstools-nightly-3.1.0.M2/jbds-build/3.1.0.M2/200906180912/tests/test-results
[style] Processing /home/hudson/hudson_workspace/workspace/jbosstools-nightly-3.1.0.M2/jbds-build/3.1.0.M2/200906180912/tests/test-results/org.jboss.ide.eclipse.tests.xml to /home/hudson/hudson_workspace/workspace/jbosstools-nightly-3.1.0.M2/jbds-build/3.1.0.M2/200906180912/tests/test-results/org.jboss.ide.eclipse.tests.properties
[style] Loading stylesheet /home/hudson/hudson_workspace/workspace/jbosstools-nightly-3.1.0.M2/org.jboss.ide.eclipse.releng/builders/tests/junit-properties.xsl
clean-test-eclipse:
[echo] Building JBossTools with build type 'build-results'
get.build.properties:
[echo] Getting version for 'jmx' builder to property 'jmx.versionTag' from /qa/services/hudson/hudson_workspace/workspace/jbosstools-nightly-3.1.0.M2/org.jboss.ide.eclipse.releng/builders/product/versionTags/jbosstools/3.1.0.M2.tags
[echo]
[echo] jbds-jmx-filename=JMX-1.1.0.M2-N200906180912-H274.zip
[echo] jbds-jmx-nodeps-filename=JMX-nodeps-1.1.0.M2-N200906180912-H274.zip
[echo]
[echo] Getting version for 'drools-ide' builder to property 'drools-ide.versionTag' from /qa/services/hudson/hudson_workspace/workspace/jbosstools-nightly-3.1.0.M2/org.jboss.ide.eclipse.releng/builders/product/versionTags/jbosstools/3.1.0.M2.tags
[echo]
[echo] jbds-drools-ide-filename=DroolsIDE-5.1.0.trunk-N200906180912-H274.zip
[echo] jbds-drools-ide-nodeps-filename=DroolsIDE-nodeps-5.1.0.trunk-N200906180912-H274.zip
[echo]
[loadfile] /home/hudson/hudson_workspace/workspace/jbosstools-nightly-3.1.0.M2/jbds-build/3.1.0.M2/200906180912/drools-ide/DroolsIDE-5.1.0.trunk-N200906180912-H274.zip.MD5 doesn't exist
[echo] Getting version for 'archives' builder to property 'archives.versionTag' from /qa/services/hudson/hudson_workspace/workspace/jbosstools-nightly-3.1.0.M2/org.jboss.ide.eclipse.releng/builders/product/versionTags/jbosstools/3.1.0.M2.tags
[echo]
[echo] jbds-archives-filename=JBossTools-Archives-3.1.0.M2-N200906180912-H274.zip
[echo] jbds-archives-nodeps-filename=JBossTools-Archives-nodeps-3.1.0.M2-N200906180912-H274.zip
[echo]
[echo] Getting version for 'xulrunner' builder to property 'xulrunner.versionTag' from /qa/services/hudson/hudson_workspace/workspace/jbosstools-nightly-3.1.0.M2/org.jboss.ide.eclipse.releng/builders/product/versionTags/jbosstools/3.1.0.M2.tags
[echo]
[echo] jbds-xulrunner-win32-filename=XulRunner-win32-1.0.0.GA-N200906180912-H274.zip
[echo] jbds-xulrunner-win32-nodeps-filename=XulRunner-win32-nodeps-1.0.0.GA-N200906180912-H274.zip
[echo]
[echo] Getting version for 'xulrunner' builder to property 'xulrunner.versionTag' from /qa/services/hudson/hudson_workspace/workspace/jbosstools-nightly-3.1.0.M2/org.jboss.ide.eclipse.releng/builders/product/versionTags/jbosstools/3.1.0.M2.tags
[echo]
[echo] jbds-xulrunner-linux-gtk-filename=XulRunner-linux-gtk-1.0.0.GA-N200906180912-H274.zip
[echo] jbds-xulrunner-linux-gtk-nodeps-filename=XulRunner-linux-gtk-nodeps-1.0.0.GA-N200906180912-H274.zip
[echo]
[echo] Getting version for 'xulrunner' builder to property 'xulrunner.versionTag' from /qa/services/hudson/hudson_workspace/workspace/jbosstools-nightly-3.1.0.M2/org.jboss.ide.eclipse.releng/builders/product/versionTags/jbosstools/3.1.0.M2.tags
[echo]
[echo] jbds-xulrunner-linux-gtk-x86_64-filename=XulRunner-linux-gtk-x86_64-1.0.0.GA-N200906180912-H274.zip
[echo] jbds-xulrunner-linux-gtk-x86_64-nodeps-filename=XulRunner-linux-gtk-x86_64-nodeps-1.0.0.GA-N200906180912-H274.zip
[echo]
[echo] Getting version for 'xulrunner' builder to property 'xulrunner.versionTag' from /qa/services/hudson/hudson_workspace/workspace/jbosstools-nightly-3.1.0.M2/org.jboss.ide.eclipse.releng/builders/product/versionTags/jbosstools/3.1.0.M2.tags
[echo]
[echo] jbds-xulrunner-macosx-carbon-filename=XulRunner-macosx-carbon-1.0.0.GA-N200906180912-H274.zip
[echo] jbds-xulrunner-macosx-carbon-nodeps-filename=XulRunner-macosx-carbon-nodeps-1.0.0.GA-N200906180912-H274.zip
[echo]
[echo] Getting version for 'richfaces' builder to property 'richfaces.versionTag' from /qa/services/hudson/hudson_workspace/workspace/jbosstools-nightly-3.1.0.M2/org.jboss.ide.eclipse.releng/builders/product/versionTags/jbosstools/3.1.0.M2.tags
[echo]
[echo] jbds-richfaces-win32-filename=RichFaces-VPE-win32-3.1.0.M2-N200906180912-H274.zip
[echo] jbds-richfaces-win32-nodeps-filename=RichFaces-VPE-win32-nodeps-3.1.0.M2-N200906180912-H274.zip
[echo]
[echo] Getting version for 'richfaces' builder to property 'richfaces.versionTag' from /qa/services/hudson/hudson_workspace/workspace/jbosstools-nightly-3.1.0.M2/org.jboss.ide.eclipse.releng/builders/product/versionTags/jbosstools/3.1.0.M2.tags
[echo]
[echo] jbds-richfaces-linux-gtk-filename=RichFaces-VPE-linux-gtk-3.1.0.M2-N200906180912-H274.zip
[echo] jbds-richfaces-linux-gtk-nodeps-filename=RichFaces-VPE-linux-gtk-nodeps-3.1.0.M2-N200906180912-H274.zip
[echo]
[echo] Getting version for 'richfaces' builder to property 'richfaces.versionTag' from /qa/services/hudson/hudson_workspace/workspace/jbosstools-nightly-3.1.0.M2/org.jboss.ide.eclipse.releng/builders/product/versionTags/jbosstools/3.1.0.M2.tags
[echo]
[echo] jbds-richfaces-linux-gtk-x86_64-filename=RichFaces-VPE-linux-gtk-x86_64-3.1.0.M2-N200906180912-H274.zip
[echo] jbds-richfaces-linux-gtk-x86_64-nodeps-filename=RichFaces-VPE-linux-gtk-x86_64-nodeps-3.1.0.M2-N200906180912-H274.zip
[echo]
[echo] Getting version for 'richfaces' builder to property 'richfaces.versionTag' from /qa/services/hudson/hudson_workspace/workspace/jbosstools-nightly-3.1.0.M2/org.jboss.ide.eclipse.releng/builders/product/versionTags/jbosstools/3.1.0.M2.tags
[echo]
[echo] jbds-richfaces-macosx-carbon-filename=RichFaces-VPE-macosx-carbon-3.1.0.M2-N200906180912-H274.zip
[echo] jbds-richfaces-macosx-carbon-nodeps-filename=RichFaces-VPE-macosx-carbon-nodeps-3.1.0.M2-N200906180912-H274.zip
[echo]
[echo] Getting version for 'jbpm-convert' builder to property 'jbpm-convert.versionTag' from /qa/services/hudson/hudson_workspace/workspace/jbosstools-nightly-3.1.0.M2/org.jboss.ide.eclipse.releng/builders/product/versionTags/jbosstools/3.1.0.M2.tags
[echo]
[echo] jbds-jbpm-convert-filename=jBPM-Convert-1.1.0.M2-N200906180912-H274.zip
[echo] jbds-jbpm-convert-nodeps-filename=jBPM-Convert-nodeps-1.1.0.M2-N200906180912-H274.zip
[echo]
[echo] Getting version for 'freemarker' builder to property 'freemarker.versionTag' from /qa/services/hudson/hudson_workspace/workspace/jbosstools-nightly-3.1.0.M2/org.jboss.ide.eclipse.releng/builders/product/versionTags/jbosstools/3.1.0.M2.tags
[echo]
[echo] jbds-freemarker-filename=FreeMarkerIDE-1.1.0.M2-N200906180912-H274.zip
[echo] jbds-freemarker-nodeps-filename=
[echo]
[length] /home/hudson/hudson_workspace/workspace/jbosstools-nightly-3.1.0.M2/jbds-build/3.1.0.M2/200906180912/freemarker is a directory; length unspecified
[echo] Getting version for 'hibernate-tools' builder to property 'hibernate-tools.versionTag' from /qa/services/hudson/hudson_workspace/workspace/jbosstools-nightly-3.1.0.M2/org.jboss.ide.eclipse.releng/builders/product/versionTags/jbosstools/3.1.0.M2.tags
[echo]
[echo] jbds-hibernate-tools-filename=HibernateTools-3.3.0.M2-N200906180912-H274.zip
[echo] jbds-hibernate-tools-nodeps-filename=HibernateTools-nodeps-3.3.0.M2-N200906180912-H274.zip
[echo]
[echo] Getting version for 'struts' builder to property 'struts.versionTag' from /qa/services/hudson/hudson_workspace/workspace/jbosstools-nightly-3.1.0.M2/org.jboss.ide.eclipse.releng/builders/product/versionTags/jbosstools/3.1.0.M2.tags
[echo]
[echo] jbds-struts-filename=StrutsTools-3.1.0.M2-N200906180912-H274.zip
[echo] jbds-struts-nodeps-filename=StrutsTools-nodeps-3.1.0.M2-N200906180912-H274.zip
[echo]
[echo] Getting version for 'jbpm' builder to property 'jbpm.versionTag' from /qa/services/hudson/hudson_workspace/workspace/jbosstools-nightly-3.1.0.M2/org.jboss.ide.eclipse.releng/builders/product/versionTags/jbosstools/3.1.0.M2.tags
[echo]
[echo] jbds-jbpm-filename=jBPM-Designer-3.1.7.GA-N200906180912-H274.zip
[echo] jbds-jbpm-nodeps-filename=jBPM-Designer-nodeps-3.1.7.GA-N200906180912-H274.zip
[echo]
[echo] Getting version for 'as' builder to property 'as.versionTag' from /qa/services/hudson/hudson_workspace/workspace/jbosstools-nightly-3.1.0.M2/org.jboss.ide.eclipse.releng/builders/product/versionTags/jbosstools/3.1.0.M2.tags
[echo]
[echo] jbds-as-filename=JBossAS-Tools-2.1.0.M2-N200906180912-H274.zip
[echo] jbds-as-nodeps-filename=JBossAS-Tools-nodeps-2.1.0.M2-N200906180912-H274.zip
[echo]
[echo] Getting version for 'seam' builder to property 'seam.versionTag' from /qa/services/hudson/hudson_workspace/workspace/jbosstools-nightly-3.1.0.M2/org.jboss.ide.eclipse.releng/builders/product/versionTags/jbosstools/3.1.0.M2.tags
[echo]
[echo] jbds-seam-filename=SeamTools-3.1.0.M2-N200906180912-H274.zip
[echo] jbds-seam-nodeps-filename=SeamTools-nodeps-3.1.0.M2-N200906180912-H274.zip
[echo]
[echo] Getting version for 'examples' builder to property 'examples.versionTag' from /qa/services/hudson/hudson_workspace/workspace/jbosstools-nightly-3.1.0.M2/org.jboss.ide.eclipse.releng/builders/product/versionTags/jbosstools/3.1.0.M2.tags
[echo]
[echo] jbds-examples-filename=JBossTools-Examples-1.1.0.M2-N200906180912-H274.zip
[echo] jbds-examples-nodeps-filename=JBossTools-Examples-nodeps-1.1.0.M2-N200906180912-H274.zip
[echo]
[echo] Getting version for 'esb' builder to property 'esb.versionTag' from /qa/services/hudson/hudson_workspace/workspace/jbosstools-nightly-3.1.0.M2/org.jboss.ide.eclipse.releng/builders/product/versionTags/jbosstools/3.1.0.M2.tags
[echo]
[echo] jbds-esb-filename=JBossTools-ESB-1.3.0.M2-N200906180912-H274.zip
[echo] jbds-esb-nodeps-filename=JBossTools-ESB-nodeps-1.3.0.M2-N200906180912-H274.zip
[echo]
[echo] Getting version for 'ws' builder to property 'ws.versionTag' from /qa/services/hudson/hudson_workspace/workspace/jbosstools-nightly-3.1.0.M2/org.jboss.ide.eclipse.releng/builders/product/versionTags/jbosstools/3.1.0.M2.tags
[echo]
[echo] jbds-ws-filename=JBossWS-Tools-1.1.0.M2-N200906180912-H274.zip
[echo] jbds-ws-nodeps-filename=JBossWS-Tools-nodeps-1.1.0.M2-N200906180912-H274.zip
[echo]
[echo] Getting version for 'birt' builder to property 'birt.versionTag' from /qa/services/hudson/hudson_workspace/workspace/jbosstools-nightly-3.1.0.M2/org.jboss.ide.eclipse.releng/builders/product/versionTags/jbosstools/3.1.0.M2.tags
[echo]
[echo] jbds-birt-filename=JBossTools-BIRT-1.1.0.M2-N200906180912-H274.zip
[echo] jbds-birt-nodeps-filename=JBossTools-BIRT-nodeps-1.1.0.M2-N200906180912-H274.zip
[echo]
[echo] Getting version for 'portlet' builder to property 'portlet.versionTag' from /qa/services/hudson/hudson_workspace/workspace/jbosstools-nightly-3.1.0.M2/org.jboss.ide.eclipse.releng/builders/product/versionTags/jbosstools/3.1.0.M2.tags
[echo]
[echo] jbds-portlet-filename=JBoss-Portlet-Tools-1.1.0.M2-N200906180912-H274.zip
[echo] jbds-portlet-nodeps-filename=JBoss-Portlet-Tools-nodeps-1.1.0.M2-N200906180912-H274.zip
[echo]
[echo] Getting version for 'smooks' builder to property 'smooks.versionTag' from /qa/services/hudson/hudson_workspace/workspace/jbosstools-nightly-3.1.0.M2/org.jboss.ide.eclipse.releng/builders/product/versionTags/jbosstools/3.1.0.M2.tags
[echo]
[echo] jbds-smooks-filename=JBossTools-Smooks-1.1.0.M2-N200906180912-H274.zip
[echo] jbds-smooks-nodeps-filename=JBossTools-Smooks-nodeps-1.1.0.M2-N200906180912-H274.zip
[echo]
[echo] Getting version for 'tptp' builder to property 'tptp.versionTag' from /qa/services/hudson/hudson_workspace/workspace/jbosstools-nightly-3.1.0.M2/org.jboss.ide.eclipse.releng/builders/product/versionTags/jbosstools/3.1.0.M2.tags
[echo]
[echo] jbds-tptp-filename=JBoss-TPTP-Tools-1.1.0.M2-N200906180912-H274.zip
[echo] jbds-tptp-nodeps-filename=JBoss-TPTP-Tools-nodeps-1.1.0.M2-N200906180912-H274.zip
[echo]
[move] Moving 1 file to /home/hudson/hudson_workspace/workspace/jbosstools-nightly-3.1.0.M2/jbds-build/3.1.0.M2/200906180912/all
[loadfile] /home/hudson/hudson_workspace/workspace/jbosstools-nightly-3.1.0.M2/jbds-build/3.1.0.M2/200906180912/installer/build/jbdevstudio-win32-${installer.version.major}.${installer.version.minor}.${installer.version.revision}.${installer.version.tag}-N200906180912-H274.jar.MD5 doesn't exist
[loadfile] /home/hudson/hudson_workspace/workspace/jbosstools-nightly-3.1.0.M2/jbds-build/3.1.0.M2/200906180912/installer/build/jbdevstudio-linux-gtk-${installer.version.major}.${installer.version.minor}.${installer.version.revision}.${installer.version.tag}-N200906180912-H274.jar.MD5 doesn't exist
[loadfile] /home/hudson/hudson_workspace/workspace/jbosstools-nightly-3.1.0.M2/jbds-build/3.1.0.M2/200906180912/installer/build/jbdevstudio-linux-gtk-x86_64-${installer.version.major}.${installer.version.minor}.${installer.version.revision}.${installer.version.tag}-N200906180912-H274.jar.MD5 doesn't exist
[loadfile] /home/hudson/hudson_workspace/workspace/jbosstools-nightly-3.1.0.M2/jbds-build/3.1.0.M2/200906180912/installer/build/jbdevstudio-macosx-carbon-${installer.version.major}.${installer.version.minor}.${installer.version.revision}.${installer.version.tag}-N200906180912-H274.jar.MD5 doesn't exist
[loadfile] /home/hudson/hudson_workspace/workspace/jbosstools-nightly-3.1.0.M2/jbds-build/3.1.0.M2/200906180912/installer/build/jbdevstudio-eap-win32-${installer.version.major}.${installer.version.minor}.${installer.version.revision}.${installer.version.tag}-N200906180912-H274.jar.MD5 doesn't exist
[loadfile] /home/hudson/hudson_workspace/workspace/jbosstools-nightly-3.1.0.M2/jbds-build/3.1.0.M2/200906180912/installer/build/jbdevstudio-eap-linux-gtk-${installer.version.major}.${installer.version.minor}.${installer.version.revision}.${installer.version.tag}-N200906180912-H274.jar.MD5 doesn't exist
[loadfile] /home/hudson/hudson_workspace/workspace/jbosstools-nightly-3.1.0.M2/jbds-build/3.1.0.M2/200906180912/installer/build/jbdevstudio-eap-linux-gtk-x86_64-${installer.version.major}.${installer.version.minor}.${installer.version.revision}.${installer.version.tag}-N200906180912-H274.jar.MD5 doesn't exist
[loadfile] /home/hudson/hudson_workspace/workspace/jbosstools-nightly-3.1.0.M2/jbds-build/3.1.0.M2/200906180912/installer/build/jbdevstudio-eap-macosx-carbon-${installer.version.major}.${installer.version.minor}.${installer.version.revision}.${installer.version.tag}-N200906180912-H274.jar.MD5 doesn't exist
[stopwatch] [buildTimer: 217:25.014 sec]
analyze-log:
BUILD FAILED
/qa/services/hudson/hudson_workspace/workspace/jbosstools-nightly-3.1.0.M2/org.jboss.ide.eclipse.releng/builders/buildNightly.xml:12: The following error occurred while executing this line:
/qa/services/hudson/hudson_workspace/workspace/jbosstools-nightly-3.1.0.M2/org.jboss.ide.eclipse.releng/builders/build.xml:69: The following error occurred while executing this line:
/qa/services/hudson/hudson_workspace/workspace/jbosstools-nightly-3.1.0.M2/org.jboss.ide.eclipse.releng/builders/build.xml:27: The following error occurred while executing this line:
/qa/services/hudson/hudson_workspace/workspace/jbosstools-nightly-3.1.0.M2/org.jboss.ide.eclipse.releng/builders/build.xml:39: The following error occurred while executing this line:
/qa/services/hudson/hudson_workspace/workspace/jbosstools-nightly-3.1.0.M2/org.jboss.ide.eclipse.releng/builders/product/productBuild.xml:93: The following error occurred while executing this line:
/qa/services/hudson/hudson_workspace/workspace/jbosstools-nightly-3.1.0.M2/org.jboss.ide.eclipse.releng/builders/product/productBuild.xml:158: The following error occurred while executing this line:
/qa/services/hudson/hudson_workspace/workspace/jbosstools-nightly-3.1.0.M2/org.jboss.ide.eclipse.releng/builders/product/buildResults/buildResults.xml:279: The following error occurred while executing this line:
/qa/services/hudson/hudson_workspace/workspace/jbosstools-nightly-3.1.0.M2/org.jboss.ide.eclipse.releng/builders/product/buildResults/analyzeLog.xml:17: java.lang.NullPointerException
Total time: 222 minutes 0 seconds
++ cd ../configs/jbds
++ zip build.log.zip build.log
updating: build.log (deflated 95%)
++ cd ../..
+++ date +%s
++ endtime=1245344773
+++ echo 'scale=2; (1245344773 - 1245331343)/60'
+++ bc -l
++ elapsed=223.83
++ echo 'Elapsed time: 223.83mins.'
Elapsed time: 223.83mins.
++ [[ '' == \l\o\c\a\l ]]
+++ cat /home/hudson/hudson_workspace/workspace/jbosstools-nightly-3.1.0.M2/jbds-build/buildData.properties
+++ grep product.releaseNumber
+++ perl -ne 's/[\s\t]+product.releaseNumber=//g;print;'
++ version=3.1.0.M2
+++ grep upload.to
+++ perl -ne 's/[\s\t]+upload.to=//g;print;'
+++ cat /home/hudson/hudson_workspace/workspace/jbosstools-nightly-3.1.0.M2/jbds-build/buildData.properties
++ builddir=nightly/3.1.0.M2/200906180912
+++ cat /home/hudson/hudson_workspace/workspace/jbosstools-nightly-3.1.0.M2/jbds-build/buildData.properties
+++ grep product.buildDesc
+++ perl -ne 's/[\s\t]+product.buildDesc=//g; print;'
++ buildtype=nightly
+++ cat /home/hudson/hudson_workspace/workspace/jbosstools-nightly-3.1.0.M2/jbds-build/buildData.properties
+++ grep product.releaseNumber
+++ perl -ne 's/[\s\t]+product.releaseNumber=//g; print;'
++ releaseNumber=3.1.0.M2
++ DESTINATION=jbossqa@download.jboss.org:/htdocs/jbosstools
++ scp -r /home/hudson/hudson_workspace/workspace/jbosstools-nightly-3.1.0.M2/jbds-build/3.1.0.M2 jbossqa@download.jboss.org:/htdocs/jbosstools/builds/nightly/
++ scp configs/jbds/build.log.zip jbossqa@download.jboss.org:/htdocs/jbosstools/builds/nightly/3.1.0.M2/200906180912/
++ scp /home/hudson/hudson_workspace/workspace/jbosstools-nightly-3.1.0.M2/jbds-build/latestBuild.html jbossqa@download.jboss.org:/htdocs/jbosstools/builds/nightly/
/home/hudson/hudson_workspace/workspace/jbosstools-nightly-3.1.0.M2/jbds-build/latestBuild.html: No such file or directory
Terminating xvnc
[jbosstools-nightly-3.1.0.M2] $ vncserver -kill :14
Killing Xvnc process ID 13726
[jbosstools-nightly-3.1.0.M2] $ bash -xe /tmp/hudson4428146757600248676.sh
+ kill 13707
Recording test results
Recording Emma reports jbds-build/coverage.xml
Build was marked for publishing on https://hudson.jboss.org/hudson/
Email was triggered for: Failure
There are 1 triggered emails.
Sending email for trigger: Failure
--------------------------------------------------
15 years, 8 months
[Still Unstable] jbosstools-nightly-3.0.x #70
by jboss-qa-internal@redhat.com
Public:
https://hudson.jboss.org/hudson//job/jbosstools-nightly-3.0.x/70
https://hudson.jboss.org/hudson//job/jbosstools-nightly-3.0.x/70/testReport
https://hudson.jboss.org/hudson//job/jbosstools-nightly-3.0.x/70/changes
https://hudson.jboss.org/hudson//job/jbosstools-nightly-3.0.x/70/console
Internal:
http://hudson.qa.jboss.com/hudson/job/jbosstools-nightly-3.0.x/70/
http://hudson.qa.jboss.com/hudson/job/jbosstools-nightly-3.0.x/70//testRe...
http://hudson.qa.jboss.com/hudson/job/jbosstools-nightly-3.0.x/70//changes
http://hudson.qa.jboss.com/hudson/job/jbosstools-nightly-3.0.x/70//console
--------------------------------------------------
Failed Tests:
18 tests failed.
REGRESSION: JstJspAllTests
Error Message:
Content Assistant returned no proposals of type CustomCompletionProposal.
Stack Trace:
junit.framework.AssertionFailedError: Content Assistant returned no proposals of type CustomCompletionProposal.
at org.jboss.tools.jst.jsp.test.ca.JstJspJbide1759Test.testJstJspJbide1641(JstJspJbide1759Test.java:97)
at org.jboss.tools.jst.jsp.test.ca.JstJspJbide1759Test.testJstJspJbide1641(JstJspJbide1759Test.java:51)
at org.eclipse.test.EclipseTestRunner.run(EclipseTestRunner.java:354)
at org.eclipse.test.EclipseTestRunner.run(EclipseTestRunner.java:206)
at org.eclipse.test.UITestApplication$3.run(UITestApplication.java:195)
at org.eclipse.swt.widgets.RunnableLock.run(RunnableLock.java:35)
at org.eclipse.swt.widgets.Synchronizer.runAsyncMessages(Synchronizer.java:133)
at org.eclipse.swt.widgets.Display.runAsyncMessages(Display.java:3378)
at org.eclipse.swt.widgets.Display.readAndDispatch(Display.java:3036)
at org.eclipse.ui.internal.Workbench.runEventLoop(Workbench.java:2384)
at org.eclipse.ui.internal.Workbench.runUI(Workbench.java:2348)
at org.eclipse.ui.internal.Workbench.access$4(Workbench.java:2200)
at org.eclipse.ui.internal.Workbench$5.run(Workbench.java:495)
at org.eclipse.core.databinding.observable.Realm.runWithDefault(Realm.java:288)
at org.eclipse.ui.internal.Workbench.createAndRunWorkbench(Workbench.java:490)
at org.eclipse.ui.PlatformUI.createAndRunWorkbench(PlatformUI.java:149)
at org.eclipse.ui.internal.ide.application.IDEApplication.start(IDEApplication.java:113)
at org.eclipse.test.UITestApplication.runApplication(UITestApplication.java:138)
at org.eclipse.test.UITestApplication.run(UITestApplication.java:60)
at org.eclipse.test.UITestApplication.start(UITestApplication.java:210)
at org.eclipse.equinox.internal.app.EclipseAppHandle.run(EclipseAppHandle.java:193)
at org.eclipse.core.runtime.internal.adaptor.EclipseAppLauncher.runApplication(EclipseAppLauncher.java:110)
at org.eclipse.core.runtime.internal.adaptor.EclipseAppLauncher.start(EclipseAppLauncher.java:79)
at org.eclipse.core.runtime.adaptor.EclipseStarter.run(EclipseStarter.java:386)
at org.eclipse.core.runtime.adaptor.EclipseStarter.run(EclipseStarter.java:179)
at org.eclipse.equinox.launcher.Main.invokeFramework(Main.java:549)
at org.eclipse.equinox.launcher.Main.basicRun(Main.java:504)
at org.eclipse.equinox.launcher.Main.run(Main.java:1236)
at org.eclipse.equinox.launcher.Main.main(Main.java:1212)
at org.eclipse.core.launcher.Main.main(Main.java:30)
FAILED: ArchivesTestSuite
Error Message:
null
Stack Trace:
junit.framework.AssertionFailedError
at org.jboss.ide.eclipse.archives.test.projects.JBIDE2296Test.testJBIDE2311(JBIDE2296Test.java:45)
at org.eclipse.test.EclipseTestRunner.run(EclipseTestRunner.java:354)
at org.eclipse.test.EclipseTestRunner.run(EclipseTestRunner.java:206)
at org.eclipse.test.UITestApplication$3.run(UITestApplication.java:195)
at org.eclipse.swt.widgets.RunnableLock.run(RunnableLock.java:35)
at org.eclipse.swt.widgets.Synchronizer.runAsyncMessages(Synchronizer.java:133)
at org.eclipse.swt.widgets.Display.runAsyncMessages(Display.java:3378)
at org.eclipse.swt.widgets.Display.readAndDispatch(Display.java:3036)
at org.eclipse.ui.internal.Workbench.runEventLoop(Workbench.java:2384)
at org.eclipse.ui.internal.Workbench.runUI(Workbench.java:2348)
at org.eclipse.ui.internal.Workbench.access$4(Workbench.java:2200)
at org.eclipse.ui.internal.Workbench$5.run(Workbench.java:495)
at org.eclipse.core.databinding.observable.Realm.runWithDefault(Realm.java:288)
at org.eclipse.ui.internal.Workbench.createAndRunWorkbench(Workbench.java:490)
at org.eclipse.ui.PlatformUI.createAndRunWorkbench(PlatformUI.java:149)
at org.eclipse.ui.internal.ide.application.IDEApplication.start(IDEApplication.java:113)
at org.eclipse.test.UITestApplication.runApplication(UITestApplication.java:138)
at org.eclipse.test.UITestApplication.run(UITestApplication.java:60)
at org.eclipse.test.UITestApplication.start(UITestApplication.java:210)
at org.eclipse.equinox.internal.app.EclipseAppHandle.run(EclipseAppHandle.java:193)
at org.eclipse.core.runtime.internal.adaptor.EclipseAppLauncher.runApplication(EclipseAppLauncher.java:110)
at org.eclipse.core.runtime.internal.adaptor.EclipseAppLauncher.start(EclipseAppLauncher.java:79)
at org.eclipse.core.runtime.adaptor.EclipseStarter.run(EclipseStarter.java:386)
at org.eclipse.core.runtime.adaptor.EclipseStarter.run(EclipseStarter.java:179)
at org.eclipse.equinox.launcher.Main.invokeFramework(Main.java:549)
at org.eclipse.equinox.launcher.Main.basicRun(Main.java:504)
at org.eclipse.equinox.launcher.Main.run(Main.java:1236)
at org.eclipse.equinox.launcher.Main.main(Main.java:1212)
at org.eclipse.core.launcher.Main.main(Main.java:30)
FAILED: ASTestSuite
Error Message:
Neither vm install nor configuration is set - should not be able to validate expected:<0> but was:<4>
Stack Trace:
junit.framework.AssertionFailedError: Neither vm install nor configuration is set - should not be able to validate expected:<0> but was:<4>
at org.jboss.ide.eclipse.as.test.classpath.RuntimeServerModelTest.testCreateBrokenRuntime(RuntimeServerModelTest.java:68)
at org.eclipse.test.EclipseTestRunner.run(EclipseTestRunner.java:354)
at org.eclipse.test.EclipseTestRunner.run(EclipseTestRunner.java:206)
at org.eclipse.test.UITestApplication$3.run(UITestApplication.java:195)
at org.eclipse.swt.widgets.RunnableLock.run(RunnableLock.java:35)
at org.eclipse.swt.widgets.Synchronizer.runAsyncMessages(Synchronizer.java:133)
at org.eclipse.swt.widgets.Display.runAsyncMessages(Display.java:3378)
at org.eclipse.swt.widgets.Display.readAndDispatch(Display.java:3036)
at org.eclipse.ui.internal.Workbench.runEventLoop(Workbench.java:2384)
at org.eclipse.ui.internal.Workbench.runUI(Workbench.java:2348)
at org.eclipse.ui.internal.Workbench.access$4(Workbench.java:2200)
at org.eclipse.ui.internal.Workbench$5.run(Workbench.java:495)
at org.eclipse.core.databinding.observable.Realm.runWithDefault(Realm.java:288)
at org.eclipse.ui.internal.Workbench.createAndRunWorkbench(Workbench.java:490)
at org.eclipse.ui.PlatformUI.createAndRunWorkbench(PlatformUI.java:149)
at org.eclipse.ui.internal.ide.application.IDEApplication.start(IDEApplication.java:113)
at org.eclipse.test.UITestApplication.runApplication(UITestApplication.java:138)
at org.eclipse.test.UITestApplication.run(UITestApplication.java:60)
at org.eclipse.test.UITestApplication.start(UITestApplication.java:210)
at org.eclipse.equinox.internal.app.EclipseAppHandle.run(EclipseAppHandle.java:193)
at org.eclipse.core.runtime.internal.adaptor.EclipseAppLauncher.runApplication(EclipseAppLauncher.java:110)
at org.eclipse.core.runtime.internal.adaptor.EclipseAppLauncher.start(EclipseAppLauncher.java:79)
at org.eclipse.core.runtime.adaptor.EclipseStarter.run(EclipseStarter.java:386)
at org.eclipse.core.runtime.adaptor.EclipseStarter.run(EclipseStarter.java:179)
at org.eclipse.equinox.launcher.Main.invokeFramework(Main.java:549)
at org.eclipse.equinox.launcher.Main.basicRun(Main.java:504)
at org.eclipse.equinox.launcher.Main.run(Main.java:1236)
at org.eclipse.equinox.launcher.Main.main(Main.java:1212)
at org.eclipse.core.launcher.Main.main(Main.java:30)
FAILED: ASTestSuite
Error Message:
expected:<3> but was:<4>
Stack Trace:
junit.framework.AssertionFailedError: expected:<3> but was:<4>
at org.jboss.ide.eclipse.as.test.classpath.ProjectRuntimeTest.verifyPostRuntimeCPE(ProjectRuntimeTest.java:80)
at org.jboss.ide.eclipse.as.test.classpath.ProjectRuntimeTest.testProjectRuntime(ProjectRuntimeTest.java:64)
at org.eclipse.test.EclipseTestRunner.run(EclipseTestRunner.java:354)
at org.eclipse.test.EclipseTestRunner.run(EclipseTestRunner.java:206)
at org.eclipse.test.UITestApplication$3.run(UITestApplication.java:195)
at org.eclipse.swt.widgets.RunnableLock.run(RunnableLock.java:35)
at org.eclipse.swt.widgets.Synchronizer.runAsyncMessages(Synchronizer.java:133)
at org.eclipse.swt.widgets.Display.runAsyncMessages(Display.java:3378)
at org.eclipse.swt.widgets.Display.readAndDispatch(Display.java:3036)
at org.eclipse.ui.internal.Workbench.runEventLoop(Workbench.java:2384)
at org.eclipse.ui.internal.Workbench.runUI(Workbench.java:2348)
at org.eclipse.ui.internal.Workbench.access$4(Workbench.java:2200)
at org.eclipse.ui.internal.Workbench$5.run(Workbench.java:495)
at org.eclipse.core.databinding.observable.Realm.runWithDefault(Realm.java:288)
at org.eclipse.ui.internal.Workbench.createAndRunWorkbench(Workbench.java:490)
at org.eclipse.ui.PlatformUI.createAndRunWorkbench(PlatformUI.java:149)
at org.eclipse.ui.internal.ide.application.IDEApplication.start(IDEApplication.java:113)
at org.eclipse.test.UITestApplication.runApplication(UITestApplication.java:138)
at org.eclipse.test.UITestApplication.run(UITestApplication.java:60)
at org.eclipse.test.UITestApplication.start(UITestApplication.java:210)
at org.eclipse.equinox.internal.app.EclipseAppHandle.run(EclipseAppHandle.java:193)
at org.eclipse.core.runtime.internal.adaptor.EclipseAppLauncher.runApplication(EclipseAppLauncher.java:110)
at org.eclipse.core.runtime.internal.adaptor.EclipseAppLauncher.start(EclipseAppLauncher.java:79)
at org.eclipse.core.runtime.adaptor.EclipseStarter.run(EclipseStarter.java:386)
at org.eclipse.core.runtime.adaptor.EclipseStarter.run(EclipseStarter.java:179)
at org.eclipse.equinox.launcher.Main.invokeFramework(Main.java:549)
at org.eclipse.equinox.launcher.Main.basicRun(Main.java:504)
at org.eclipse.equinox.launcher.Main.run(Main.java:1236)
at org.eclipse.equinox.launcher.Main.main(Main.java:1212)
at org.eclipse.core.launcher.Main.main(Main.java:30)
FAILED: ASTestSuite
Error Message:
null
Stack Trace:
junit.framework.AssertionFailedError
at org.jboss.ide.eclipse.as.test.publishing.JBIDE2512aTest.testJBIDE2512a(JBIDE2512aTest.java:40)
at org.eclipse.test.EclipseTestRunner.run(EclipseTestRunner.java:354)
at org.eclipse.test.EclipseTestRunner.run(EclipseTestRunner.java:206)
at org.eclipse.test.UITestApplication$3.run(UITestApplication.java:195)
at org.eclipse.swt.widgets.RunnableLock.run(RunnableLock.java:35)
at org.eclipse.swt.widgets.Synchronizer.runAsyncMessages(Synchronizer.java:133)
at org.eclipse.swt.widgets.Display.runAsyncMessages(Display.java:3378)
at org.eclipse.swt.widgets.Display.readAndDispatch(Display.java:3036)
at org.eclipse.ui.internal.Workbench.runEventLoop(Workbench.java:2384)
at org.eclipse.ui.internal.Workbench.runUI(Workbench.java:2348)
at org.eclipse.ui.internal.Workbench.access$4(Workbench.java:2200)
at org.eclipse.ui.internal.Workbench$5.run(Workbench.java:495)
at org.eclipse.core.databinding.observable.Realm.runWithDefault(Realm.java:288)
at org.eclipse.ui.internal.Workbench.createAndRunWorkbench(Workbench.java:490)
at org.eclipse.ui.PlatformUI.createAndRunWorkbench(PlatformUI.java:149)
at org.eclipse.ui.internal.ide.application.IDEApplication.start(IDEApplication.java:113)
at org.eclipse.test.UITestApplication.runApplication(UITestApplication.java:138)
at org.eclipse.test.UITestApplication.run(UITestApplication.java:60)
at org.eclipse.test.UITestApplication.start(UITestApplication.java:210)
at org.eclipse.equinox.internal.app.EclipseAppHandle.run(EclipseAppHandle.java:193)
at org.eclipse.core.runtime.internal.adaptor.EclipseAppLauncher.runApplication(EclipseAppLauncher.java:110)
at org.eclipse.core.runtime.internal.adaptor.EclipseAppLauncher.start(EclipseAppLauncher.java:79)
at org.eclipse.core.runtime.adaptor.EclipseStarter.run(EclipseStarter.java:386)
at org.eclipse.core.runtime.adaptor.EclipseStarter.run(EclipseStarter.java:179)
at org.eclipse.equinox.launcher.Main.invokeFramework(Main.java:549)
at org.eclipse.equinox.launcher.Main.basicRun(Main.java:504)
at org.eclipse.equinox.launcher.Main.run(Main.java:1236)
at org.eclipse.equinox.launcher.Main.main(Main.java:1212)
at org.eclipse.core.launcher.Main.main(Main.java:30)
FAILED: ASTestSuite
Error Message:
null
Stack Trace:
junit.framework.AssertionFailedError
at org.jboss.ide.eclipse.as.test.publishing.JBIDE2512bTest.testJBIDE2512b(JBIDE2512bTest.java:37)
at org.eclipse.test.EclipseTestRunner.run(EclipseTestRunner.java:354)
at org.eclipse.test.EclipseTestRunner.run(EclipseTestRunner.java:206)
at org.eclipse.test.UITestApplication$3.run(UITestApplication.java:195)
at org.eclipse.swt.widgets.RunnableLock.run(RunnableLock.java:35)
at org.eclipse.swt.widgets.Synchronizer.runAsyncMessages(Synchronizer.java:133)
at org.eclipse.swt.widgets.Display.runAsyncMessages(Display.java:3378)
at org.eclipse.swt.widgets.Display.readAndDispatch(Display.java:3036)
at org.eclipse.ui.internal.Workbench.runEventLoop(Workbench.java:2384)
at org.eclipse.ui.internal.Workbench.runUI(Workbench.java:2348)
at org.eclipse.ui.internal.Workbench.access$4(Workbench.java:2200)
at org.eclipse.ui.internal.Workbench$5.run(Workbench.java:495)
at org.eclipse.core.databinding.observable.Realm.runWithDefault(Realm.java:288)
at org.eclipse.ui.internal.Workbench.createAndRunWorkbench(Workbench.java:490)
at org.eclipse.ui.PlatformUI.createAndRunWorkbench(PlatformUI.java:149)
at org.eclipse.ui.internal.ide.application.IDEApplication.start(IDEApplication.java:113)
at org.eclipse.test.UITestApplication.runApplication(UITestApplication.java:138)
at org.eclipse.test.UITestApplication.run(UITestApplication.java:60)
at org.eclipse.test.UITestApplication.start(UITestApplication.java:210)
at org.eclipse.equinox.internal.app.EclipseAppHandle.run(EclipseAppHandle.java:193)
at org.eclipse.core.runtime.internal.adaptor.EclipseAppLauncher.runApplication(EclipseAppLauncher.java:110)
at org.eclipse.core.runtime.internal.adaptor.EclipseAppLauncher.start(EclipseAppLauncher.java:79)
at org.eclipse.core.runtime.adaptor.EclipseStarter.run(EclipseStarter.java:386)
at org.eclipse.core.runtime.adaptor.EclipseStarter.run(EclipseStarter.java:179)
at org.eclipse.equinox.launcher.Main.invokeFramework(Main.java:549)
at org.eclipse.equinox.launcher.Main.basicRun(Main.java:504)
at org.eclipse.equinox.launcher.Main.run(Main.java:1236)
at org.eclipse.equinox.launcher.Main.main(Main.java:1212)
at org.eclipse.core.launcher.Main.main(Main.java:30)
FAILED: JsfUiAllTests
Error Message:
No tests found in org.jboss.tools.jsf.ui.preferences.JSFCapabilitiesPreferencesPage
Stack Trace:
junit.framework.AssertionFailedError: No tests found in org.jboss.tools.jsf.ui.preferences.JSFCapabilitiesPreferencesPage
at junit.extensions.TestDecorator.basicRun(TestDecorator.java:24)
at junit.extensions.TestSetup$1.protect(TestSetup.java:21)
at junit.extensions.TestSetup.run(TestSetup.java:25)
at org.eclipse.test.EclipseTestRunner.run(EclipseTestRunner.java:354)
at org.eclipse.test.EclipseTestRunner.run(EclipseTestRunner.java:206)
at org.eclipse.test.UITestApplication$3.run(UITestApplication.java:195)
at org.eclipse.swt.widgets.RunnableLock.run(RunnableLock.java:35)
at org.eclipse.swt.widgets.Synchronizer.runAsyncMessages(Synchronizer.java:133)
at org.eclipse.swt.widgets.Display.runAsyncMessages(Display.java:3378)
at org.eclipse.swt.widgets.Display.readAndDispatch(Display.java:3036)
at org.eclipse.ui.internal.Workbench.runEventLoop(Workbench.java:2384)
at org.eclipse.ui.internal.Workbench.runUI(Workbench.java:2348)
at org.eclipse.ui.internal.Workbench.access$4(Workbench.java:2200)
at org.eclipse.ui.internal.Workbench$5.run(Workbench.java:495)
at org.eclipse.core.databinding.observable.Realm.runWithDefault(Realm.java:288)
at org.eclipse.ui.internal.Workbench.createAndRunWorkbench(Workbench.java:490)
at org.eclipse.ui.PlatformUI.createAndRunWorkbench(PlatformUI.java:149)
at org.eclipse.ui.internal.ide.application.IDEApplication.start(IDEApplication.java:113)
at org.eclipse.test.UITestApplication.runApplication(UITestApplication.java:138)
at org.eclipse.test.UITestApplication.run(UITestApplication.java:60)
at org.eclipse.test.UITestApplication.start(UITestApplication.java:210)
at org.eclipse.equinox.internal.app.EclipseAppHandle.run(EclipseAppHandle.java:193)
at org.eclipse.core.runtime.internal.adaptor.EclipseAppLauncher.runApplication(EclipseAppLauncher.java:110)
at org.eclipse.core.runtime.internal.adaptor.EclipseAppLauncher.start(EclipseAppLauncher.java:79)
at org.eclipse.core.runtime.adaptor.EclipseStarter.run(EclipseStarter.java:386)
at org.eclipse.core.runtime.adaptor.EclipseStarter.run(EclipseStarter.java:179)
at org.eclipse.equinox.launcher.Main.invokeFramework(Main.java:549)
at org.eclipse.equinox.launcher.Main.basicRun(Main.java:504)
at org.eclipse.equinox.launcher.Main.run(Main.java:1236)
at org.eclipse.equinox.launcher.Main.main(Main.java:1212)
at org.eclipse.core.launcher.Main.main(Main.java:30)
FAILED: JsfUiAllTests
Error Message:
null
Stack Trace:
java.lang.NullPointerException
at org.eclipse.jface.wizard.WizardDialog.updateButtons(WizardDialog.java:1247)
at org.jboss.tools.jst.web.ui.wizards.css.NewCSSClassWizard$NewCSSClassWizardPage$1.throwMessage(NewCSSClassWizard.java:166)
at org.jboss.tools.jst.jsp.outline.cssdialog.CSSClassDialog.notifyListeners(CSSClassDialog.java:778)
at org.jboss.tools.jst.jsp.outline.cssdialog.CSSClassDialog.access$10(CSSClassDialog.java:775)
at org.jboss.tools.jst.jsp.outline.cssdialog.CSSClassDialog$3.modifyText(CSSClassDialog.java:312)
at org.eclipse.swt.widgets.TypedListener.handleEvent(TypedListener.java:167)
at org.eclipse.swt.widgets.EventTable.sendEvent(EventTable.java:84)
at org.eclipse.swt.widgets.Widget.sendEvent(Widget.java:1158)
at org.eclipse.swt.widgets.Widget.sendEvent(Widget.java:1182)
at org.eclipse.swt.widgets.Widget.sendEvent(Widget.java:1163)
at org.eclipse.swt.widgets.Text.setText(Text.java:1928)
at org.jboss.tools.jst.jsp.outline.cssdialog.CSSClassDialog.initCSSModel(CSSClassDialog.java:560)
at org.jboss.tools.jst.jsp.outline.cssdialog.CSSClassDialog.createDialogComposite(CSSClassDialog.java:274)
at org.jboss.tools.jst.jsp.outline.cssdialog.CSSClassDialog.createDialogArea(CSSClassDialog.java:188)
at org.jboss.tools.jst.jsp.outline.cssdialog.CSSClassDialog.createDialog(CSSClassDialog.java:193)
at org.jboss.tools.jst.web.ui.wizards.css.NewCSSClassWizard$NewCSSClassWizardPage.createControl(NewCSSClassWizard.java:171)
at org.eclipse.jface.wizard.Wizard.createPageControls(Wizard.java:170)
at org.eclipse.jface.wizard.WizardDialog.createPageControls(WizardDialog.java:669)
at org.eclipse.jface.wizard.WizardDialog.createContents(WizardDialog.java:543)
at org.eclipse.jface.window.Window.create(Window.java:431)
at org.eclipse.jface.dialogs.Dialog.create(Dialog.java:1089)
at org.eclipse.jface.window.Window.open(Window.java:790)
at org.jboss.tools.jsf.ui.test.CssClassNewWizardTest.testCssClassEditing(CssClassNewWizardTest.java:81)
at junit.extensions.TestDecorator.basicRun(TestDecorator.java:24)
at junit.extensions.TestSetup$1.protect(TestSetup.java:21)
at junit.extensions.TestSetup.run(TestSetup.java:25)
at org.eclipse.test.EclipseTestRunner.run(EclipseTestRunner.java:354)
at org.eclipse.test.EclipseTestRunner.run(EclipseTestRunner.java:206)
at org.eclipse.test.UITestApplication$3.run(UITestApplication.java:195)
at org.eclipse.swt.widgets.RunnableLock.run(RunnableLock.java:35)
at org.eclipse.swt.widgets.Synchronizer.runAsyncMessages(Synchronizer.java:133)
at org.eclipse.swt.widgets.Display.runAsyncMessages(Display.java:3378)
at org.eclipse.swt.widgets.Display.readAndDispatch(Display.java:3036)
at org.eclipse.ui.internal.Workbench.runEventLoop(Workbench.java:2384)
at org.eclipse.ui.internal.Workbench.runUI(Workbench.java:2348)
at org.eclipse.ui.internal.Workbench.access$4(Workbench.java:2200)
at org.eclipse.ui.internal.Workbench$5.run(Workbench.java:495)
at org.eclipse.core.databinding.observable.Realm.runWithDefault(Realm.java:288)
at org.eclipse.ui.internal.Workbench.createAndRunWorkbench(Workbench.java:490)
at org.eclipse.ui.PlatformUI.createAndRunWorkbench(PlatformUI.java:149)
at org.eclipse.ui.internal.ide.application.IDEApplication.start(IDEApplication.java:113)
at org.eclipse.test.UITestApplication.runApplication(UITestApplication.java:138)
at org.eclipse.test.UITestApplication.run(UITestApplication.java:60)
at org.eclipse.test.UITestApplication.start(UITestApplication.java:210)
at org.eclipse.equinox.internal.app.EclipseAppHandle.run(EclipseAppHandle.java:193)
at org.eclipse.core.runtime.internal.adaptor.EclipseAppLauncher.runApplication(EclipseAppLauncher.java:110)
at org.eclipse.core.runtime.internal.adaptor.EclipseAppLauncher.start(EclipseAppLauncher.java:79)
at org.eclipse.core.runtime.adaptor.EclipseStarter.run(EclipseStarter.java:386)
at org.eclipse.core.runtime.adaptor.EclipseStarter.run(EclipseStarter.java:179)
at org.eclipse.equinox.launcher.Main.invokeFramework(Main.java:549)
at org.eclipse.equinox.launcher.Main.basicRun(Main.java:504)
at org.eclipse.equinox.launcher.Main.run(Main.java:1236)
at org.eclipse.equinox.launcher.Main.main(Main.java:1212)
at org.eclipse.core.launcher.Main.main(Main.java:30)
FAILED: JsfUiAllTests
Error Message:
null
Stack Trace:
java.lang.NullPointerException
at org.eclipse.jface.wizard.WizardDialog.updateButtons(WizardDialog.java:1247)
at org.jboss.tools.jst.web.ui.wizards.css.NewCSSClassWizard$NewCSSClassWizardPage$1.throwMessage(NewCSSClassWizard.java:166)
at org.jboss.tools.jst.jsp.outline.cssdialog.CSSClassDialog.notifyListeners(CSSClassDialog.java:778)
at org.jboss.tools.jst.jsp.outline.cssdialog.CSSClassDialog.access$10(CSSClassDialog.java:775)
at org.jboss.tools.jst.jsp.outline.cssdialog.CSSClassDialog$3.modifyText(CSSClassDialog.java:312)
at org.eclipse.swt.widgets.TypedListener.handleEvent(TypedListener.java:167)
at org.eclipse.swt.widgets.EventTable.sendEvent(EventTable.java:84)
at org.eclipse.swt.widgets.Widget.sendEvent(Widget.java:1158)
at org.eclipse.swt.widgets.Widget.sendEvent(Widget.java:1182)
at org.eclipse.swt.widgets.Widget.sendEvent(Widget.java:1163)
at org.eclipse.swt.widgets.Text.setText(Text.java:1928)
at org.jboss.tools.jst.jsp.outline.cssdialog.CSSClassDialog.initCSSModel(CSSClassDialog.java:560)
at org.jboss.tools.jst.jsp.outline.cssdialog.CSSClassDialog.createDialogComposite(CSSClassDialog.java:274)
at org.jboss.tools.jst.jsp.outline.cssdialog.CSSClassDialog.createDialogArea(CSSClassDialog.java:188)
at org.jboss.tools.jst.jsp.outline.cssdialog.CSSClassDialog.createDialog(CSSClassDialog.java:193)
at org.jboss.tools.jst.web.ui.wizards.css.NewCSSClassWizard$NewCSSClassWizardPage.createControl(NewCSSClassWizard.java:171)
at org.eclipse.jface.wizard.Wizard.createPageControls(Wizard.java:170)
at org.eclipse.jface.wizard.WizardDialog.createPageControls(WizardDialog.java:669)
at org.eclipse.jface.wizard.WizardDialog.createContents(WizardDialog.java:543)
at org.eclipse.jface.window.Window.create(Window.java:431)
at org.eclipse.jface.dialogs.Dialog.create(Dialog.java:1089)
at org.eclipse.jface.window.Window.open(Window.java:790)
at org.jboss.tools.jsf.ui.test.CssClassNewWizardTest.testCssClassWithEditor(CssClassNewWizardTest.java:112)
at junit.extensions.TestDecorator.basicRun(TestDecorator.java:24)
at junit.extensions.TestSetup$1.protect(TestSetup.java:21)
at junit.extensions.TestSetup.run(TestSetup.java:25)
at org.eclipse.test.EclipseTestRunner.run(EclipseTestRunner.java:354)
at org.eclipse.test.EclipseTestRunner.run(EclipseTestRunner.java:206)
at org.eclipse.test.UITestApplication$3.run(UITestApplication.java:195)
at org.eclipse.swt.widgets.RunnableLock.run(RunnableLock.java:35)
at org.eclipse.swt.widgets.Synchronizer.runAsyncMessages(Synchronizer.java:133)
at org.eclipse.swt.widgets.Display.runAsyncMessages(Display.java:3378)
at org.eclipse.swt.widgets.Display.readAndDispatch(Display.java:3036)
at org.eclipse.ui.internal.Workbench.runEventLoop(Workbench.java:2384)
at org.eclipse.ui.internal.Workbench.runUI(Workbench.java:2348)
at org.eclipse.ui.internal.Workbench.access$4(Workbench.java:2200)
at org.eclipse.ui.internal.Workbench$5.run(Workbench.java:495)
at org.eclipse.core.databinding.observable.Realm.runWithDefault(Realm.java:288)
at org.eclipse.ui.internal.Workbench.createAndRunWorkbench(Workbench.java:490)
at org.eclipse.ui.PlatformUI.createAndRunWorkbench(PlatformUI.java:149)
at org.eclipse.ui.internal.ide.application.IDEApplication.start(IDEApplication.java:113)
at org.eclipse.test.UITestApplication.runApplication(UITestApplication.java:138)
at org.eclipse.test.UITestApplication.run(UITestApplication.java:60)
at org.eclipse.test.UITestApplication.start(UITestApplication.java:210)
at org.eclipse.equinox.internal.app.EclipseAppHandle.run(EclipseAppHandle.java:193)
at org.eclipse.core.runtime.internal.adaptor.EclipseAppLauncher.runApplication(EclipseAppLauncher.java:110)
at org.eclipse.core.runtime.internal.adaptor.EclipseAppLauncher.start(EclipseAppLauncher.java:79)
at org.eclipse.core.runtime.adaptor.EclipseStarter.run(EclipseStarter.java:386)
at org.eclipse.core.runtime.adaptor.EclipseStarter.run(EclipseStarter.java:179)
at org.eclipse.equinox.launcher.Main.invokeFramework(Main.java:549)
at org.eclipse.equinox.launcher.Main.basicRun(Main.java:504)
at org.eclipse.equinox.launcher.Main.run(Main.java:1236)
at org.eclipse.equinox.launcher.Main.main(Main.java:1212)
at org.eclipse.core.launcher.Main.main(Main.java:30)
FAILED: RichFacesAllTests
Error Message:
Size should be equals expected:<13> but was:<12>
Stack Trace:
junit.framework.AssertionFailedError: Size should be equals expected:<13> but was:<12>
at org.jboss.tools.jsf.vpe.richfaces.test.jbide.JBIDE1605Test.testJBIDE1605(JBIDE1605Test.java:75)
at junit.extensions.TestDecorator.basicRun(TestDecorator.java:24)
at junit.extensions.TestSetup$1.protect(TestSetup.java:21)
at junit.extensions.TestSetup.run(TestSetup.java:25)
at org.eclipse.test.EclipseTestRunner.run(EclipseTestRunner.java:354)
at org.eclipse.test.EclipseTestRunner.run(EclipseTestRunner.java:206)
at org.eclipse.test.UITestApplication$3.run(UITestApplication.java:195)
at org.eclipse.swt.widgets.RunnableLock.run(RunnableLock.java:35)
at org.eclipse.swt.widgets.Synchronizer.runAsyncMessages(Synchronizer.java:133)
at org.eclipse.swt.widgets.Display.runAsyncMessages(Display.java:3378)
at org.eclipse.swt.widgets.Display.readAndDispatch(Display.java:3036)
at org.eclipse.ui.internal.Workbench.runEventLoop(Workbench.java:2384)
at org.eclipse.ui.internal.Workbench.runUI(Workbench.java:2348)
at org.eclipse.ui.internal.Workbench.access$4(Workbench.java:2200)
at org.eclipse.ui.internal.Workbench$5.run(Workbench.java:495)
at org.eclipse.core.databinding.observable.Realm.runWithDefault(Realm.java:288)
at org.eclipse.ui.internal.Workbench.createAndRunWorkbench(Workbench.java:490)
at org.eclipse.ui.PlatformUI.createAndRunWorkbench(PlatformUI.java:149)
at org.eclipse.ui.internal.ide.application.IDEApplication.start(IDEApplication.java:113)
at org.eclipse.test.UITestApplication.runApplication(UITestApplication.java:138)
at org.eclipse.test.UITestApplication.run(UITestApplication.java:60)
at org.eclipse.test.UITestApplication.start(UITestApplication.java:210)
at org.eclipse.equinox.internal.app.EclipseAppHandle.run(EclipseAppHandle.java:193)
at org.eclipse.core.runtime.internal.adaptor.EclipseAppLauncher.runApplication(EclipseAppLauncher.java:110)
at org.eclipse.core.runtime.internal.adaptor.EclipseAppLauncher.start(EclipseAppLauncher.java:79)
at org.eclipse.core.runtime.adaptor.EclipseStarter.run(EclipseStarter.java:386)
at org.eclipse.core.runtime.adaptor.EclipseStarter.run(EclipseStarter.java:179)
at org.eclipse.equinox.launcher.Main.invokeFramework(Main.java:549)
at org.eclipse.equinox.launcher.Main.basicRun(Main.java:504)
at org.eclipse.equinox.launcher.Main.run(Main.java:1236)
at org.eclipse.equinox.launcher.Main.main(Main.java:1212)
at org.eclipse.core.launcher.Main.main(Main.java:30)
FAILED: RichFacesAllTests
Error Message:
string is"file:///qa/services/hudson/hudson_workspace/workspace/jbosstools-nightly-3.0.x/jbds-build/3.0.2.GA/200906180431/tests/eclipse/plugins/org.jboss.tools.jsf.vpe.richfaces_3.0.1.GA-N200906180431-H70/resources/pickList/arrow_remove.gif" but pattern is ".*resources/pickList/arrow_copy.gif"
Stack Trace:
junit.framework.AssertionFailedError: string is"file:///qa/services/hudson/hudson_workspace/workspace/jbosstools-nightly-3.0.x/jbds-build/3.0.2.GA/200906180431/tests/eclipse/plugins/org.jboss.tools.jsf.vpe.richfaces_3.0.1.GA-N200906180431-H70/resources/pickList/arrow_remove.gif" but pattern is ".*resources/pickList/arrow_copy.gif"
at org.jboss.tools.vpe.ui.test.ComponentContentTest.compareElements(ComponentContentTest.java:138)
at org.jboss.tools.vpe.ui.test.ComponentContentTest.performContentTest(ComponentContentTest.java:97)
at org.jboss.tools.jsf.vpe.richfaces.test.RichFacesComponentContentTest.testPickList(RichFacesComponentContentTest.java:247)
at junit.extensions.TestDecorator.basicRun(TestDecorator.java:24)
at junit.extensions.TestSetup$1.protect(TestSetup.java:21)
at junit.extensions.TestSetup.run(TestSetup.java:25)
at org.eclipse.test.EclipseTestRunner.run(EclipseTestRunner.java:354)
at org.eclipse.test.EclipseTestRunner.run(EclipseTestRunner.java:206)
at org.eclipse.test.UITestApplication$3.run(UITestApplication.java:195)
at org.eclipse.swt.widgets.RunnableLock.run(RunnableLock.java:35)
at org.eclipse.swt.widgets.Synchronizer.runAsyncMessages(Synchronizer.java:133)
at org.eclipse.swt.widgets.Display.runAsyncMessages(Display.java:3378)
at org.eclipse.swt.widgets.Display.readAndDispatch(Display.java:3036)
at org.eclipse.ui.internal.Workbench.runEventLoop(Workbench.java:2384)
at org.eclipse.ui.internal.Workbench.runUI(Workbench.java:2348)
at org.eclipse.ui.internal.Workbench.access$4(Workbench.java:2200)
at org.eclipse.ui.internal.Workbench$5.run(Workbench.java:495)
at org.eclipse.core.databinding.observable.Realm.runWithDefault(Realm.java:288)
at org.eclipse.ui.internal.Workbench.createAndRunWorkbench(Workbench.java:490)
at org.eclipse.ui.PlatformUI.createAndRunWorkbench(PlatformUI.java:149)
at org.eclipse.ui.internal.ide.application.IDEApplication.start(IDEApplication.java:113)
at org.eclipse.test.UITestApplication.runApplication(UITestApplication.java:138)
at org.eclipse.test.UITestApplication.run(UITestApplication.java:60)
at org.eclipse.test.UITestApplication.start(UITestApplication.java:210)
at org.eclipse.equinox.internal.app.EclipseAppHandle.run(EclipseAppHandle.java:193)
at org.eclipse.core.runtime.internal.adaptor.EclipseAppLauncher.runApplication(EclipseAppLauncher.java:110)
at org.eclipse.core.runtime.internal.adaptor.EclipseAppLauncher.start(EclipseAppLauncher.java:79)
at org.eclipse.core.runtime.adaptor.EclipseStarter.run(EclipseStarter.java:386)
at org.eclipse.core.runtime.adaptor.EclipseStarter.run(EclipseStarter.java:179)
at org.eclipse.equinox.launcher.Main.invokeFramework(Main.java:549)
at org.eclipse.equinox.launcher.Main.basicRun(Main.java:504)
at org.eclipse.equinox.launcher.Main.run(Main.java:1236)
at org.eclipse.equinox.launcher.Main.main(Main.java:1212)
at org.eclipse.core.launcher.Main.main(Main.java:30)
FAILED: JstJspAllTests
Error Message:
Proposal #{applicationScope} not found!
Stack Trace:
junit.framework.AssertionFailedError: Proposal #{applicationScope} not found!
at org.jboss.tools.jst.jsp.test.ca.ContentAssistantTestCase.checkProposals(ContentAssistantTestCase.java:86)
at org.jboss.tools.jst.jsp.test.ca.JsfJspJbide1813Test.testJsfJspJbide1813Test(JsfJspJbide1813Test.java:39)
at org.eclipse.test.EclipseTestRunner.run(EclipseTestRunner.java:354)
at org.eclipse.test.EclipseTestRunner.run(EclipseTestRunner.java:206)
at org.eclipse.test.UITestApplication$3.run(UITestApplication.java:195)
at org.eclipse.swt.widgets.RunnableLock.run(RunnableLock.java:35)
at org.eclipse.swt.widgets.Synchronizer.runAsyncMessages(Synchronizer.java:133)
at org.eclipse.swt.widgets.Display.runAsyncMessages(Display.java:3378)
at org.eclipse.swt.widgets.Display.readAndDispatch(Display.java:3036)
at org.eclipse.ui.internal.Workbench.runEventLoop(Workbench.java:2384)
at org.eclipse.ui.internal.Workbench.runUI(Workbench.java:2348)
at org.eclipse.ui.internal.Workbench.access$4(Workbench.java:2200)
at org.eclipse.ui.internal.Workbench$5.run(Workbench.java:495)
at org.eclipse.core.databinding.observable.Realm.runWithDefault(Realm.java:288)
at org.eclipse.ui.internal.Workbench.createAndRunWorkbench(Workbench.java:490)
at org.eclipse.ui.PlatformUI.createAndRunWorkbench(PlatformUI.java:149)
at org.eclipse.ui.internal.ide.application.IDEApplication.start(IDEApplication.java:113)
at org.eclipse.test.UITestApplication.runApplication(UITestApplication.java:138)
at org.eclipse.test.UITestApplication.run(UITestApplication.java:60)
at org.eclipse.test.UITestApplication.start(UITestApplication.java:210)
at org.eclipse.equinox.internal.app.EclipseAppHandle.run(EclipseAppHandle.java:193)
at org.eclipse.core.runtime.internal.adaptor.EclipseAppLauncher.runApplication(EclipseAppLauncher.java:110)
at org.eclipse.core.runtime.internal.adaptor.EclipseAppLauncher.start(EclipseAppLauncher.java:79)
at org.eclipse.core.runtime.adaptor.EclipseStarter.run(EclipseStarter.java:386)
at org.eclipse.core.runtime.adaptor.EclipseStarter.run(EclipseStarter.java:179)
at org.eclipse.equinox.launcher.Main.invokeFramework(Main.java:549)
at org.eclipse.equinox.launcher.Main.basicRun(Main.java:504)
at org.eclipse.equinox.launcher.Main.run(Main.java:1236)
at org.eclipse.equinox.launcher.Main.main(Main.java:1212)
at org.eclipse.core.launcher.Main.main(Main.java:30)
FAILED: JstJspAllTests
Error Message:
Content Assistant returned no proposals
Stack Trace:
junit.framework.AssertionFailedError: Content Assistant returned no proposals
at org.jboss.tools.jst.jsp.test.ca.ContentAssistantTestCase.checkProposals(ContentAssistantTestCase.java:79)
at org.jboss.tools.jst.jsp.test.ca.JsfJspJbide1807Test.testJsfJspJbide1807Test(JsfJspJbide1807Test.java:37)
at org.eclipse.test.EclipseTestRunner.run(EclipseTestRunner.java:354)
at org.eclipse.test.EclipseTestRunner.run(EclipseTestRunner.java:206)
at org.eclipse.test.UITestApplication$3.run(UITestApplication.java:195)
at org.eclipse.swt.widgets.RunnableLock.run(RunnableLock.java:35)
at org.eclipse.swt.widgets.Synchronizer.runAsyncMessages(Synchronizer.java:133)
at org.eclipse.swt.widgets.Display.runAsyncMessages(Display.java:3378)
at org.eclipse.swt.widgets.Display.readAndDispatch(Display.java:3036)
at org.eclipse.ui.internal.Workbench.runEventLoop(Workbench.java:2384)
at org.eclipse.ui.internal.Workbench.runUI(Workbench.java:2348)
at org.eclipse.ui.internal.Workbench.access$4(Workbench.java:2200)
at org.eclipse.ui.internal.Workbench$5.run(Workbench.java:495)
at org.eclipse.core.databinding.observable.Realm.runWithDefault(Realm.java:288)
at org.eclipse.ui.internal.Workbench.createAndRunWorkbench(Workbench.java:490)
at org.eclipse.ui.PlatformUI.createAndRunWorkbench(PlatformUI.java:149)
at org.eclipse.ui.internal.ide.application.IDEApplication.start(IDEApplication.java:113)
at org.eclipse.test.UITestApplication.runApplication(UITestApplication.java:138)
at org.eclipse.test.UITestApplication.run(UITestApplication.java:60)
at org.eclipse.test.UITestApplication.start(UITestApplication.java:210)
at org.eclipse.equinox.internal.app.EclipseAppHandle.run(EclipseAppHandle.java:193)
at org.eclipse.core.runtime.internal.adaptor.EclipseAppLauncher.runApplication(EclipseAppLauncher.java:110)
at org.eclipse.core.runtime.internal.adaptor.EclipseAppLauncher.start(EclipseAppLauncher.java:79)
at org.eclipse.core.runtime.adaptor.EclipseStarter.run(EclipseStarter.java:386)
at org.eclipse.core.runtime.adaptor.EclipseStarter.run(EclipseStarter.java:179)
at org.eclipse.equinox.launcher.Main.invokeFramework(Main.java:549)
at org.eclipse.equinox.launcher.Main.basicRun(Main.java:504)
at org.eclipse.equinox.launcher.Main.run(Main.java:1236)
at org.eclipse.equinox.launcher.Main.main(Main.java:1212)
at org.eclipse.core.launcher.Main.main(Main.java:30)
FAILED: JstJspAllTests
Error Message:
Content Assistant peturned no proposals for template paths.
Stack Trace:
junit.framework.AssertionFailedError: Content Assistant peturned no proposals for template paths.
at org.jboss.tools.jst.jsp.test.ca.JsfJspJbide2437Test.testJsfJspJbide2437(JsfJspJbide2437Test.java:72)
at org.eclipse.test.EclipseTestRunner.run(EclipseTestRunner.java:354)
at org.eclipse.test.EclipseTestRunner.run(EclipseTestRunner.java:206)
at org.eclipse.test.UITestApplication$3.run(UITestApplication.java:195)
at org.eclipse.swt.widgets.RunnableLock.run(RunnableLock.java:35)
at org.eclipse.swt.widgets.Synchronizer.runAsyncMessages(Synchronizer.java:133)
at org.eclipse.swt.widgets.Display.runAsyncMessages(Display.java:3378)
at org.eclipse.swt.widgets.Display.readAndDispatch(Display.java:3036)
at org.eclipse.ui.internal.Workbench.runEventLoop(Workbench.java:2384)
at org.eclipse.ui.internal.Workbench.runUI(Workbench.java:2348)
at org.eclipse.ui.internal.Workbench.access$4(Workbench.java:2200)
at org.eclipse.ui.internal.Workbench$5.run(Workbench.java:495)
at org.eclipse.core.databinding.observable.Realm.runWithDefault(Realm.java:288)
at org.eclipse.ui.internal.Workbench.createAndRunWorkbench(Workbench.java:490)
at org.eclipse.ui.PlatformUI.createAndRunWorkbench(PlatformUI.java:149)
at org.eclipse.ui.internal.ide.application.IDEApplication.start(IDEApplication.java:113)
at org.eclipse.test.UITestApplication.runApplication(UITestApplication.java:138)
at org.eclipse.test.UITestApplication.run(UITestApplication.java:60)
at org.eclipse.test.UITestApplication.start(UITestApplication.java:210)
at org.eclipse.equinox.internal.app.EclipseAppHandle.run(EclipseAppHandle.java:193)
at org.eclipse.core.runtime.internal.adaptor.EclipseAppLauncher.runApplication(EclipseAppLauncher.java:110)
at org.eclipse.core.runtime.internal.adaptor.EclipseAppLauncher.start(EclipseAppLauncher.java:79)
at org.eclipse.core.runtime.adaptor.EclipseStarter.run(EclipseStarter.java:386)
at org.eclipse.core.runtime.adaptor.EclipseStarter.run(EclipseStarter.java:179)
at org.eclipse.equinox.launcher.Main.invokeFramework(Main.java:549)
at org.eclipse.equinox.launcher.Main.basicRun(Main.java:504)
at org.eclipse.equinox.launcher.Main.run(Main.java:1236)
at org.eclipse.equinox.launcher.Main.main(Main.java:1212)
at org.eclipse.core.launcher.Main.main(Main.java:30)
FAILED: JstWebAllTests
Error Message:
TLD list does not contain expected TLD in XModel.
Stack Trace:
junit.framework.AssertionFailedError: TLD list does not contain expected TLD in XModel.
at org.jboss.tools.jst.web.test.WebContentAssistProviderTest.testTlds(WebContentAssistProviderTest.java:66)
at org.eclipse.test.EclipseTestRunner.run(EclipseTestRunner.java:354)
at org.eclipse.test.EclipseTestRunner.run(EclipseTestRunner.java:206)
at org.eclipse.test.UITestApplication$3.run(UITestApplication.java:195)
at org.eclipse.swt.widgets.RunnableLock.run(RunnableLock.java:35)
at org.eclipse.swt.widgets.Synchronizer.runAsyncMessages(Synchronizer.java:133)
at org.eclipse.swt.widgets.Display.runAsyncMessages(Display.java:3378)
at org.eclipse.swt.widgets.Display.readAndDispatch(Display.java:3036)
at org.eclipse.ui.internal.Workbench.runEventLoop(Workbench.java:2384)
at org.eclipse.ui.internal.Workbench.runUI(Workbench.java:2348)
at org.eclipse.ui.internal.Workbench.access$4(Workbench.java:2200)
at org.eclipse.ui.internal.Workbench$5.run(Workbench.java:495)
at org.eclipse.core.databinding.observable.Realm.runWithDefault(Realm.java:288)
at org.eclipse.ui.internal.Workbench.createAndRunWorkbench(Workbench.java:490)
at org.eclipse.ui.PlatformUI.createAndRunWorkbench(PlatformUI.java:149)
at org.eclipse.ui.internal.ide.application.IDEApplication.start(IDEApplication.java:113)
at org.eclipse.test.UITestApplication.runApplication(UITestApplication.java:138)
at org.eclipse.test.UITestApplication.run(UITestApplication.java:60)
at org.eclipse.test.UITestApplication.start(UITestApplication.java:210)
at org.eclipse.equinox.internal.app.EclipseAppHandle.run(EclipseAppHandle.java:193)
at org.eclipse.core.runtime.internal.adaptor.EclipseAppLauncher.runApplication(EclipseAppLauncher.java:110)
at org.eclipse.core.runtime.internal.adaptor.EclipseAppLauncher.start(EclipseAppLauncher.java:79)
at org.eclipse.core.runtime.adaptor.EclipseStarter.run(EclipseStarter.java:386)
at org.eclipse.core.runtime.adaptor.EclipseStarter.run(EclipseStarter.java:179)
at org.eclipse.equinox.launcher.Main.invokeFramework(Main.java:549)
at org.eclipse.equinox.launcher.Main.basicRun(Main.java:504)
at org.eclipse.equinox.launcher.Main.run(Main.java:1236)
at org.eclipse.equinox.launcher.Main.main(Main.java:1212)
at org.eclipse.core.launcher.Main.main(Main.java:30)
FAILED: JBossWSCoreAllTests
Error Message:
Error: Could not generate. (use --show-traces to see full traces) Error: com/sun/codemodel/JExpression
Stack Trace:
junit.framework.AssertionFailedError: Error: Could not generate. (use --show-traces to see full traces)
Error: com/sun/codemodel/JExpression
at org.jboss.tools.ws.core.test.command.JBossWSJavaFirstCommandTest.testWSProviderInvokeCommand(JBossWSJavaFirstCommandTest.java:142)
at org.eclipse.test.EclipseTestRunner.run(EclipseTestRunner.java:354)
at org.eclipse.test.EclipseTestRunner.run(EclipseTestRunner.java:206)
at org.eclipse.test.UITestApplication$3.run(UITestApplication.java:195)
at org.eclipse.swt.widgets.RunnableLock.run(RunnableLock.java:35)
at org.eclipse.swt.widgets.Synchronizer.runAsyncMessages(Synchronizer.java:133)
at org.eclipse.swt.widgets.Display.runAsyncMessages(Display.java:3378)
at org.eclipse.swt.widgets.Display.readAndDispatch(Display.java:3036)
at org.eclipse.ui.internal.Workbench.runEventLoop(Workbench.java:2384)
at org.eclipse.ui.internal.Workbench.runUI(Workbench.java:2348)
at org.eclipse.ui.internal.Workbench.access$4(Workbench.java:2200)
at org.eclipse.ui.internal.Workbench$5.run(Workbench.java:495)
at org.eclipse.core.databinding.observable.Realm.runWithDefault(Realm.java:288)
at org.eclipse.ui.internal.Workbench.createAndRunWorkbench(Workbench.java:490)
at org.eclipse.ui.PlatformUI.createAndRunWorkbench(PlatformUI.java:149)
at org.eclipse.ui.internal.ide.application.IDEApplication.start(IDEApplication.java:113)
at org.eclipse.test.UITestApplication.runApplication(UITestApplication.java:138)
at org.eclipse.test.UITestApplication.run(UITestApplication.java:60)
at org.eclipse.test.UITestApplication.start(UITestApplication.java:210)
at org.eclipse.equinox.internal.app.EclipseAppHandle.run(EclipseAppHandle.java:193)
at org.eclipse.core.runtime.internal.adaptor.EclipseAppLauncher.runApplication(EclipseAppLauncher.java:110)
at org.eclipse.core.runtime.internal.adaptor.EclipseAppLauncher.start(EclipseAppLauncher.java:79)
at org.eclipse.core.runtime.adaptor.EclipseStarter.run(EclipseStarter.java:386)
at org.eclipse.core.runtime.adaptor.EclipseStarter.run(EclipseStarter.java:179)
at org.eclipse.equinox.launcher.Main.invokeFramework(Main.java:549)
at org.eclipse.equinox.launcher.Main.basicRun(Main.java:504)
at org.eclipse.equinox.launcher.Main.run(Main.java:1236)
at org.eclipse.equinox.launcher.Main.main(Main.java:1212)
at org.eclipse.core.launcher.Main.main(Main.java:30)
FAILED: JBossWSCoreAllTests
Error Message:
Error: Could not generate. (use --show-traces to see full traces) Error: com/sun/codemodel/JExpression
Stack Trace:
junit.framework.AssertionFailedError: Error: Could not generate. (use --show-traces to see full traces)
Error: com/sun/codemodel/JExpression
at org.jboss.tools.ws.core.test.command.JBossWSJavaFirstCommandTest.testDeployResult(JBossWSJavaFirstCommandTest.java:170)
at org.eclipse.test.EclipseTestRunner.run(EclipseTestRunner.java:354)
at org.eclipse.test.EclipseTestRunner.run(EclipseTestRunner.java:206)
at org.eclipse.test.UITestApplication$3.run(UITestApplication.java:195)
at org.eclipse.swt.widgets.RunnableLock.run(RunnableLock.java:35)
at org.eclipse.swt.widgets.Synchronizer.runAsyncMessages(Synchronizer.java:133)
at org.eclipse.swt.widgets.Display.runAsyncMessages(Display.java:3378)
at org.eclipse.swt.widgets.Display.readAndDispatch(Display.java:3036)
at org.eclipse.ui.internal.Workbench.runEventLoop(Workbench.java:2384)
at org.eclipse.ui.internal.Workbench.runUI(Workbench.java:2348)
at org.eclipse.ui.internal.Workbench.access$4(Workbench.java:2200)
at org.eclipse.ui.internal.Workbench$5.run(Workbench.java:495)
at org.eclipse.core.databinding.observable.Realm.runWithDefault(Realm.java:288)
at org.eclipse.ui.internal.Workbench.createAndRunWorkbench(Workbench.java:490)
at org.eclipse.ui.PlatformUI.createAndRunWorkbench(PlatformUI.java:149)
at org.eclipse.ui.internal.ide.application.IDEApplication.start(IDEApplication.java:113)
at org.eclipse.test.UITestApplication.runApplication(UITestApplication.java:138)
at org.eclipse.test.UITestApplication.run(UITestApplication.java:60)
at org.eclipse.test.UITestApplication.start(UITestApplication.java:210)
at org.eclipse.equinox.internal.app.EclipseAppHandle.run(EclipseAppHandle.java:193)
at org.eclipse.core.runtime.internal.adaptor.EclipseAppLauncher.runApplication(EclipseAppLauncher.java:110)
at org.eclipse.core.runtime.internal.adaptor.EclipseAppLauncher.start(EclipseAppLauncher.java:79)
at org.eclipse.core.runtime.adaptor.EclipseStarter.run(EclipseStarter.java:386)
at org.eclipse.core.runtime.adaptor.EclipseStarter.run(EclipseStarter.java:179)
at org.eclipse.equinox.launcher.Main.invokeFramework(Main.java:549)
at org.eclipse.equinox.launcher.Main.basicRun(Main.java:504)
at org.eclipse.equinox.launcher.Main.run(Main.java:1236)
at org.eclipse.equinox.launcher.Main.main(Main.java:1212)
at org.eclipse.core.launcher.Main.main(Main.java:30)
FAILED: JBossWSCoreAllTests
Error Message:
Failed to generate implementation class
Stack Trace:
junit.framework.AssertionFailedError: Failed to generate implementation class
at org.jboss.tools.ws.core.test.command.JBossWSTopDownCommandTest.testDeployResult(JBossWSTopDownCommandTest.java:220)
at org.eclipse.test.EclipseTestRunner.run(EclipseTestRunner.java:354)
at org.eclipse.test.EclipseTestRunner.run(EclipseTestRunner.java:206)
at org.eclipse.test.UITestApplication$3.run(UITestApplication.java:195)
at org.eclipse.swt.widgets.RunnableLock.run(RunnableLock.java:35)
at org.eclipse.swt.widgets.Synchronizer.runAsyncMessages(Synchronizer.java:133)
at org.eclipse.swt.widgets.Display.runAsyncMessages(Display.java:3378)
at org.eclipse.swt.widgets.Display.readAndDispatch(Display.java:3036)
at org.eclipse.ui.internal.Workbench.runEventLoop(Workbench.java:2384)
at org.eclipse.ui.internal.Workbench.runUI(Workbench.java:2348)
at org.eclipse.ui.internal.Workbench.access$4(Workbench.java:2200)
at org.eclipse.ui.internal.Workbench$5.run(Workbench.java:495)
at org.eclipse.core.databinding.observable.Realm.runWithDefault(Realm.java:288)
at org.eclipse.ui.internal.Workbench.createAndRunWorkbench(Workbench.java:490)
at org.eclipse.ui.PlatformUI.createAndRunWorkbench(PlatformUI.java:149)
at org.eclipse.ui.internal.ide.application.IDEApplication.start(IDEApplication.java:113)
at org.eclipse.test.UITestApplication.runApplication(UITestApplication.java:138)
at org.eclipse.test.UITestApplication.run(UITestApplication.java:60)
at org.eclipse.test.UITestApplication.start(UITestApplication.java:210)
at org.eclipse.equinox.internal.app.EclipseAppHandle.run(EclipseAppHandle.java:193)
at org.eclipse.core.runtime.internal.adaptor.EclipseAppLauncher.runApplication(EclipseAppLauncher.java:110)
at org.eclipse.core.runtime.internal.adaptor.EclipseAppLauncher.start(EclipseAppLauncher.java:79)
at org.eclipse.core.runtime.adaptor.EclipseStarter.run(EclipseStarter.java:386)
at org.eclipse.core.runtime.adaptor.EclipseStarter.run(EclipseStarter.java:179)
at org.eclipse.equinox.launcher.Main.invokeFramework(Main.java:549)
at org.eclipse.equinox.launcher.Main.basicRun(Main.java:504)
at org.eclipse.equinox.launcher.Main.run(Main.java:1236)
at org.eclipse.equinox.launcher.Main.main(Main.java:1212)
at org.eclipse.core.launcher.Main.main(Main.java:30)
--------------------------------------------------
Changes:
[rob.stryker(a)jboss.com] Issue Tracker: 303042
--------------------------------------------------
Console log:
[...truncated 19854 lines...]
[jar] Building jar: /home/hudson/hudson_workspace/workspace/jbosstools-nightly-3.0.x/jbds-build/site/eclipse/plugins/org.jboss.tools.vpe.docbook_3.0.1.GA-N200906180431-H70.jar
[delete] Deleting 5 files from /home/hudson/hudson_workspace/workspace/jbosstools-nightly-3.0.x/jbds-build/site/eclipse/plugins/org.jboss.tools.vpe.docbook_3.0.1.GA-N200906180431-H70
[delete] Deleted 3 directories from /home/hudson/hudson_workspace/workspace/jbosstools-nightly-3.0.x/jbds-build/site/eclipse/plugins/org.jboss.tools.vpe.docbook_3.0.1.GA-N200906180431-H70
[jar] Building jar: /home/hudson/hudson_workspace/workspace/jbosstools-nightly-3.0.x/jbds-build/site/eclipse/plugins/org.jboss.tools.vpe.html_3.0.1.GA-N200906180431-H70.jar
[delete] Deleting 11 files from /home/hudson/hudson_workspace/workspace/jbosstools-nightly-3.0.x/jbds-build/site/eclipse/plugins/org.jboss.tools.vpe.html_3.0.1.GA-N200906180431-H70
[delete] Deleted 9 directories from /home/hudson/hudson_workspace/workspace/jbosstools-nightly-3.0.x/jbds-build/site/eclipse/plugins/org.jboss.tools.vpe.html_3.0.1.GA-N200906180431-H70
[jar] Building jar: /home/hudson/hudson_workspace/workspace/jbosstools-nightly-3.0.x/jbds-build/site/eclipse/plugins/org.jboss.tools.vpe.jsp_3.0.1.GA-N200906180431-H70.jar
[delete] Deleting 6 files from /home/hudson/hudson_workspace/workspace/jbosstools-nightly-3.0.x/jbds-build/site/eclipse/plugins/org.jboss.tools.vpe.jsp_3.0.1.GA-N200906180431-H70
[delete] Deleted 8 directories from /home/hudson/hudson_workspace/workspace/jbosstools-nightly-3.0.x/jbds-build/site/eclipse/plugins/org.jboss.tools.vpe.jsp_3.0.1.GA-N200906180431-H70
[jar] Building jar: /home/hudson/hudson_workspace/workspace/jbosstools-nightly-3.0.x/jbds-build/site/eclipse/plugins/org.jboss.tools.vpe.ui.palette_3.0.1.GA-N200906180431-H70.jar
[delete] Deleting 4 files from /home/hudson/hudson_workspace/workspace/jbosstools-nightly-3.0.x/jbds-build/site/eclipse/plugins/org.jboss.tools.vpe.ui.palette_3.0.1.GA-N200906180431-H70
[delete] Deleted 2 directories from /home/hudson/hudson_workspace/workspace/jbosstools-nightly-3.0.x/jbds-build/site/eclipse/plugins/org.jboss.tools.vpe.ui.palette_3.0.1.GA-N200906180431-H70
[jar] Building jar: /home/hudson/hudson_workspace/workspace/jbosstools-nightly-3.0.x/jbds-build/site/eclipse/plugins/org.jboss.tools.vpe_3.0.1.GA-N200906180431-H70.jar
[delete] Deleting 15 files from /home/hudson/hudson_workspace/workspace/jbosstools-nightly-3.0.x/jbds-build/site/eclipse/plugins/org.jboss.tools.vpe_3.0.1.GA-N200906180431-H70
[delete] Deleted 5 directories from /home/hudson/hudson_workspace/workspace/jbosstools-nightly-3.0.x/jbds-build/site/eclipse/plugins/org.jboss.tools.vpe_3.0.1.GA-N200906180431-H70
[jar] Building jar: /home/hudson/hudson_workspace/workspace/jbosstools-nightly-3.0.x/jbds-build/site/eclipse/plugins/org.jboss.tools.xulrunner_1.0.0.GA-N200906180431-H70.jar
[delete] Deleting 6 files from /home/hudson/hudson_workspace/workspace/jbosstools-nightly-3.0.x/jbds-build/site/eclipse/plugins/org.jboss.tools.xulrunner_1.0.0.GA-N200906180431-H70
[delete] Deleted 2 directories from /home/hudson/hudson_workspace/workspace/jbosstools-nightly-3.0.x/jbds-build/site/eclipse/plugins/org.jboss.tools.xulrunner_1.0.0.GA-N200906180431-H70
[jar] Building jar: /home/hudson/hudson_workspace/workspace/jbosstools-nightly-3.0.x/jbds-build/site/eclipse/plugins/org.mozilla.xpcom_1.8.1.3-20070904.jar
[delete] Deleting 2 files from /home/hudson/hudson_workspace/workspace/jbosstools-nightly-3.0.x/jbds-build/site/eclipse/plugins/org.mozilla.xpcom_1.8.1.3-20070904
[delete] Deleted 2 directories from /home/hudson/hudson_workspace/workspace/jbosstools-nightly-3.0.x/jbds-build/site/eclipse/plugins/org.mozilla.xpcom_1.8.1.3-20070904
[jar] Building jar: /home/hudson/hudson_workspace/workspace/jbosstools-nightly-3.0.x/jbds-build/site/eclipse/plugins/org.mozilla.xulrunner.carbon.macosx_1.8.1.3-20070904.jar
[delete] Deleting 298 files from /home/hudson/hudson_workspace/workspace/jbosstools-nightly-3.0.x/jbds-build/site/eclipse/plugins/org.mozilla.xulrunner.carbon.macosx_1.8.1.3-20070904
[delete] Deleted 42 directories from /home/hudson/hudson_workspace/workspace/jbosstools-nightly-3.0.x/jbds-build/site/eclipse/plugins/org.mozilla.xulrunner.carbon.macosx_1.8.1.3-20070904
[jar] Building jar: /home/hudson/hudson_workspace/workspace/jbosstools-nightly-3.0.x/jbds-build/site/eclipse/plugins/org.mozilla.xulrunner.gtk.linux.x86_1.8.1.3-20070904.jar
[delete] Deleting 292 files from /home/hudson/hudson_workspace/workspace/jbosstools-nightly-3.0.x/jbds-build/site/eclipse/plugins/org.mozilla.xulrunner.gtk.linux.x86_1.8.1.3-20070904
[delete] Deleted 22 directories from /home/hudson/hudson_workspace/workspace/jbosstools-nightly-3.0.x/jbds-build/site/eclipse/plugins/org.mozilla.xulrunner.gtk.linux.x86_1.8.1.3-20070904
[jar] Building jar: /home/hudson/hudson_workspace/workspace/jbosstools-nightly-3.0.x/jbds-build/site/eclipse/plugins/org.mozilla.xulrunner.gtk.linux.x86_64_1.8.1.4-20080112.jar
[delete] Deleting 379 files from /home/hudson/hudson_workspace/workspace/jbosstools-nightly-3.0.x/jbds-build/site/eclipse/plugins/org.mozilla.xulrunner.gtk.linux.x86_64_1.8.1.4-20080112
[delete] Deleted 24 directories from /home/hudson/hudson_workspace/workspace/jbosstools-nightly-3.0.x/jbds-build/site/eclipse/plugins/org.mozilla.xulrunner.gtk.linux.x86_64_1.8.1.4-20080112
[jar] Building jar: /home/hudson/hudson_workspace/workspace/jbosstools-nightly-3.0.x/jbds-build/site/eclipse/plugins/org.mozilla.xulrunner.win32.win32.x86_1.8.1.3-20070904.jar
[delete] Deleting 277 files from /home/hudson/hudson_workspace/workspace/jbosstools-nightly-3.0.x/jbds-build/site/eclipse/plugins/org.mozilla.xulrunner.win32.win32.x86_1.8.1.3-20070904
[delete] Deleted 19 directories from /home/hudson/hudson_workspace/workspace/jbosstools-nightly-3.0.x/jbds-build/site/eclipse/plugins/org.mozilla.xulrunner.win32.win32.x86_1.8.1.3-20070904
load.properties:
[echo] Getting version for 'jmx' builder to property 'jmx.versionTag' from /qa/services/hudson/hudson_workspace/workspace/jbosstools-nightly-3.0.x/org.jboss.ide.eclipse.releng/builders/product/versionTags/jbosstools/3.0.2.GA.tags
[echo]
[echo] jbds-jmx-filename=JMX-1.0.0.GA-N200906180431-H70.zip
[echo] jbds-jmx-nodeps-filename=JMX-nodeps-1.0.0.GA-N200906180431-H70.zip
[echo]
[echo] Getting version for 'examples' builder to property 'examples.versionTag' from /qa/services/hudson/hudson_workspace/workspace/jbosstools-nightly-3.0.x/org.jboss.ide.eclipse.releng/builders/product/versionTags/jbosstools/3.0.2.GA.tags
[echo]
[echo] jbds-examples-filename=JBossTools-Examples-1.0.0.GA-N200906180431-H70.zip
[echo] jbds-examples-nodeps-filename=JBossTools-Examples-nodeps-1.0.0.GA-N200906180431-H70.zip
[echo]
[echo] Getting version for 'drools-ide' builder to property 'drools-ide.versionTag' from /qa/services/hudson/hudson_workspace/workspace/jbosstools-nightly-3.0.x/org.jboss.ide.eclipse.releng/builders/product/versionTags/jbosstools/3.0.2.GA.tags
[echo]
[echo] jbds-drools-ide-filename=DroolsIDE-5.0.1.26597-FINAL-N200906180431-H70.zip
[echo] jbds-drools-ide-nodeps-filename=DroolsIDE-nodeps-5.0.1.26597-FINAL-N200906180431-H70.zip
[echo]
[echo] Getting version for 'archives' builder to property 'archives.versionTag' from /qa/services/hudson/hudson_workspace/workspace/jbosstools-nightly-3.0.x/org.jboss.ide.eclipse.releng/builders/product/versionTags/jbosstools/3.0.2.GA.tags
[echo]
[echo] jbds-archives-filename=JBossTools-Archives-3.0.1.GA-N200906180431-H70.zip
[echo] jbds-archives-nodeps-filename=JBossTools-Archives-nodeps-3.0.1.GA-N200906180431-H70.zip
[echo]
[echo] Getting version for 'xulrunner' builder to property 'xulrunner.versionTag' from /qa/services/hudson/hudson_workspace/workspace/jbosstools-nightly-3.0.x/org.jboss.ide.eclipse.releng/builders/product/versionTags/jbosstools/3.0.2.GA.tags
[echo]
[echo] jbds-xulrunner-win32-filename=XulRunner-win32-1.0.0.GA-N200906180431-H70.zip
[echo] jbds-xulrunner-win32-nodeps-filename=XulRunner-win32-nodeps-1.0.0.GA-N200906180431-H70.zip
[echo]
[echo] Getting version for 'xulrunner' builder to property 'xulrunner.versionTag' from /qa/services/hudson/hudson_workspace/workspace/jbosstools-nightly-3.0.x/org.jboss.ide.eclipse.releng/builders/product/versionTags/jbosstools/3.0.2.GA.tags
[echo]
[echo] jbds-xulrunner-linux-gtk-filename=XulRunner-linux-gtk-1.0.0.GA-N200906180431-H70.zip
[echo] jbds-xulrunner-linux-gtk-nodeps-filename=XulRunner-linux-gtk-nodeps-1.0.0.GA-N200906180431-H70.zip
[echo]
[echo] Getting version for 'richfaces' builder to property 'richfaces.versionTag' from /qa/services/hudson/hudson_workspace/workspace/jbosstools-nightly-3.0.x/org.jboss.ide.eclipse.releng/builders/product/versionTags/jbosstools/3.0.2.GA.tags
[echo]
[echo] jbds-richfaces-win32-filename=RichFaces-VPE-win32-3.0.1.GA-N200906180431-H70.zip
[echo] jbds-richfaces-win32-nodeps-filename=RichFaces-VPE-win32-nodeps-3.0.1.GA-N200906180431-H70.zip
[echo]
[echo] Getting version for 'richfaces' builder to property 'richfaces.versionTag' from /qa/services/hudson/hudson_workspace/workspace/jbosstools-nightly-3.0.x/org.jboss.ide.eclipse.releng/builders/product/versionTags/jbosstools/3.0.2.GA.tags
[echo]
[echo] jbds-richfaces-linux-gtk-filename=RichFaces-VPE-linux-gtk-3.0.1.GA-N200906180431-H70.zip
[echo] jbds-richfaces-linux-gtk-nodeps-filename=RichFaces-VPE-linux-gtk-nodeps-3.0.1.GA-N200906180431-H70.zip
[echo]
[echo] Getting version for 'jbpm-convert' builder to property 'jbpm-convert.versionTag' from /qa/services/hudson/hudson_workspace/workspace/jbosstools-nightly-3.0.x/org.jboss.ide.eclipse.releng/builders/product/versionTags/jbosstools/3.0.2.GA.tags
[echo]
[echo] jbds-jbpm-convert-filename=jBPM-Convert-1.0.0.GA-N200906180431-H70.zip
[echo] jbds-jbpm-convert-nodeps-filename=jBPM-Convert-nodeps-1.0.0.GA-N200906180431-H70.zip
[echo]
[echo] Getting version for 'freemarker' builder to property 'freemarker.versionTag' from /qa/services/hudson/hudson_workspace/workspace/jbosstools-nightly-3.0.x/org.jboss.ide.eclipse.releng/builders/product/versionTags/jbosstools/3.0.2.GA.tags
[echo]
[echo] jbds-freemarker-filename=FreeMarkerIDE-1.0.2.GA-N200906180431-H70.zip
[echo] jbds-freemarker-nodeps-filename=
[echo]
[echo] Getting version for 'hibernate-tools' builder to property 'hibernate-tools.versionTag' from /qa/services/hudson/hudson_workspace/workspace/jbosstools-nightly-3.0.x/org.jboss.ide.eclipse.releng/builders/product/versionTags/jbosstools/3.0.2.GA.tags
[echo]
[echo] jbds-hibernate-tools-filename=HibernateTools-3.2.4.GA-N200906180431-H70.zip
[echo] jbds-hibernate-tools-nodeps-filename=HibernateTools-nodeps-3.2.4.GA-N200906180431-H70.zip
[echo]
[echo] Getting version for 'struts' builder to property 'struts.versionTag' from /qa/services/hudson/hudson_workspace/workspace/jbosstools-nightly-3.0.x/org.jboss.ide.eclipse.releng/builders/product/versionTags/jbosstools/3.0.2.GA.tags
[echo]
[echo] jbds-struts-filename=StrutsTools-3.0.0.GA-N200906180431-H70.zip
[echo] jbds-struts-nodeps-filename=StrutsTools-nodeps-3.0.0.GA-N200906180431-H70.zip
[echo]
[echo] Getting version for 'jbpm' builder to property 'jbpm.versionTag' from /qa/services/hudson/hudson_workspace/workspace/jbosstools-nightly-3.0.x/org.jboss.ide.eclipse.releng/builders/product/versionTags/jbosstools/3.0.2.GA.tags
[echo]
[echo] jbds-jbpm-filename=jBPM-Designer-3.1.7.GA-N200906180431-H70.zip
[echo] jbds-jbpm-nodeps-filename=jBPM-Designer-nodeps-3.1.7.GA-N200906180431-H70.zip
[echo]
[echo] Getting version for 'as' builder to property 'as.versionTag' from /qa/services/hudson/hudson_workspace/workspace/jbosstools-nightly-3.0.x/org.jboss.ide.eclipse.releng/builders/product/versionTags/jbosstools/3.0.2.GA.tags
[echo]
[echo] jbds-as-filename=JBossAS-Tools-2.0.1.GA-N200906180431-H70.zip
[echo] jbds-as-nodeps-filename=JBossAS-Tools-nodeps-2.0.1.GA-N200906180431-H70.zip
[echo]
[echo] Getting version for 'seam' builder to property 'seam.versionTag' from /qa/services/hudson/hudson_workspace/workspace/jbosstools-nightly-3.0.x/org.jboss.ide.eclipse.releng/builders/product/versionTags/jbosstools/3.0.2.GA.tags
[echo]
[echo] jbds-seam-filename=SeamTools-3.0.1.GA-N200906180431-H70.zip
[echo] jbds-seam-nodeps-filename=SeamTools-nodeps-3.0.1.GA-N200906180431-H70.zip
[echo]
[echo] Getting version for 'esb' builder to property 'esb.versionTag' from /qa/services/hudson/hudson_workspace/workspace/jbosstools-nightly-3.0.x/org.jboss.ide.eclipse.releng/builders/product/versionTags/jbosstools/3.0.2.GA.tags
[echo]
[echo] jbds-esb-filename=JBossTools-ESB-1.1.1.GA-N200906180431-H70.zip
[echo] jbds-esb-nodeps-filename=JBossTools-ESB-nodeps-1.1.1.GA-N200906180431-H70.zip
[echo]
[echo] Getting version for 'ws' builder to property 'ws.versionTag' from /qa/services/hudson/hudson_workspace/workspace/jbosstools-nightly-3.0.x/org.jboss.ide.eclipse.releng/builders/product/versionTags/jbosstools/3.0.2.GA.tags
[echo]
[echo] jbds-ws-filename=JBossWS-Tools-1.0.1.GA-N200906180431-H70.zip
[echo] jbds-ws-nodeps-filename=JBossWS-Tools-nodeps-1.0.1.GA-N200906180431-H70.zip
[echo]
[echo] Getting version for 'birt' builder to property 'birt.versionTag' from /qa/services/hudson/hudson_workspace/workspace/jbosstools-nightly-3.0.x/org.jboss.ide.eclipse.releng/builders/product/versionTags/jbosstools/3.0.2.GA.tags
[echo]
[echo] jbds-birt-filename=JBossTools-BIRT-1.0.0.GA-N200906180431-H70.zip
[echo] jbds-birt-nodeps-filename=JBossTools-BIRT-nodeps-1.0.0.GA-N200906180431-H70.zip
[echo]
[echo] Getting version for 'portlet' builder to property 'portlet.versionTag' from /qa/services/hudson/hudson_workspace/workspace/jbosstools-nightly-3.0.x/org.jboss.ide.eclipse.releng/builders/product/versionTags/jbosstools/3.0.2.GA.tags
[echo]
[echo] jbds-portlet-filename=JBoss-Portlet-Tools-1.0.1.GA-N200906180431-H70.zip
[echo] jbds-portlet-nodeps-filename=JBoss-Portlet-Tools-nodeps-1.0.1.GA-N200906180431-H70.zip
[echo]
[echo] Getting version for 'smooks' builder to property 'smooks.versionTag' from /qa/services/hudson/hudson_workspace/workspace/jbosstools-nightly-3.0.x/org.jboss.ide.eclipse.releng/builders/product/versionTags/jbosstools/3.0.2.GA.tags
[echo]
[echo] jbds-smooks-filename=JBossTools-Smooks-1.0.0.GA-N200906180431-H70.zip
[echo] jbds-smooks-nodeps-filename=JBossTools-Smooks-nodeps-1.0.0.GA-N200906180431-H70.zip
[echo]
[echo] Getting version for 'tptp' builder to property 'tptp.versionTag' from /qa/services/hudson/hudson_workspace/workspace/jbosstools-nightly-3.0.x/org.jboss.ide.eclipse.releng/builders/product/versionTags/jbosstools/3.0.2.GA.tags
[echo]
[echo] jbds-tptp-filename=JBoss-TPTP-Tools-1.0.0.GA-N200906180431-H70.zip
[echo] jbds-tptp-nodeps-filename=JBoss-TPTP-Tools-nodeps-1.0.0.GA-N200906180431-H70.zip
[echo]
pack200:
[echo] Using /qa/tools/opt/x86_64/jdk1.6.0_11/jre/bin/pack200 to pack update site jars...
[mkdir] Created dir: /qa/services/hudson/hudson_workspace/workspace/jbosstools-nightly-3.0.x/org.jboss.ide.eclipse.releng/builders/product/updateSite/updateSitePackTmp/output
[mkdir] Created dir: /qa/services/hudson/hudson_workspace/workspace/jbosstools-nightly-3.0.x/org.jboss.ide.eclipse.releng/builders/product/updateSite/updateSitePackTmp/input
[echo] Zip update jars in /home/hudson/hudson_workspace/workspace/jbosstools-nightly-3.0.x/jbds-build/site to temporary Master zip (to avoid packing nested jars) ...
[zip] Building zip: /qa/services/hudson/hudson_workspace/workspace/jbosstools-nightly-3.0.x/org.jboss.ide.eclipse.releng/builders/product/updateSite/updateSitePackTmp/input/Master.zip
[exec] 112M updateSite/updateSitePackTmp/input/Master.zip
[echo] Pack jars ...
[echo] Run jarprocessor.pack200 using launcherjar = /home/hudson/hudson_workspace/workspace/jbosstools-nightly-3.0.x/jbds-build/clean-eclipse/eclipse/plugins/org.eclipse.equinox.launcher_1.0.101.R34x_v20081125.jar
[exec] 180M updateSite/updateSitePackTmp/output/Master.zip
[unzip] Expanding: /qa/services/hudson/hudson_workspace/workspace/jbosstools-nightly-3.0.x/org.jboss.ide.eclipse.releng/builders/product/updateSite/updateSitePackTmp/output/Master.zip into /home/hudson/hudson_workspace/workspace/jbosstools-nightly-3.0.x/jbds-build/site
[delete] Deleting directory /qa/services/hudson/hudson_workspace/workspace/jbosstools-nightly-3.0.x/org.jboss.ide.eclipse.releng/builders/product/updateSite/updateSitePackTmp
copy.site.rootfiles:
[echo] Build nightly jbosstools update site...
[copy] Copying 4 files to /home/hudson/hudson_workspace/workspace/jbosstools-nightly-3.0.x/jbds-build/site/eclipse
p2:
[echo] Run p2 metadata generator using launcherjar = /home/hudson/hudson_workspace/workspace/jbosstools-nightly-3.0.x/jbds-build/clean-eclipse/eclipse/plugins/org.eclipse.equinox.launcher_1.0.101.R34x_v20081125.jar
[p2] Generating metadata for /home/hudson/hudson_workspace/workspace/jbosstools-nightly-3.0.x/jbds-build/site/eclipse.
[p2] Generation completed with success [3 seconds].
build.metadata:
publish.site:
post-build:
publish.results:
send.notification.email:
[mail] Failed to initialise MIME mail: javax/mail/MessagingException
[mail] Sending email: JBossTools nightly build 3.0.2.GA-N200906180431-H70 results
[mail] Sent email with 0 attachments
publish.log:
init:
clean.all.subfolders:
BUILD SUCCESSFUL
Total time: 180 minutes 50 seconds
++ cd ../configs/jbds
++ zip build.log.zip build.log
updating: build.log (deflated 95%)
++ cd ../..
++ [[ '' == \l\o\c\a\l ]]
+++ cat /home/hudson/hudson_workspace/workspace/jbosstools-nightly-3.0.x/jbds-build/buildData.properties
+++ grep product.releaseNumber
+++ perl -ne 's/[\s\t]+product.releaseNumber=//g;print;'
++ version=3.0.2.GA
+++ cat /home/hudson/hudson_workspace/workspace/jbosstools-nightly-3.0.x/jbds-build/buildData.properties
+++ grep upload.to
+++ perl -ne 's/[\s\t]+upload.to=//g;print;'
++ builddir=nightly/3.0.2.GA/200906180431
+++ cat /home/hudson/hudson_workspace/workspace/jbosstools-nightly-3.0.x/jbds-build/buildData.properties
+++ grep product.buildDesc
+++ perl -ne 's/[\s\t]+product.buildDesc=//g; print;'
++ buildtype=nightly
+++ cat /home/hudson/hudson_workspace/workspace/jbosstools-nightly-3.0.x/jbds-build/buildData.properties
+++ grep product.releaseNumber
+++ perl -ne 's/[\s\t]+product.releaseNumber=//g; print;'
++ releaseNumber=3.0.2.GA
++ DESTINATION=jbossqa@download.jboss.org:/htdocs/jbosstools
++ scp -r /home/hudson/hudson_workspace/workspace/jbosstools-nightly-3.0.x/jbds-build/3.0.2.GA jbossqa@download.jboss.org:/htdocs/jbosstools/builds/nightly/
++ scp configs/jbds/build.log.zip jbossqa@download.jboss.org:/htdocs/jbosstools/builds/nightly/3.0.2.GA/200906180431/
++ scp /home/hudson/hudson_workspace/workspace/jbosstools-nightly-3.0.x/jbds-build/latestBuild.html jbossqa@download.jboss.org:/htdocs/jbosstools/builds/nightly/latestBuild-3.0.x.html
++ [[ -d /home/hudson/hudson_workspace/workspace/jbosstools-nightly-3.0.x/jbds-build/site/eclipse ]]
++ mkdir -p /home/hudson/hudson_workspace/workspace/jbosstools-nightly-3.0.x/jbds-build/site/nightly/3.0.x
++ mv /home/hudson/hudson_workspace/workspace/jbosstools-nightly-3.0.x/jbds-build/site/eclipse/artifacts.jar /home/hudson/hudson_workspace/workspace/jbosstools-nightly-3.0.x/jbds-build/site/eclipse/associateSites.xml /home/hudson/hudson_workspace/workspace/jbosstools-nightly-3.0.x/jbds-build/site/eclipse/content.jar /home/hudson/hudson_workspace/workspace/jbosstools-nightly-3.0.x/jbds-build/site/eclipse/features /home/hudson/hudson_workspace/workspace/jbosstools-nightly-3.0.x/jbds-build/site/eclipse/index.html /home/hudson/hudson_workspace/workspace/jbosstools-nightly-3.0.x/jbds-build/site/eclipse/plugins /home/hudson/hudson_workspace/workspace/jbosstools-nightly-3.0.x/jbds-build/site/eclipse/site.xml /home/hudson/hudson_workspace/workspace/jbosstools-nightly-3.0.x/jbds-build/site/eclipse/web /home/hudson/hudson_workspace/workspace/jbosstools-nightly-3.0.x/jbds-build/site/nightly/3.0.x
+++ find /home/hudson/hudson_workspace/workspace/jbosstools-nightly-3.0.x/jbds-build/site/nightly/3.0.x/features -name '*.jar'
++ [[ -n /home/hudson/hudson_workspace/workspace/jbosstools-nightly-3.0.x/jbds-build/site/nightly/3.0.x/features/org.jbpm.gd.jpdl.feature_3.1.7.GA-N200906180431-H70.jar
/home/hudson/hudson_workspace/workspace/jbosstools-nightly-3.0.x/jbds-build/site/nightly/3.0.x/features/org.jboss.tools.xulrunner.feature_1.8.1.3-20070904.jar
/home/hudson/hudson_workspace/workspace/jbosstools-nightly-3.0.x/jbds-build/site/nightly/3.0.x/features/org.jboss.tools.ws.feature_1.0.1.GA-N200906180431-H70.jar
/home/hudson/hudson_workspace/workspace/jbosstools-nightly-3.0.x/jbds-build/site/nightly/3.0.x/features/org.jboss.tools.tptp.feature_1.0.0.GA-N200906180431-H70.jar
/home/hudson/hudson_workspace/workspace/jbosstools-nightly-3.0.x/jbds-build/site/nightly/3.0.x/features/org.jboss.tools.struts_feature_3.0.0.GA-N200906180431-H70.jar
/home/hudson/hudson_workspace/workspace/jbosstools-nightly-3.0.x/jbds-build/site/nightly/3.0.x/features/org.jboss.tools.smooks.feature_1.0.0.GA-N200906180431-H70.jar
/home/hudson/hudson_workspace/workspace/jbosstools-nightly-3.0.x/jbds-build/site/nightly/3.0.x/features/org.jboss.tools.seam.feature_3.0.1.GA-N200906180431-H70.jar
/home/hudson/hudson_workspace/workspace/jbosstools-nightly-3.0.x/jbds-build/site/nightly/3.0.x/features/org.jboss.tools.richfaces.feature_3.0.1.GA-N200906180431-H70.jar
/home/hudson/hudson_workspace/workspace/jbosstools-nightly-3.0.x/jbds-build/site/nightly/3.0.x/features/org.jboss.tools.portlet.feature_1.0.1.GA-N200906180431-H70.jar
/home/hudson/hudson_workspace/workspace/jbosstools-nightly-3.0.x/jbds-build/site/nightly/3.0.x/features/org.jboss.tools.jmx.feature_1.0.0.GA-N200906180431-H70.jar
/home/hudson/hudson_workspace/workspace/jbosstools-nightly-3.0.x/jbds-build/site/nightly/3.0.x/features/org.jboss.tools.esb.feature_1.1.1.GA-N200906180431-H70.jar
/home/hudson/hudson_workspace/workspace/jbosstools-nightly-3.0.x/jbds-build/site/nightly/3.0.x/features/org.jboss.tools.birt.feature_1.0.0.GA-N200906180431-H70.jar
/home/hudson/hudson_workspace/workspace/jbosstools-nightly-3.0.x/jbds-build/site/nightly/3.0.x/features/org.jboss.tools.jbpm.convert.feature_1.0.0.GA-N200906180431-H70.jar
/home/hudson/hudson_workspace/workspace/jbosstools-nightly-3.0.x/jbds-build/site/nightly/3.0.x/features/org.jboss.ide.eclipse.as.feature_2.0.1.GA-N200906180431-H70.jar
/home/hudson/hudson_workspace/workspace/jbosstools-nightly-3.0.x/jbds-build/site/nightly/3.0.x/features/org.jboss.ide.eclipse.freemarker.feature_1.0.2.GA-N200906180431-H70.jar
/home/hudson/hudson_workspace/workspace/jbosstools-nightly-3.0.x/jbds-build/site/nightly/3.0.x/features/org.hibernate.eclipse.feature_3.2.4.GA-N200906180431-H70.jar
/home/hudson/hudson_workspace/workspace/jbosstools-nightly-3.0.x/jbds-build/site/nightly/3.0.x/features/org.guvnor.tools.feature_5.0.1.26597-FINAL-N200906180431-H70.jar
/home/hudson/hudson_workspace/workspace/jbosstools-nightly-3.0.x/jbds-build/site/nightly/3.0.x/features/org.jboss.ide.eclipse.archives.feature_3.0.1.GA-N200906180431-H70.jar
/home/hudson/hudson_workspace/workspace/jbosstools-nightly-3.0.x/jbds-build/site/nightly/3.0.x/features/org.drools.eclipse.feature_5.0.1.26597-FINAL-N200906180431-H70.jar
/home/hudson/hudson_workspace/workspace/jbosstools-nightly-3.0.x/jbds-build/site/nightly/3.0.x/features/org.drools.eclipse.task.feature_5.0.1.26597-FINAL-N200906180431-H70.jar
/home/hudson/hudson_workspace/workspace/jbosstools-nightly-3.0.x/jbds-build/site/nightly/3.0.x/features/org.jboss.tools.project.examples.feature_1.0.0.GA-N200906180431-H70.jar ]]
++ mkdir -p jbossqa@download.jboss.org:/htdocs/jbosstools/updates/nightly/
++ rsync -arz --delete /home/hudson/hudson_workspace/workspace/jbosstools-nightly-3.0.x/jbds-build/site/nightly/3.0.x jbossqa@download.jboss.org:/htdocs/jbosstools/updates/nightly/
Terminating xvnc
[jbosstools-nightly-3.0.x] $ vncserver -kill :14
Killing Xvnc process ID 13888
[jbosstools-nightly-3.0.x] $ bash -xe /tmp/hudson2949948487754700029.sh
+ kill 13869
Recording test results
Recording Emma reports jbds-build/coverage.xml
Build was marked for publishing on https://hudson.jboss.org/hudson/
Email was triggered for: Unstable
Email was triggered for: Still Unstable
Trigger Unstable was overridden by another trigger and will not send an email.
There are 1 triggered emails.
Sending email for trigger: Still Unstable
--------------------------------------------------
15 years, 8 months
[Failure] jbosstools-nightly-3.1.0.M2 #272
by jboss-qa-internal@redhat.com
Public:
https://hudson.jboss.org/hudson//job/jbosstools-nightly-3.1.0.M2/272
https://hudson.jboss.org/hudson//job/jbosstools-nightly-3.1.0.M2/272/test...
https://hudson.jboss.org/hudson//job/jbosstools-nightly-3.1.0.M2/272/changes
https://hudson.jboss.org/hudson//job/jbosstools-nightly-3.1.0.M2/272/console
Internal:
http://hudson.qa.jboss.com/hudson/job/jbosstools-nightly-3.1.0.M2/272/
http://hudson.qa.jboss.com/hudson/job/jbosstools-nightly-3.1.0.M2/272//te...
http://hudson.qa.jboss.com/hudson/job/jbosstools-nightly-3.1.0.M2/272//ch...
http://hudson.qa.jboss.com/hudson/job/jbosstools-nightly-3.1.0.M2/272//co...
--------------------------------------------------
Failed Tests:
5 tests failed.
FAILED: org.drools.eclipse.AllTests
Error Message:
java.lang.Exception: Could not find plugin "org.drools.eclipse.test"
Stack Trace:
org.eclipse.test.EclipseTestRunner$TestFailedException: java.lang.Exception: Could not find plugin "org.drools.eclipse.test"
at org.eclipse.test.EclipseTestRunner.runFailed(EclipseTestRunner.java:288)
at org.eclipse.test.EclipseTestRunner.getTest(EclipseTestRunner.java:240)
at org.eclipse.test.EclipseTestRunner.<init>(EclipseTestRunner.java:220)
at org.eclipse.test.EclipseTestRunner.run(EclipseTestRunner.java:204)
at org.eclipse.test.UITestApplication$3.run(UITestApplication.java:195)
at org.eclipse.swt.widgets.RunnableLock.run(RunnableLock.java:35)
at org.eclipse.swt.widgets.Synchronizer.runAsyncMessages(Synchronizer.java:134)
at org.eclipse.swt.widgets.Display.runAsyncMessages(Display.java:3468)
at org.eclipse.swt.widgets.Display.readAndDispatch(Display.java:3115)
at org.eclipse.ui.internal.Workbench.runEventLoop(Workbench.java:2405)
at org.eclipse.ui.internal.Workbench.runUI(Workbench.java:2369)
at org.eclipse.ui.internal.Workbench.access$4(Workbench.java:2221)
at org.eclipse.ui.internal.Workbench$5.run(Workbench.java:500)
at org.eclipse.core.databinding.observable.Realm.runWithDefault(Realm.java:332)
at org.eclipse.ui.internal.Workbench.createAndRunWorkbench(Workbench.java:493)
at org.eclipse.ui.PlatformUI.createAndRunWorkbench(PlatformUI.java:149)
at org.eclipse.ui.internal.ide.application.IDEApplication.start(IDEApplication.java:113)
at org.eclipse.test.UITestApplication.runApplication(UITestApplication.java:138)
at org.eclipse.test.UITestApplication.run(UITestApplication.java:60)
at org.eclipse.test.UITestApplication.start(UITestApplication.java:210)
at org.eclipse.equinox.internal.app.EclipseAppHandle.run(EclipseAppHandle.java:194)
at org.eclipse.core.runtime.internal.adaptor.EclipseAppLauncher.runApplication(EclipseAppLauncher.java:110)
at org.eclipse.core.runtime.internal.adaptor.EclipseAppLauncher.start(EclipseAppLauncher.java:79)
at org.eclipse.core.runtime.adaptor.EclipseStarter.run(EclipseStarter.java:368)
at org.eclipse.core.runtime.adaptor.EclipseStarter.run(EclipseStarter.java:179)
at org.eclipse.equinox.launcher.Main.invokeFramework(Main.java:559)
at org.eclipse.equinox.launcher.Main.basicRun(Main.java:514)
at org.eclipse.equinox.launcher.Main.run(Main.java:1311)
at org.eclipse.equinox.launcher.Main.main(Main.java:1287)
at org.eclipse.core.launcher.Main.main(Main.java:34)
Caused by: java.lang.Exception: Could not find plugin "org.drools.eclipse.test"
at org.eclipse.test.EclipseTestRunner.loadSuiteClass(EclipseTestRunner.java:304)
at org.eclipse.test.EclipseTestRunner.getTest(EclipseTestRunner.java:237)
FAILED: ASTestSuite
Error Message:
null
Stack Trace:
junit.framework.AssertionFailedError
at org.jboss.ide.eclipse.as.test.publishing.JBIDE2512bTest.testJBIDE2512b(JBIDE2512bTest.java:48)
at org.eclipse.test.EclipseTestRunner.run(EclipseTestRunner.java:354)
at org.eclipse.test.EclipseTestRunner.run(EclipseTestRunner.java:206)
at org.eclipse.test.UITestApplication$3.run(UITestApplication.java:195)
at org.eclipse.swt.widgets.RunnableLock.run(RunnableLock.java:35)
at org.eclipse.swt.widgets.Synchronizer.runAsyncMessages(Synchronizer.java:134)
at org.eclipse.swt.widgets.Display.runAsyncMessages(Display.java:3468)
at org.eclipse.swt.widgets.Display.readAndDispatch(Display.java:3115)
at org.eclipse.ui.internal.Workbench.runEventLoop(Workbench.java:2405)
at org.eclipse.ui.internal.Workbench.runUI(Workbench.java:2369)
at org.eclipse.ui.internal.Workbench.access$4(Workbench.java:2221)
at org.eclipse.ui.internal.Workbench$5.run(Workbench.java:500)
at org.eclipse.core.databinding.observable.Realm.runWithDefault(Realm.java:332)
at org.eclipse.ui.internal.Workbench.createAndRunWorkbench(Workbench.java:493)
at org.eclipse.ui.PlatformUI.createAndRunWorkbench(PlatformUI.java:149)
at org.eclipse.ui.internal.ide.application.IDEApplication.start(IDEApplication.java:113)
at org.eclipse.test.UITestApplication.runApplication(UITestApplication.java:138)
at org.eclipse.test.UITestApplication.run(UITestApplication.java:60)
at org.eclipse.test.UITestApplication.start(UITestApplication.java:210)
at org.eclipse.equinox.internal.app.EclipseAppHandle.run(EclipseAppHandle.java:194)
at org.eclipse.core.runtime.internal.adaptor.EclipseAppLauncher.runApplication(EclipseAppLauncher.java:110)
at org.eclipse.core.runtime.internal.adaptor.EclipseAppLauncher.start(EclipseAppLauncher.java:79)
at org.eclipse.core.runtime.adaptor.EclipseStarter.run(EclipseStarter.java:368)
at org.eclipse.core.runtime.adaptor.EclipseStarter.run(EclipseStarter.java:179)
at org.eclipse.equinox.launcher.Main.invokeFramework(Main.java:559)
at org.eclipse.equinox.launcher.Main.basicRun(Main.java:514)
at org.eclipse.equinox.launcher.Main.run(Main.java:1311)
at org.eclipse.equinox.launcher.Main.main(Main.java:1287)
at org.eclipse.core.launcher.Main.main(Main.java:34)
FAILED: JMXCoreAllTests
Error Message:
Failed to retrieve RMIServer stub: javax.naming.ServiceUnavailableException [Root exception is java.rmi.ConnectException: Connection refused to host: localhost; nested exception is: java.net.ConnectException: Connection refused]
Stack Trace:
java.io.IOException: Failed to retrieve RMIServer stub: javax.naming.ServiceUnavailableException [Root exception is java.rmi.ConnectException: Connection refused to host: localhost; nested exception is:
java.net.ConnectException: Connection refused]
at javax.management.remote.rmi.RMIConnector.connect(RMIConnector.java:317)
at javax.management.remote.JMXConnectorFactory.connect(JMXConnectorFactory.java:248)
at org.jboss.tools.jmx.core.providers.DefaultConnectionWrapper.connect(DefaultConnectionWrapper.java:80)
at org.jboss.tools.jmx.core.tests.DefaultProviderTest.testConnection(DefaultProviderTest.java:116)
at org.eclipse.test.EclipseTestRunner.run(EclipseTestRunner.java:354)
at org.eclipse.test.EclipseTestRunner.run(EclipseTestRunner.java:206)
at org.eclipse.test.UITestApplication$3.run(UITestApplication.java:195)
at org.eclipse.swt.widgets.RunnableLock.run(RunnableLock.java:35)
at org.eclipse.swt.widgets.Synchronizer.runAsyncMessages(Synchronizer.java:134)
at org.eclipse.swt.widgets.Display.runAsyncMessages(Display.java:3468)
at org.eclipse.swt.widgets.Display.readAndDispatch(Display.java:3115)
at org.eclipse.ui.internal.Workbench.runEventLoop(Workbench.java:2405)
at org.eclipse.ui.internal.Workbench.runUI(Workbench.java:2369)
at org.eclipse.ui.internal.Workbench.access$4(Workbench.java:2221)
at org.eclipse.ui.internal.Workbench$5.run(Workbench.java:500)
at org.eclipse.core.databinding.observable.Realm.runWithDefault(Realm.java:332)
at org.eclipse.ui.internal.Workbench.createAndRunWorkbench(Workbench.java:493)
at org.eclipse.ui.PlatformUI.createAndRunWorkbench(PlatformUI.java:149)
at org.eclipse.ui.internal.ide.application.IDEApplication.start(IDEApplication.java:113)
at org.eclipse.test.UITestApplication.runApplication(UITestApplication.java:138)
at org.eclipse.test.UITestApplication.run(UITestApplication.java:60)
at org.eclipse.test.UITestApplication.start(UITestApplication.java:210)
at org.eclipse.equinox.internal.app.EclipseAppHandle.run(EclipseAppHandle.java:194)
at org.eclipse.core.runtime.internal.adaptor.EclipseAppLauncher.runApplication(EclipseAppLauncher.java:110)
at org.eclipse.core.runtime.internal.adaptor.EclipseAppLauncher.start(EclipseAppLauncher.java:79)
at org.eclipse.core.runtime.adaptor.EclipseStarter.run(EclipseStarter.java:368)
at org.eclipse.core.runtime.adaptor.EclipseStarter.run(EclipseStarter.java:179)
at org.eclipse.equinox.launcher.Main.invokeFramework(Main.java:559)
at org.eclipse.equinox.launcher.Main.basicRun(Main.java:514)
at org.eclipse.equinox.launcher.Main.run(Main.java:1311)
at org.eclipse.equinox.launcher.Main.main(Main.java:1287)
at org.eclipse.core.launcher.Main.main(Main.java:34)
Caused by: javax.naming.ServiceUnavailableException [Root exception is java.rmi.ConnectException: Connection refused to host: localhost; nested exception is:
java.net.ConnectException: Connection refused]
at com.sun.jndi.rmi.registry.RegistryContext.lookup(RegistryContext.java:97)
at com.sun.jndi.toolkit.url.GenericURLContext.lookup(GenericURLContext.java:185)
at javax.naming.InitialContext.lookup(InitialContext.java:351)
at javax.management.remote.rmi.RMIConnector.findRMIServerJNDI(RMIConnector.java:1817)
at javax.management.remote.rmi.RMIConnector.findRMIServer(RMIConnector.java:1787)
at javax.management.remote.rmi.RMIConnector.connect(RMIConnector.java:259)
Caused by: java.rmi.ConnectException: Connection refused to host: localhost; nested exception is:
java.net.ConnectException: Connection refused
at sun.rmi.transport.tcp.TCPEndpoint.newSocket(TCPEndpoint.java:574)
at sun.rmi.transport.tcp.TCPChannel.createConnection(TCPChannel.java:185)
at sun.rmi.transport.tcp.TCPChannel.newConnection(TCPChannel.java:171)
at sun.rmi.server.UnicastRef.newCall(UnicastRef.java:306)
at sun.rmi.registry.RegistryImpl_Stub.lookup(Unknown Source)
at com.sun.jndi.rmi.registry.RegistryContext.lookup(RegistryContext.java:93)
Caused by: java.net.ConnectException: Connection refused
at java.net.PlainSocketImpl.socketConnect(Native Method)
at java.net.PlainSocketImpl.doConnect(PlainSocketImpl.java:333)
at java.net.PlainSocketImpl.connectToAddress(PlainSocketImpl.java:195)
at java.net.PlainSocketImpl.connect(PlainSocketImpl.java:182)
at java.net.SocksSocketImpl.connect(SocksSocketImpl.java:366)
at java.net.Socket.connect(Socket.java:520)
at java.net.Socket.connect(Socket.java:470)
at java.net.Socket.<init>(Socket.java:367)
at java.net.Socket.<init>(Socket.java:180)
at sun.rmi.transport.proxy.RMIDirectSocketFactory.createSocket(RMIDirectSocketFactory.java:22)
at sun.rmi.transport.proxy.RMIMasterSocketFactory.createSocket(RMIMasterSocketFactory.java:128)
at sun.rmi.transport.tcp.TCPEndpoint.newSocket(TCPEndpoint.java:569)
FAILED: org.jboss.tools.jsf.vpe.jstl.test.JstlAllTests
Error Message:
java.lang.Exception: Could not find plugin "org.jboss.tools.jsf.vpe.jstl.test"
Stack Trace:
org.eclipse.test.EclipseTestRunner$TestFailedException: java.lang.Exception: Could not find plugin "org.jboss.tools.jsf.vpe.jstl.test"
at org.eclipse.test.EclipseTestRunner.runFailed(EclipseTestRunner.java:288)
at org.eclipse.test.EclipseTestRunner.getTest(EclipseTestRunner.java:240)
at org.eclipse.test.EclipseTestRunner.<init>(EclipseTestRunner.java:220)
at org.eclipse.test.EclipseTestRunner.run(EclipseTestRunner.java:204)
at org.eclipse.test.UITestApplication$3.run(UITestApplication.java:195)
at org.eclipse.swt.widgets.RunnableLock.run(RunnableLock.java:35)
at org.eclipse.swt.widgets.Synchronizer.runAsyncMessages(Synchronizer.java:134)
at org.eclipse.swt.widgets.Display.runAsyncMessages(Display.java:3468)
at org.eclipse.swt.widgets.Display.readAndDispatch(Display.java:3115)
at org.eclipse.ui.internal.Workbench.runEventLoop(Workbench.java:2405)
at org.eclipse.ui.internal.Workbench.runUI(Workbench.java:2369)
at org.eclipse.ui.internal.Workbench.access$4(Workbench.java:2221)
at org.eclipse.ui.internal.Workbench$5.run(Workbench.java:500)
at org.eclipse.core.databinding.observable.Realm.runWithDefault(Realm.java:332)
at org.eclipse.ui.internal.Workbench.createAndRunWorkbench(Workbench.java:493)
at org.eclipse.ui.PlatformUI.createAndRunWorkbench(PlatformUI.java:149)
at org.eclipse.ui.internal.ide.application.IDEApplication.start(IDEApplication.java:113)
at org.eclipse.test.UITestApplication.runApplication(UITestApplication.java:138)
at org.eclipse.test.UITestApplication.run(UITestApplication.java:60)
at org.eclipse.test.UITestApplication.start(UITestApplication.java:210)
at org.eclipse.equinox.internal.app.EclipseAppHandle.run(EclipseAppHandle.java:194)
at org.eclipse.core.runtime.internal.adaptor.EclipseAppLauncher.runApplication(EclipseAppLauncher.java:110)
at org.eclipse.core.runtime.internal.adaptor.EclipseAppLauncher.start(EclipseAppLauncher.java:79)
at org.eclipse.core.runtime.adaptor.EclipseStarter.run(EclipseStarter.java:368)
at org.eclipse.core.runtime.adaptor.EclipseStarter.run(EclipseStarter.java:179)
at org.eclipse.equinox.launcher.Main.invokeFramework(Main.java:559)
at org.eclipse.equinox.launcher.Main.basicRun(Main.java:514)
at org.eclipse.equinox.launcher.Main.run(Main.java:1311)
at org.eclipse.equinox.launcher.Main.main(Main.java:1287)
at org.eclipse.core.launcher.Main.main(Main.java:34)
Caused by: java.lang.Exception: Could not find plugin "org.jboss.tools.jsf.vpe.jstl.test"
at org.eclipse.test.EclipseTestRunner.loadSuiteClass(EclipseTestRunner.java:304)
at org.eclipse.test.EclipseTestRunner.getTest(EclipseTestRunner.java:237)
FAILED: SeamCoreAllTests
Error Message:
Component org.jboss.seam.mail.mailSession does not have java declaration.
Stack Trace:
junit.framework.AssertionFailedError: Component org.jboss.seam.mail.mailSession does not have java declaration.
at org.jboss.tools.seam.core.test.refactoring.SeamComponentRefactoringTest.renameComponent(SeamComponentRefactoringTest.java:152)
at org.jboss.tools.seam.core.test.refactoring.SeamComponentRefactoringTest.testJBIDE4447(SeamComponentRefactoringTest.java:133)
at junit.extensions.TestDecorator.basicRun(TestDecorator.java:24)
at junit.extensions.TestSetup$1.protect(TestSetup.java:21)
at junit.extensions.TestSetup.run(TestSetup.java:25)
at org.eclipse.test.EclipseTestRunner.run(EclipseTestRunner.java:354)
at org.eclipse.test.EclipseTestRunner.run(EclipseTestRunner.java:206)
at org.eclipse.test.UITestApplication$3.run(UITestApplication.java:195)
at org.eclipse.swt.widgets.RunnableLock.run(RunnableLock.java:35)
at org.eclipse.swt.widgets.Synchronizer.runAsyncMessages(Synchronizer.java:134)
at org.eclipse.swt.widgets.Display.runAsyncMessages(Display.java:3468)
at org.eclipse.swt.widgets.Display.readAndDispatch(Display.java:3115)
at org.eclipse.ui.internal.Workbench.runEventLoop(Workbench.java:2405)
at org.eclipse.ui.internal.Workbench.runUI(Workbench.java:2369)
at org.eclipse.ui.internal.Workbench.access$4(Workbench.java:2221)
at org.eclipse.ui.internal.Workbench$5.run(Workbench.java:500)
at org.eclipse.core.databinding.observable.Realm.runWithDefault(Realm.java:332)
at org.eclipse.ui.internal.Workbench.createAndRunWorkbench(Workbench.java:493)
at org.eclipse.ui.PlatformUI.createAndRunWorkbench(PlatformUI.java:149)
at org.eclipse.ui.internal.ide.application.IDEApplication.start(IDEApplication.java:113)
at org.eclipse.test.UITestApplication.runApplication(UITestApplication.java:138)
at org.eclipse.test.UITestApplication.run(UITestApplication.java:60)
at org.eclipse.test.UITestApplication.start(UITestApplication.java:210)
at org.eclipse.equinox.internal.app.EclipseAppHandle.run(EclipseAppHandle.java:194)
at org.eclipse.core.runtime.internal.adaptor.EclipseAppLauncher.runApplication(EclipseAppLauncher.java:110)
at org.eclipse.core.runtime.internal.adaptor.EclipseAppLauncher.start(EclipseAppLauncher.java:79)
at org.eclipse.core.runtime.adaptor.EclipseStarter.run(EclipseStarter.java:368)
at org.eclipse.core.runtime.adaptor.EclipseStarter.run(EclipseStarter.java:179)
at org.eclipse.equinox.launcher.Main.invokeFramework(Main.java:559)
at org.eclipse.equinox.launcher.Main.basicRun(Main.java:514)
at org.eclipse.equinox.launcher.Main.run(Main.java:1311)
at org.eclipse.equinox.launcher.Main.main(Main.java:1287)
at org.eclipse.core.launcher.Main.main(Main.java:34)
--------------------------------------------------
Changes:
[nickboldt] line breaks for clarity
[nickboldt] fix feature.xml and build.props (source plugin generation)
[akazakov] https://jira.jboss.org/jira/browse/JBIDE-2808
[nickboldt] add ETF plugins into tests features
[chukhutsina] <html><head><meta name="qrichtext" content="1" /></head><body style="font-size:9pt;font-family:Sans Serif">
<p>https://jira.jboss.org/jira/browse/JBDS-768 -Added the description of OpenOn available in components.xml to open jbpm files.</p>
</body></html>
[nickboldt] helps when you read your own comments :)
[nickboldt]
[nickboldt] https://jira.jboss.org/jira/browse/JBIDE-4498 so. hate. svn.
[nickboldt]
[nickboldt]
[nickboldt] https://jira.jboss.org/jira/browse/JBIDE-4498
[nickboldt] https://jira.jboss.org/jira/browse/JBIDE-4123 update to bits that will be Galileo release next week
--------------------------------------------------
Console log:
[...truncated 188021 lines...]
[java] !MESSAGE The installable unit org.jboss.tools.jmx.ui.test.translated_host_properties is missing the filename property.
[java]
[java] !ENTRY org.eclipse.equinox.p2.directorywatcher 4 0 2009-06-18 00:11:22.200
[java] !MESSAGE The installable unit org.eclipse.test.performance.win32.translated_host_properties is missing the filename property.
[java]
[java] !ENTRY org.eclipse.equinox.p2.directorywatcher 4 0 2009-06-18 00:11:22.950
[java] !MESSAGE The installable unit org.jboss.tools.jmx.ui.test.translated_host_properties is missing the filename property.
[java]
[java] !ENTRY org.eclipse.equinox.p2.directorywatcher 4 0 2009-06-18 00:11:22.951
[java] !MESSAGE The installable unit org.eclipse.test.performance.win32.translated_host_properties is missing the filename property.
[java]
[java] !ENTRY org.eclipse.equinox.p2.directorywatcher 4 0 2009-06-18 00:11:24.921
[java] !MESSAGE The installable unit org.jboss.tools.jmx.ui.test.translated_host_properties is missing the filename property.
[java]
[java] !ENTRY org.eclipse.equinox.p2.directorywatcher 4 0 2009-06-18 00:11:24.922
[java] !MESSAGE The installable unit org.eclipse.test.performance.win32.translated_host_properties is missing the filename property.
[java]
[java] !ENTRY org.eclipse.equinox.p2.directorywatcher 4 0 2009-06-18 00:11:24.977
[java] !MESSAGE The installable unit org.jboss.tools.jmx.ui.test.translated_host_properties is missing the filename property.
[java]
[java] !ENTRY org.eclipse.equinox.p2.directorywatcher 4 0 2009-06-18 00:11:24.979
[java] !MESSAGE The installable unit org.eclipse.test.performance.win32.translated_host_properties is missing the filename property.
[java] EMMA: collecting runtime coverage data ...
[java] EMMA: runtime coverage data merged into [/qa/services/hudson/hudson_workspace/workspace/jbosstools-nightly-3.1.0.M2/jbds-build/3.1.0.M2/200906172006/tests/eclipse/coverage.ec] {in 9 ms}
[echo] Copy .log files to /home/hudson/hudson_workspace/workspace/jbosstools-nightly-3.1.0.M2/org.jboss.ide.eclipse.releng/../jvmerrors
[mkdir] Created dir: /home/hudson/hudson_workspace/workspace/jbosstools-nightly-3.1.0.M2/jbds-build/3.1.0.M2/200906172006/tests/test-results/emma-coverage
[merge] processing input files ...
[merge] 2 file(s) read and merged in 1580 ms
[merge] merged/compacted data written to [/qa/services/hudson/hudson_workspace/workspace/jbosstools-nightly-3.1.0.M2/jbds-build/3.1.0.M2/200906172006/tests/test-results/emma-coverage/coverage.es] {in 427 ms}
[report] processing input files ...
[report] 1 file(s) read and merged in 549 ms
[report] writing [xml] report to [/home/hudson/hudson_workspace/workspace/jbosstools-nightly-3.1.0.M2/jbds-build/coverage.xml] ...
[report] writing [html] report to [/home/hudson/hudson_workspace/workspace/jbosstools-nightly-3.1.0.M2/jbds-build/3.1.0.M2/200906172006/tests/test-results/emma-coverage/index.html] ...
append-test-log:
collect:
[junitreport] the file /home/hudson/hudson_workspace/workspace/jbosstools-nightly-3.1.0.M2/jbds-build/3.1.0.M2/200906172006/tests/eclipse/org.jboss.tools.seam.ui.test.SeamUiAllTests-default.xml is empty.
[junitreport] This can be caused by the test JVM exiting unexpectedly
apply-stylesheet:
[style] Warning: the task name <style> is deprecated. Use <xslt> instead.
[style] Transforming into /home/hudson/hudson_workspace/workspace/jbosstools-nightly-3.1.0.M2/jbds-build/3.1.0.M2/200906172006/tests/test-results
[style] Processing /home/hudson/hudson_workspace/workspace/jbosstools-nightly-3.1.0.M2/jbds-build/3.1.0.M2/200906172006/tests/test-results/org.jboss.ide.eclipse.tests.xml to /home/hudson/hudson_workspace/workspace/jbosstools-nightly-3.1.0.M2/jbds-build/3.1.0.M2/200906172006/tests/test-results/org.jboss.ide.eclipse.tests.html
[style] Loading stylesheet /home/hudson/hudson_workspace/workspace/jbosstools-nightly-3.1.0.M2/org.jboss.ide.eclipse.releng/builders/tests/junit.xsl
[style] Warning: the task name <style> is deprecated. Use <xslt> instead.
[style] Transforming into /home/hudson/hudson_workspace/workspace/jbosstools-nightly-3.1.0.M2/jbds-build/3.1.0.M2/200906172006/tests/test-results
[style] Processing /home/hudson/hudson_workspace/workspace/jbosstools-nightly-3.1.0.M2/jbds-build/3.1.0.M2/200906172006/tests/test-results/org.jboss.ide.eclipse.tests.xml to /home/hudson/hudson_workspace/workspace/jbosstools-nightly-3.1.0.M2/jbds-build/3.1.0.M2/200906172006/tests/test-results/org.jboss.ide.eclipse.tests.properties
[style] Loading stylesheet /home/hudson/hudson_workspace/workspace/jbosstools-nightly-3.1.0.M2/org.jboss.ide.eclipse.releng/builders/tests/junit-properties.xsl
clean-test-eclipse:
[echo] Building JBossTools with build type 'build-results'
get.build.properties:
[echo] Getting version for 'jmx' builder to property 'jmx.versionTag' from /qa/services/hudson/hudson_workspace/workspace/jbosstools-nightly-3.1.0.M2/org.jboss.ide.eclipse.releng/builders/product/versionTags/jbosstools/3.1.0.M2.tags
[echo]
[echo] jbds-jmx-filename=JMX-1.1.0.M2-N200906172006-H272.zip
[echo] jbds-jmx-nodeps-filename=JMX-nodeps-1.1.0.M2-N200906172006-H272.zip
[echo]
[echo] Getting version for 'drools-ide' builder to property 'drools-ide.versionTag' from /qa/services/hudson/hudson_workspace/workspace/jbosstools-nightly-3.1.0.M2/org.jboss.ide.eclipse.releng/builders/product/versionTags/jbosstools/3.1.0.M2.tags
[echo]
[echo] jbds-drools-ide-filename=DroolsIDE-5.1.0.trunk-N200906172006-H272.zip
[echo] jbds-drools-ide-nodeps-filename=DroolsIDE-nodeps-5.1.0.trunk-N200906172006-H272.zip
[echo]
[loadfile] /home/hudson/hudson_workspace/workspace/jbosstools-nightly-3.1.0.M2/jbds-build/3.1.0.M2/200906172006/drools-ide/DroolsIDE-5.1.0.trunk-N200906172006-H272.zip.MD5 doesn't exist
[echo] Getting version for 'archives' builder to property 'archives.versionTag' from /qa/services/hudson/hudson_workspace/workspace/jbosstools-nightly-3.1.0.M2/org.jboss.ide.eclipse.releng/builders/product/versionTags/jbosstools/3.1.0.M2.tags
[echo]
[echo] jbds-archives-filename=JBossTools-Archives-3.1.0.M2-N200906172006-H272.zip
[echo] jbds-archives-nodeps-filename=JBossTools-Archives-nodeps-3.1.0.M2-N200906172006-H272.zip
[echo]
[echo] Getting version for 'xulrunner' builder to property 'xulrunner.versionTag' from /qa/services/hudson/hudson_workspace/workspace/jbosstools-nightly-3.1.0.M2/org.jboss.ide.eclipse.releng/builders/product/versionTags/jbosstools/3.1.0.M2.tags
[echo]
[echo] jbds-xulrunner-win32-filename=XulRunner-win32-1.0.0.GA-N200906172006-H272.zip
[echo] jbds-xulrunner-win32-nodeps-filename=XulRunner-win32-nodeps-1.0.0.GA-N200906172006-H272.zip
[echo]
[echo] Getting version for 'xulrunner' builder to property 'xulrunner.versionTag' from /qa/services/hudson/hudson_workspace/workspace/jbosstools-nightly-3.1.0.M2/org.jboss.ide.eclipse.releng/builders/product/versionTags/jbosstools/3.1.0.M2.tags
[echo]
[echo] jbds-xulrunner-linux-gtk-filename=XulRunner-linux-gtk-1.0.0.GA-N200906172006-H272.zip
[echo] jbds-xulrunner-linux-gtk-nodeps-filename=XulRunner-linux-gtk-nodeps-1.0.0.GA-N200906172006-H272.zip
[echo]
[echo] Getting version for 'xulrunner' builder to property 'xulrunner.versionTag' from /qa/services/hudson/hudson_workspace/workspace/jbosstools-nightly-3.1.0.M2/org.jboss.ide.eclipse.releng/builders/product/versionTags/jbosstools/3.1.0.M2.tags
[echo]
[echo] jbds-xulrunner-linux-gtk-x86_64-filename=XulRunner-linux-gtk-x86_64-1.0.0.GA-N200906172006-H272.zip
[echo] jbds-xulrunner-linux-gtk-x86_64-nodeps-filename=XulRunner-linux-gtk-x86_64-nodeps-1.0.0.GA-N200906172006-H272.zip
[echo]
[echo] Getting version for 'xulrunner' builder to property 'xulrunner.versionTag' from /qa/services/hudson/hudson_workspace/workspace/jbosstools-nightly-3.1.0.M2/org.jboss.ide.eclipse.releng/builders/product/versionTags/jbosstools/3.1.0.M2.tags
[echo]
[echo] jbds-xulrunner-macosx-carbon-filename=XulRunner-macosx-carbon-1.0.0.GA-N200906172006-H272.zip
[echo] jbds-xulrunner-macosx-carbon-nodeps-filename=XulRunner-macosx-carbon-nodeps-1.0.0.GA-N200906172006-H272.zip
[echo]
[echo] Getting version for 'richfaces' builder to property 'richfaces.versionTag' from /qa/services/hudson/hudson_workspace/workspace/jbosstools-nightly-3.1.0.M2/org.jboss.ide.eclipse.releng/builders/product/versionTags/jbosstools/3.1.0.M2.tags
[echo]
[echo] jbds-richfaces-win32-filename=RichFaces-VPE-win32-3.1.0.M2-N200906172006-H272.zip
[echo] jbds-richfaces-win32-nodeps-filename=RichFaces-VPE-win32-nodeps-3.1.0.M2-N200906172006-H272.zip
[echo]
[echo] Getting version for 'richfaces' builder to property 'richfaces.versionTag' from /qa/services/hudson/hudson_workspace/workspace/jbosstools-nightly-3.1.0.M2/org.jboss.ide.eclipse.releng/builders/product/versionTags/jbosstools/3.1.0.M2.tags
[echo]
[echo] jbds-richfaces-linux-gtk-filename=RichFaces-VPE-linux-gtk-3.1.0.M2-N200906172006-H272.zip
[echo] jbds-richfaces-linux-gtk-nodeps-filename=RichFaces-VPE-linux-gtk-nodeps-3.1.0.M2-N200906172006-H272.zip
[echo]
[echo] Getting version for 'richfaces' builder to property 'richfaces.versionTag' from /qa/services/hudson/hudson_workspace/workspace/jbosstools-nightly-3.1.0.M2/org.jboss.ide.eclipse.releng/builders/product/versionTags/jbosstools/3.1.0.M2.tags
[echo]
[echo] jbds-richfaces-linux-gtk-x86_64-filename=RichFaces-VPE-linux-gtk-x86_64-3.1.0.M2-N200906172006-H272.zip
[echo] jbds-richfaces-linux-gtk-x86_64-nodeps-filename=RichFaces-VPE-linux-gtk-x86_64-nodeps-3.1.0.M2-N200906172006-H272.zip
[echo]
[echo] Getting version for 'richfaces' builder to property 'richfaces.versionTag' from /qa/services/hudson/hudson_workspace/workspace/jbosstools-nightly-3.1.0.M2/org.jboss.ide.eclipse.releng/builders/product/versionTags/jbosstools/3.1.0.M2.tags
[echo]
[echo] jbds-richfaces-macosx-carbon-filename=RichFaces-VPE-macosx-carbon-3.1.0.M2-N200906172006-H272.zip
[echo] jbds-richfaces-macosx-carbon-nodeps-filename=RichFaces-VPE-macosx-carbon-nodeps-3.1.0.M2-N200906172006-H272.zip
[echo]
[echo] Getting version for 'jbpm-convert' builder to property 'jbpm-convert.versionTag' from /qa/services/hudson/hudson_workspace/workspace/jbosstools-nightly-3.1.0.M2/org.jboss.ide.eclipse.releng/builders/product/versionTags/jbosstools/3.1.0.M2.tags
[echo]
[echo] jbds-jbpm-convert-filename=jBPM-Convert-1.1.0.M2-N200906172006-H272.zip
[echo] jbds-jbpm-convert-nodeps-filename=jBPM-Convert-nodeps-1.1.0.M2-N200906172006-H272.zip
[echo]
[echo] Getting version for 'freemarker' builder to property 'freemarker.versionTag' from /qa/services/hudson/hudson_workspace/workspace/jbosstools-nightly-3.1.0.M2/org.jboss.ide.eclipse.releng/builders/product/versionTags/jbosstools/3.1.0.M2.tags
[echo]
[echo] jbds-freemarker-filename=FreeMarkerIDE-1.1.0.M2-N200906172006-H272.zip
[echo] jbds-freemarker-nodeps-filename=
[echo]
[length] /home/hudson/hudson_workspace/workspace/jbosstools-nightly-3.1.0.M2/jbds-build/3.1.0.M2/200906172006/freemarker is a directory; length unspecified
[echo] Getting version for 'hibernate-tools' builder to property 'hibernate-tools.versionTag' from /qa/services/hudson/hudson_workspace/workspace/jbosstools-nightly-3.1.0.M2/org.jboss.ide.eclipse.releng/builders/product/versionTags/jbosstools/3.1.0.M2.tags
[echo]
[echo] jbds-hibernate-tools-filename=HibernateTools-3.3.0.M2-N200906172006-H272.zip
[echo] jbds-hibernate-tools-nodeps-filename=HibernateTools-nodeps-3.3.0.M2-N200906172006-H272.zip
[echo]
[echo] Getting version for 'struts' builder to property 'struts.versionTag' from /qa/services/hudson/hudson_workspace/workspace/jbosstools-nightly-3.1.0.M2/org.jboss.ide.eclipse.releng/builders/product/versionTags/jbosstools/3.1.0.M2.tags
[echo]
[echo] jbds-struts-filename=StrutsTools-3.1.0.M2-N200906172006-H272.zip
[echo] jbds-struts-nodeps-filename=StrutsTools-nodeps-3.1.0.M2-N200906172006-H272.zip
[echo]
[echo] Getting version for 'jbpm' builder to property 'jbpm.versionTag' from /qa/services/hudson/hudson_workspace/workspace/jbosstools-nightly-3.1.0.M2/org.jboss.ide.eclipse.releng/builders/product/versionTags/jbosstools/3.1.0.M2.tags
[echo]
[echo] jbds-jbpm-filename=jBPM-Designer-3.1.7.GA-N200906172006-H272.zip
[echo] jbds-jbpm-nodeps-filename=jBPM-Designer-nodeps-3.1.7.GA-N200906172006-H272.zip
[echo]
[echo] Getting version for 'as' builder to property 'as.versionTag' from /qa/services/hudson/hudson_workspace/workspace/jbosstools-nightly-3.1.0.M2/org.jboss.ide.eclipse.releng/builders/product/versionTags/jbosstools/3.1.0.M2.tags
[echo]
[echo] jbds-as-filename=JBossAS-Tools-2.1.0.M2-N200906172006-H272.zip
[echo] jbds-as-nodeps-filename=JBossAS-Tools-nodeps-2.1.0.M2-N200906172006-H272.zip
[echo]
[echo] Getting version for 'seam' builder to property 'seam.versionTag' from /qa/services/hudson/hudson_workspace/workspace/jbosstools-nightly-3.1.0.M2/org.jboss.ide.eclipse.releng/builders/product/versionTags/jbosstools/3.1.0.M2.tags
[echo]
[echo] jbds-seam-filename=SeamTools-3.1.0.M2-N200906172006-H272.zip
[echo] jbds-seam-nodeps-filename=SeamTools-nodeps-3.1.0.M2-N200906172006-H272.zip
[echo]
[echo] Getting version for 'examples' builder to property 'examples.versionTag' from /qa/services/hudson/hudson_workspace/workspace/jbosstools-nightly-3.1.0.M2/org.jboss.ide.eclipse.releng/builders/product/versionTags/jbosstools/3.1.0.M2.tags
[echo]
[echo] jbds-examples-filename=JBossTools-Examples-1.1.0.M2-N200906172006-H272.zip
[echo] jbds-examples-nodeps-filename=JBossTools-Examples-nodeps-1.1.0.M2-N200906172006-H272.zip
[echo]
[echo] Getting version for 'esb' builder to property 'esb.versionTag' from /qa/services/hudson/hudson_workspace/workspace/jbosstools-nightly-3.1.0.M2/org.jboss.ide.eclipse.releng/builders/product/versionTags/jbosstools/3.1.0.M2.tags
[echo]
[echo] jbds-esb-filename=JBossTools-ESB-1.3.0.M2-N200906172006-H272.zip
[echo] jbds-esb-nodeps-filename=JBossTools-ESB-nodeps-1.3.0.M2-N200906172006-H272.zip
[echo]
[echo] Getting version for 'ws' builder to property 'ws.versionTag' from /qa/services/hudson/hudson_workspace/workspace/jbosstools-nightly-3.1.0.M2/org.jboss.ide.eclipse.releng/builders/product/versionTags/jbosstools/3.1.0.M2.tags
[echo]
[echo] jbds-ws-filename=JBossWS-Tools-1.1.0.M2-N200906172006-H272.zip
[echo] jbds-ws-nodeps-filename=JBossWS-Tools-nodeps-1.1.0.M2-N200906172006-H272.zip
[echo]
[echo] Getting version for 'birt' builder to property 'birt.versionTag' from /qa/services/hudson/hudson_workspace/workspace/jbosstools-nightly-3.1.0.M2/org.jboss.ide.eclipse.releng/builders/product/versionTags/jbosstools/3.1.0.M2.tags
[echo]
[echo] jbds-birt-filename=JBossTools-BIRT-1.1.0.M2-N200906172006-H272.zip
[echo] jbds-birt-nodeps-filename=JBossTools-BIRT-nodeps-1.1.0.M2-N200906172006-H272.zip
[echo]
[echo] Getting version for 'portlet' builder to property 'portlet.versionTag' from /qa/services/hudson/hudson_workspace/workspace/jbosstools-nightly-3.1.0.M2/org.jboss.ide.eclipse.releng/builders/product/versionTags/jbosstools/3.1.0.M2.tags
[echo]
[echo] jbds-portlet-filename=JBoss-Portlet-Tools-1.1.0.M2-N200906172006-H272.zip
[echo] jbds-portlet-nodeps-filename=JBoss-Portlet-Tools-nodeps-1.1.0.M2-N200906172006-H272.zip
[echo]
[echo] Getting version for 'smooks' builder to property 'smooks.versionTag' from /qa/services/hudson/hudson_workspace/workspace/jbosstools-nightly-3.1.0.M2/org.jboss.ide.eclipse.releng/builders/product/versionTags/jbosstools/3.1.0.M2.tags
[echo]
[echo] jbds-smooks-filename=JBossTools-Smooks-1.1.0.M2-N200906172006-H272.zip
[echo] jbds-smooks-nodeps-filename=JBossTools-Smooks-nodeps-1.1.0.M2-N200906172006-H272.zip
[echo]
[echo] Getting version for 'tptp' builder to property 'tptp.versionTag' from /qa/services/hudson/hudson_workspace/workspace/jbosstools-nightly-3.1.0.M2/org.jboss.ide.eclipse.releng/builders/product/versionTags/jbosstools/3.1.0.M2.tags
[echo]
[echo] jbds-tptp-filename=JBoss-TPTP-Tools-1.1.0.M2-N200906172006-H272.zip
[echo] jbds-tptp-nodeps-filename=JBoss-TPTP-Tools-nodeps-1.1.0.M2-N200906172006-H272.zip
[echo]
[move] Moving 1 file to /home/hudson/hudson_workspace/workspace/jbosstools-nightly-3.1.0.M2/jbds-build/3.1.0.M2/200906172006/all
[loadfile] /home/hudson/hudson_workspace/workspace/jbosstools-nightly-3.1.0.M2/jbds-build/3.1.0.M2/200906172006/installer/build/jbdevstudio-win32-${installer.version.major}.${installer.version.minor}.${installer.version.revision}.${installer.version.tag}-N200906172006-H272.jar.MD5 doesn't exist
[loadfile] /home/hudson/hudson_workspace/workspace/jbosstools-nightly-3.1.0.M2/jbds-build/3.1.0.M2/200906172006/installer/build/jbdevstudio-linux-gtk-${installer.version.major}.${installer.version.minor}.${installer.version.revision}.${installer.version.tag}-N200906172006-H272.jar.MD5 doesn't exist
[loadfile] /home/hudson/hudson_workspace/workspace/jbosstools-nightly-3.1.0.M2/jbds-build/3.1.0.M2/200906172006/installer/build/jbdevstudio-linux-gtk-x86_64-${installer.version.major}.${installer.version.minor}.${installer.version.revision}.${installer.version.tag}-N200906172006-H272.jar.MD5 doesn't exist
[loadfile] /home/hudson/hudson_workspace/workspace/jbosstools-nightly-3.1.0.M2/jbds-build/3.1.0.M2/200906172006/installer/build/jbdevstudio-macosx-carbon-${installer.version.major}.${installer.version.minor}.${installer.version.revision}.${installer.version.tag}-N200906172006-H272.jar.MD5 doesn't exist
[loadfile] /home/hudson/hudson_workspace/workspace/jbosstools-nightly-3.1.0.M2/jbds-build/3.1.0.M2/200906172006/installer/build/jbdevstudio-eap-win32-${installer.version.major}.${installer.version.minor}.${installer.version.revision}.${installer.version.tag}-N200906172006-H272.jar.MD5 doesn't exist
[loadfile] /home/hudson/hudson_workspace/workspace/jbosstools-nightly-3.1.0.M2/jbds-build/3.1.0.M2/200906172006/installer/build/jbdevstudio-eap-linux-gtk-${installer.version.major}.${installer.version.minor}.${installer.version.revision}.${installer.version.tag}-N200906172006-H272.jar.MD5 doesn't exist
[loadfile] /home/hudson/hudson_workspace/workspace/jbosstools-nightly-3.1.0.M2/jbds-build/3.1.0.M2/200906172006/installer/build/jbdevstudio-eap-linux-gtk-x86_64-${installer.version.major}.${installer.version.minor}.${installer.version.revision}.${installer.version.tag}-N200906172006-H272.jar.MD5 doesn't exist
[loadfile] /home/hudson/hudson_workspace/workspace/jbosstools-nightly-3.1.0.M2/jbds-build/3.1.0.M2/200906172006/installer/build/jbdevstudio-eap-macosx-carbon-${installer.version.major}.${installer.version.minor}.${installer.version.revision}.${installer.version.tag}-N200906172006-H272.jar.MD5 doesn't exist
[stopwatch] [buildTimer: 214:26.465 sec]
analyze-log:
BUILD FAILED
/qa/services/hudson/hudson_workspace/workspace/jbosstools-nightly-3.1.0.M2/org.jboss.ide.eclipse.releng/builders/buildNightly.xml:12: The following error occurred while executing this line:
/qa/services/hudson/hudson_workspace/workspace/jbosstools-nightly-3.1.0.M2/org.jboss.ide.eclipse.releng/builders/build.xml:69: The following error occurred while executing this line:
/qa/services/hudson/hudson_workspace/workspace/jbosstools-nightly-3.1.0.M2/org.jboss.ide.eclipse.releng/builders/build.xml:27: The following error occurred while executing this line:
/qa/services/hudson/hudson_workspace/workspace/jbosstools-nightly-3.1.0.M2/org.jboss.ide.eclipse.releng/builders/build.xml:39: The following error occurred while executing this line:
/qa/services/hudson/hudson_workspace/workspace/jbosstools-nightly-3.1.0.M2/org.jboss.ide.eclipse.releng/builders/product/productBuild.xml:93: The following error occurred while executing this line:
/qa/services/hudson/hudson_workspace/workspace/jbosstools-nightly-3.1.0.M2/org.jboss.ide.eclipse.releng/builders/product/productBuild.xml:158: The following error occurred while executing this line:
/qa/services/hudson/hudson_workspace/workspace/jbosstools-nightly-3.1.0.M2/org.jboss.ide.eclipse.releng/builders/product/buildResults/buildResults.xml:279: The following error occurred while executing this line:
/qa/services/hudson/hudson_workspace/workspace/jbosstools-nightly-3.1.0.M2/org.jboss.ide.eclipse.releng/builders/product/buildResults/analyzeLog.xml:17: java.lang.NullPointerException
Total time: 225 minutes 34 seconds
++ cd ../configs/jbds
++ zip build.log.zip build.log
updating: build.log (deflated 95%)
++ cd ../..
+++ date +%s
++ endtime=1245298611
+++ echo 'scale=2; (1245298611 - 1245284888)/60'
+++ bc -l
++ elapsed=228.71
++ echo 'Elapsed time: 228.71mins.'
Elapsed time: 228.71mins.
++ [[ '' == \l\o\c\a\l ]]
+++ cat /home/hudson/hudson_workspace/workspace/jbosstools-nightly-3.1.0.M2/jbds-build/buildData.properties
+++ grep product.releaseNumber
+++ perl -ne 's/[\s\t]+product.releaseNumber=//g;print;'
++ version=3.1.0.M2
+++ cat /home/hudson/hudson_workspace/workspace/jbosstools-nightly-3.1.0.M2/jbds-build/buildData.properties
+++ grep upload.to
+++ perl -ne 's/[\s\t]+upload.to=//g;print;'
++ builddir=nightly/3.1.0.M2/200906172006
+++ cat /home/hudson/hudson_workspace/workspace/jbosstools-nightly-3.1.0.M2/jbds-build/buildData.properties
+++ grep product.buildDesc
+++ perl -ne 's/[\s\t]+product.buildDesc=//g; print;'
++ buildtype=nightly
+++ cat /home/hudson/hudson_workspace/workspace/jbosstools-nightly-3.1.0.M2/jbds-build/buildData.properties
+++ grep product.releaseNumber
+++ perl -ne 's/[\s\t]+product.releaseNumber=//g; print;'
++ releaseNumber=3.1.0.M2
++ DESTINATION=jbossqa@download.jboss.org:/htdocs/jbosstools
++ scp -r /home/hudson/hudson_workspace/workspace/jbosstools-nightly-3.1.0.M2/jbds-build/3.1.0.M2 jbossqa@download.jboss.org:/htdocs/jbosstools/builds/nightly/
++ scp configs/jbds/build.log.zip jbossqa@download.jboss.org:/htdocs/jbosstools/builds/nightly/3.1.0.M2/200906172006/
++ scp /home/hudson/hudson_workspace/workspace/jbosstools-nightly-3.1.0.M2/jbds-build/latestBuild.html jbossqa@download.jboss.org:/htdocs/jbosstools/builds/nightly/
/home/hudson/hudson_workspace/workspace/jbosstools-nightly-3.1.0.M2/jbds-build/latestBuild.html: No such file or directory
Terminating xvnc
[jbosstools-nightly-3.1.0.M2] $ vncserver -kill :10
Killing Xvnc process ID 21857
[jbosstools-nightly-3.1.0.M2] $ bash -xe /tmp/hudson8258616101083550717.sh
+ kill 21838
Recording test results
Recording Emma reports jbds-build/coverage.xml
Build was marked for publishing on https://hudson.jboss.org/hudson/
Email was triggered for: Failure
There are 1 triggered emails.
Sending email for trigger: Failure
--------------------------------------------------
15 years, 8 months