[Failure] jbosstools-nightly-3.1.0.M2 #249
by jboss-qa-internal@redhat.com
Public:
https://hudson.jboss.org/hudson//job/jbosstools-nightly-3.1.0.M2/249
https://hudson.jboss.org/hudson//job/jbosstools-nightly-3.1.0.M2/249/test...
https://hudson.jboss.org/hudson//job/jbosstools-nightly-3.1.0.M2/249/changes
https://hudson.jboss.org/hudson//job/jbosstools-nightly-3.1.0.M2/249/console
Internal:
http://hudson.qa.jboss.com/hudson/job/jbosstools-nightly-3.1.0.M2/249/
http://hudson.qa.jboss.com/hudson/job/jbosstools-nightly-3.1.0.M2/249//te...
http://hudson.qa.jboss.com/hudson/job/jbosstools-nightly-3.1.0.M2/249//ch...
http://hudson.qa.jboss.com/hudson/job/jbosstools-nightly-3.1.0.M2/249//co...
--------------------------------------------------
Failed Tests:
No tests ran.
--------------------------------------------------
Changes:
[nickboldt] JBIDE-4319 initial builder files; map incomplete, testing.properties incomplete. See TODOs
[scabanovich] https://jira.jboss.org/jira/browse/JBIDE-4433
[scabanovich] JBIDE-4393, Debugging print removed.
[nickboldt] initial (incomplete / invalid) maps as starting point
[scabanovich] https://jira.jboss.org/jira/browse/JBIDE-831
[scabanovich] https://jira.jboss.org/jira/browse/JBIDE-4356
[chukhutsina] <html><head><meta name="qrichtext" content="1" /></head><body style="font-size:9pt;font-family:Sans Serif">
<p>https://jira.jboss.org/jira/browse/JBDS-756 - Generate Hibernate/JPA annotations view was described in hibernate-Doc.New screens were added.</p>
</body></html>
[chukhutsina] <html><head><meta name="qrichtext" content="1" /></head><body style="font-size:9pt;font-family:Sans Serif">
<p>https://jira.jboss.org/jira/browse/JBDS-756 - Generate Hibernate/JPA annotations view was described in hibernate-Doc.</p>
</body></html>
[mareshkau] test project for https://jira.jboss.org/jira/browse/JBIDE-3247
[scabanovich] https://jira.jboss.org/jira/browse/JBIDE-4213
[scabanovich] https://jira.jboss.org/jira/browse/JBIDE-4213
[mareshkau] revert changes which was in r15848, uncomment failed junit tests
[scabanovich] https://jira.jboss.org/jira/browse/JBIDE-4213
[sdzmitrovich] VPE Tests committed. All failures were fixed for JBT 3.1.0 M2
[vyemialyanchyk] https://jira.jboss.org/jira/browse/JBIDE-4417 - if file not found - add error message box
[scabanovich] https://jira.jboss.org/jira/browse/JBIDE-4213
[scabanovich] https://jira.jboss.org/jira/browse/JBIDE-4213
[scabanovich] https://jira.jboss.org/jira/browse/JBIDE-4213
[mareshkau] Failed junit has been commented, need to wait for JBIDE-4213 fix
[scabanovich] https://jira.jboss.org/jira/browse/JBIDE-4393 More tests added
[mareshkau] Test was extended to check two custom tag libraries
[rob.stryker(a)jboss.com] fixed a bug in the new override plugin
[nickboldt] JBIDE-4463 new plugin for AS
--------------------------------------------------
Console log:
[...truncated 30119 lines...]
[get] ....................................................
[get] ....................................................
[get] ....................................................
[get] ....................................................
[get] ....................................................
[get] ....................................................
[get] ....................................................
[get] ....................................................
[get] ....................................................
[get] ....................................................
[get] ....................................................
[get] ....................................................
[get] ....................................................
[get] ....................................................
[get] ....................................................
[get] ....................................................
[get] ....................................................
[get] ....................................................
[get] ....................................................
[get] ....................................................
[get] ....................................................
[get] ....................................................
[get] ....................................................
[get] ....................................................
[get] ....................................................
[get] ....................................................
[get] ....................................................
[get] ....................................................
[get] ....................................................
[get] ....................................................
[get] ....................................................
[get] ....................................................
[get] ....................................................
[get] ....................................................
[get] ....................................................
[get] ....................................................
[get] ....................................................
[get] ....................................................
[get] ....................................................
[get] ....................................................
[get] ....................................................
[get] ....................................................
[get] ....................................................
[get] ....................................................
[get] ....................................................
[get] ....................................................
[get] ....................................................
[get] ....................................................
[get] ....................................................
[get] ....................................................
[get] ....................................................
[get] ....................................................
[get] ....................................................
[get] ....................................................
[get] ....................................................
[get] ....................................................
[get] ....................................................
[get] ....................................................
[get] ....................................................
[get] ....................................................
[get] ....................................................
[get] ....................................................
[get] ....................................................
[get] ....................................................
[get] ....................................................
[get] ....................................................
[get] ....................................................
[get] ....................................................
[get] ....................................................
[get] ....................................................
[get] ....................................................
[get] ....................................................
[get] ....................................................
[get] ....................................................
[get] ....................................................
[get] ....................................................
[get] ....................................................
[get] ....................................................
[get] ....................................................
[get] ....................................................
[get] ....................................................
[get] ....................................................
[get] ....................................................
[get] ....................................................
[get] ....................................................
[get] ....................................................
[get] ....................................................
[get] ....................................................
[get] ....................................................
[get] ....................................................
[get] ....................................................
[get] ....................................................
[get] ....................................................
[get] ....................................................
[get] ....................................................
[get] ....................................................
[get] ....................................................
[get] ....................................................
[get] ....................................................
[get] ....................................................
[get] ....................................................
[get] ....................................................
[get] ....................................................
[get] ....................................................
[get] ....................................................
[get] ....................................................
[get] ....................................................
[get] ....................................................
[get] ....................................................
[get] ....................................................
[get] ....................................................
[get] ....................................................
[get] ....................................................
[get] ....................................................
[get] ....................................................
[get] ....................................................
[get] ....................................................
[get] ....................................................
[get] ....................................................
[get] ....................................................
[get] ....................................................
[get] ....................................................
[get] ....................................................
[get] ....................................................
[get] ....................................................
[get] ....................................................
[get] ....................................................
[get] ....................................................
[get] ....................................................
[get] ....................................................
[get] ....................................................
[get] ....................................................
[get] ....................................................
[get] ....................................................
[get] ....................................................
[get] ....................................................
[get] ....................................................
[get] ....................................................
[get] ....................................................
[get] ....................................................
[get] ....................................................
[get] ....................................................
[get] ....................................................
[get] ....................................................
[get] ....................................................
[get] ....................................................
[get] ....................................................
[get] ....................................................
[get] ....................................................
[get] ....................................................
[get] ....................................................
[get] ....................................................
[get] ....................................................
[get] ....................................................
[get] ....................................................
[get] ....................................................
[get] ....................................................
[get] ....................................................
[get] ....................................................
[get] ....................................................
[get] ....................................................
[get] ....................................................
[get] ....................................................
[get] ....................................................
[get] ....................................................
[get] ....................................................
[get] ....................................................
[get] ....................................................
[get] ....................................................
[get] ....................................................
[get] ....................................................
[get] ....................................................
[get] ....................................................
[get] ....................................................
[get] ....................................................
[get] ....................................................
[get] ....................................................
[get] ....................................................
[get] ....................................................
[get] ....................................................
[get] ....................................................
[get] ....................................................
[get] ....................................................
[get] ....................................................
[get] ....................................................
[get] ....................................................
[get] ....................................................
[get] ....................................................
[get] ....................................................
[get] ....................................................
[get] ....................................................
[get] ....................................................
[get] ....................................................
[get] ....................................................
[get] ....................................................
[get] ....................................................
[get] ....................................................
[get] ....................................................
[get] ....................................................
[get] ....................................................
[get] ....................................................
[get] ....................................................
[get] ....................................................
[get] ....................................................
[get] ....................................................
[get] ....................................................
[get] ....................................................
[get] ....................................................
[get] ....................................................
[get] ....................................................
[get] ....................................................
[get] ..........................
build.driver:
[unzip] Expanding: /qa/hudson_ws/workspace/jbosstools-nightly-3.1.0.M2/jbds-build/requirements/birt/birt-report-framework-sdk-2.5RC2.zip into /qa/hudson_ws/workspace/jbosstools-nightly-3.1.0.M2/jbds-build/clean-eclipse
BUILD FAILED
/qa/hudson_ws/workspace/jbosstools-nightly-3.1.0.M2/org.jboss.ide.eclipse.releng/builders/buildNightly.xml:12: The following error occurred while executing this line:
/qa/hudson_ws/workspace/jbosstools-nightly-3.1.0.M2/org.jboss.ide.eclipse.releng/builders/build.xml:69: The following error occurred while executing this line:
/qa/hudson_ws/workspace/jbosstools-nightly-3.1.0.M2/org.jboss.ide.eclipse.releng/builders/build.xml:27: The following error occurred while executing this line:
/qa/hudson_ws/workspace/jbosstools-nightly-3.1.0.M2/org.jboss.ide.eclipse.releng/builders/build.xml:39: The following error occurred while executing this line:
/qa/hudson_ws/workspace/jbosstools-nightly-3.1.0.M2/org.jboss.ide.eclipse.releng/builders/product/productBuild.xml:93: The following error occurred while executing this line:
/qa/hudson_ws/workspace/jbosstools-nightly-3.1.0.M2/org.jboss.ide.eclipse.releng/builders/product/productBuild.xml:357: The following error occurred while executing this line:
/qa/hudson_ws/workspace/jbosstools-nightly-3.1.0.M2/org.jboss.ide.eclipse.releng/builders/product/productBuild.xml:359: The following error occurred while executing this line:
/qa/hudson_ws/workspace/jbosstools-nightly-3.1.0.M2/org.jboss.ide.eclipse.releng/builders/product/productBuild.xml:294: The following error occurred while executing this line:
/qa/hudson_ws/workspace/jbosstools-nightly-3.1.0.M2/org.jboss.ide.eclipse.releng/builders/builder-wrap.xml:53: The following error occurred while executing this line:
/qa/hudson_ws/workspace/jbosstools-nightly-3.1.0.M2/org.jboss.ide.eclipse.releng/builders/builder-wrap.xml:89: The following error occurred while executing this line:
/qa/hudson_ws/workspace/jbosstools-nightly-3.1.0.M2/org.jboss.ide.eclipse.releng/builders/common/buildRequirements.xml:13: The following error occurred while executing this line:
/qa/hudson_ws/workspace/jbosstools-nightly-3.1.0.M2/org.jboss.ide.eclipse.releng/builders/common/buildRequirements.xml:25: The following error occurred while executing this line:
/qa/hudson_ws/workspace/jbosstools-nightly-3.1.0.M2/org.jboss.ide.eclipse.releng/requirements/birt/buildRequirement.xml:5: The following error occurred while executing this line:
/qa/hudson_ws/workspace/jbosstools-nightly-3.1.0.M2/org.jboss.ide.eclipse.releng/requirements/webtools/buildDriver.xml:8: Error while expanding /qa/hudson_ws/workspace/jbosstools-nightly-3.1.0.M2/jbds-build/requirements/birt/birt-report-framework-sdk-2.5RC2.zip
java.io.IOException: No space left on device
Total time: 8 minutes 58 seconds
+ cd ../configs/jbds
+ zip build.log.zip build.log
adding: build.log s=14585, actual=14645
zip error: Internal logic error (incorrect compressed size)
Terminating xvnc
[jbosstools-nightly-3.1.0.M2] $ vncserver -kill :10
Killing Xvnc process ID 5403
[jbosstools-nightly-3.1.0.M2] $ bash -xe /tmp/hudson7628391909173615315.sh
+ kill 5382
Recording test results
Recording Emma reports jbds-build/coverage.xml
Build was marked for publishing on https://hudson.jboss.org/hudson/
Email was triggered for: Failure
There are 1 triggered emails.
Sending email for trigger: Failure
--------------------------------------------------
15 years, 8 months
[Still Unstable] jbosstools-nightly-3.1.0.M2 #248
by jboss-qa-internal@redhat.com
Public:
https://hudson.jboss.org/hudson//job/jbosstools-nightly-3.1.0.M2/248
https://hudson.jboss.org/hudson//job/jbosstools-nightly-3.1.0.M2/248/test...
https://hudson.jboss.org/hudson//job/jbosstools-nightly-3.1.0.M2/248/changes
https://hudson.jboss.org/hudson//job/jbosstools-nightly-3.1.0.M2/248/console
Internal:
http://hudson.qa.jboss.com/hudson/job/jbosstools-nightly-3.1.0.M2/248/
http://hudson.qa.jboss.com/hudson/job/jbosstools-nightly-3.1.0.M2/248//te...
http://hudson.qa.jboss.com/hudson/job/jbosstools-nightly-3.1.0.M2/248//ch...
http://hudson.qa.jboss.com/hudson/job/jbosstools-nightly-3.1.0.M2/248//co...
--------------------------------------------------
Failed Tests:
8 tests failed.
REGRESSION: SeamCoreAllTests
Error Message:
Problem marker was found in components.xml file expected:<1> but was:<2>
Stack Trace:
junit.framework.AssertionFailedError: Problem marker was found in components.xml file expected:<1> but was:<2>
at org.jboss.tools.seam.core.test.SeamValidatorsTest.testComponentsValidator(SeamValidatorsTest.java:146)
at junit.extensions.TestDecorator.basicRun(TestDecorator.java:24)
at junit.extensions.TestSetup$1.protect(TestSetup.java:21)
at junit.extensions.TestSetup.run(TestSetup.java:25)
at org.eclipse.test.EclipseTestRunner.run(EclipseTestRunner.java:354)
at org.eclipse.test.EclipseTestRunner.run(EclipseTestRunner.java:206)
at org.eclipse.test.UITestApplication$3.run(UITestApplication.java:195)
at org.eclipse.swt.widgets.RunnableLock.run(RunnableLock.java:35)
at org.eclipse.swt.widgets.Synchronizer.runAsyncMessages(Synchronizer.java:134)
at org.eclipse.swt.widgets.Display.runAsyncMessages(Display.java:3468)
at org.eclipse.swt.widgets.Display.readAndDispatch(Display.java:3115)
at org.eclipse.ui.internal.Workbench.runEventLoop(Workbench.java:2405)
at org.eclipse.ui.internal.Workbench.runUI(Workbench.java:2369)
at org.eclipse.ui.internal.Workbench.access$4(Workbench.java:2221)
at org.eclipse.ui.internal.Workbench$5.run(Workbench.java:500)
at org.eclipse.core.databinding.observable.Realm.runWithDefault(Realm.java:332)
at org.eclipse.ui.internal.Workbench.createAndRunWorkbench(Workbench.java:493)
at org.eclipse.ui.PlatformUI.createAndRunWorkbench(PlatformUI.java:149)
at org.eclipse.ui.internal.ide.application.IDEApplication.start(IDEApplication.java:113)
at org.eclipse.test.UITestApplication.runApplication(UITestApplication.java:138)
at org.eclipse.test.UITestApplication.run(UITestApplication.java:60)
at org.eclipse.test.UITestApplication.start(UITestApplication.java:210)
at org.eclipse.equinox.internal.app.EclipseAppHandle.run(EclipseAppHandle.java:194)
at org.eclipse.core.runtime.internal.adaptor.EclipseAppLauncher.runApplication(EclipseAppLauncher.java:110)
at org.eclipse.core.runtime.internal.adaptor.EclipseAppLauncher.start(EclipseAppLauncher.java:79)
at org.eclipse.core.runtime.adaptor.EclipseStarter.run(EclipseStarter.java:368)
at org.eclipse.core.runtime.adaptor.EclipseStarter.run(EclipseStarter.java:179)
at org.eclipse.equinox.launcher.Main.invokeFramework(Main.java:559)
at org.eclipse.equinox.launcher.Main.basicRun(Main.java:514)
at org.eclipse.equinox.launcher.Main.run(Main.java:1311)
at org.eclipse.equinox.launcher.Main.main(Main.java:1287)
at org.eclipse.core.launcher.Main.main(Main.java:34)
REGRESSION: SeamCoreAllTests
Error Message:
Problem marker has wrong line number expected:<8> but was:<9>
Stack Trace:
junit.framework.AssertionFailedError: Problem marker has wrong line number expected:<8> but was:<9>
at org.jboss.tools.seam.core.test.SeamValidatorsTest.testDuplicateComponents(SeamValidatorsTest.java:850)
at junit.extensions.TestDecorator.basicRun(TestDecorator.java:24)
at junit.extensions.TestSetup$1.protect(TestSetup.java:21)
at junit.extensions.TestSetup.run(TestSetup.java:25)
at org.eclipse.test.EclipseTestRunner.run(EclipseTestRunner.java:354)
at org.eclipse.test.EclipseTestRunner.run(EclipseTestRunner.java:206)
at org.eclipse.test.UITestApplication$3.run(UITestApplication.java:195)
at org.eclipse.swt.widgets.RunnableLock.run(RunnableLock.java:35)
at org.eclipse.swt.widgets.Synchronizer.runAsyncMessages(Synchronizer.java:134)
at org.eclipse.swt.widgets.Display.runAsyncMessages(Display.java:3468)
at org.eclipse.swt.widgets.Display.readAndDispatch(Display.java:3115)
at org.eclipse.ui.internal.Workbench.runEventLoop(Workbench.java:2405)
at org.eclipse.ui.internal.Workbench.runUI(Workbench.java:2369)
at org.eclipse.ui.internal.Workbench.access$4(Workbench.java:2221)
at org.eclipse.ui.internal.Workbench$5.run(Workbench.java:500)
at org.eclipse.core.databinding.observable.Realm.runWithDefault(Realm.java:332)
at org.eclipse.ui.internal.Workbench.createAndRunWorkbench(Workbench.java:493)
at org.eclipse.ui.PlatformUI.createAndRunWorkbench(PlatformUI.java:149)
at org.eclipse.ui.internal.ide.application.IDEApplication.start(IDEApplication.java:113)
at org.eclipse.test.UITestApplication.runApplication(UITestApplication.java:138)
at org.eclipse.test.UITestApplication.run(UITestApplication.java:60)
at org.eclipse.test.UITestApplication.start(UITestApplication.java:210)
at org.eclipse.equinox.internal.app.EclipseAppHandle.run(EclipseAppHandle.java:194)
at org.eclipse.core.runtime.internal.adaptor.EclipseAppLauncher.runApplication(EclipseAppLauncher.java:110)
at org.eclipse.core.runtime.internal.adaptor.EclipseAppLauncher.start(EclipseAppLauncher.java:79)
at org.eclipse.core.runtime.adaptor.EclipseStarter.run(EclipseStarter.java:368)
at org.eclipse.core.runtime.adaptor.EclipseStarter.run(EclipseStarter.java:179)
at org.eclipse.equinox.launcher.Main.invokeFramework(Main.java:559)
at org.eclipse.equinox.launcher.Main.basicRun(Main.java:514)
at org.eclipse.equinox.launcher.Main.run(Main.java:1311)
at org.eclipse.equinox.launcher.Main.main(Main.java:1287)
at org.eclipse.core.launcher.Main.main(Main.java:34)
FAILED: JBossWSCoreAllTests
Error Message:
Problems encountered while deleting resources.
Stack Trace:
org.eclipse.core.internal.resources.ResourceException: Problems encountered while deleting resources.
at org.eclipse.core.internal.resources.Resource.delete(Resource.java:729)
at org.eclipse.core.internal.resources.Project.delete(Project.java:317)
at org.jboss.tools.ws.core.test.command.AbstractJBossWSCommandTest.tearDown(AbstractJBossWSCommandTest.java:146)
at org.jboss.tools.ws.core.test.command.JBossWSJavaFirstCommandTest.tearDown(JBossWSJavaFirstCommandTest.java:92)
at org.eclipse.test.EclipseTestRunner.run(EclipseTestRunner.java:354)
at org.eclipse.test.EclipseTestRunner.run(EclipseTestRunner.java:206)
at org.eclipse.test.UITestApplication$3.run(UITestApplication.java:195)
at org.eclipse.swt.widgets.RunnableLock.run(RunnableLock.java:35)
at org.eclipse.swt.widgets.Synchronizer.runAsyncMessages(Synchronizer.java:134)
at org.eclipse.swt.widgets.Display.runAsyncMessages(Display.java:3468)
at org.eclipse.swt.widgets.Display.readAndDispatch(Display.java:3115)
at org.eclipse.ui.internal.Workbench.runEventLoop(Workbench.java:2405)
at org.eclipse.ui.internal.Workbench.runUI(Workbench.java:2369)
at org.eclipse.ui.internal.Workbench.access$4(Workbench.java:2221)
at org.eclipse.ui.internal.Workbench$5.run(Workbench.java:500)
at org.eclipse.core.databinding.observable.Realm.runWithDefault(Realm.java:332)
at org.eclipse.ui.internal.Workbench.createAndRunWorkbench(Workbench.java:493)
at org.eclipse.ui.PlatformUI.createAndRunWorkbench(PlatformUI.java:149)
at org.eclipse.ui.internal.ide.application.IDEApplication.start(IDEApplication.java:113)
at org.eclipse.test.UITestApplication.runApplication(UITestApplication.java:138)
at org.eclipse.test.UITestApplication.run(UITestApplication.java:60)
at org.eclipse.test.UITestApplication.start(UITestApplication.java:210)
at org.eclipse.equinox.internal.app.EclipseAppHandle.run(EclipseAppHandle.java:194)
at org.eclipse.core.runtime.internal.adaptor.EclipseAppLauncher.runApplication(EclipseAppLauncher.java:110)
at org.eclipse.core.runtime.internal.adaptor.EclipseAppLauncher.start(EclipseAppLauncher.java:79)
at org.eclipse.core.runtime.adaptor.EclipseStarter.run(EclipseStarter.java:368)
at org.eclipse.core.runtime.adaptor.EclipseStarter.run(EclipseStarter.java:179)
at org.eclipse.equinox.launcher.Main.invokeFramework(Main.java:559)
at org.eclipse.equinox.launcher.Main.basicRun(Main.java:514)
at org.eclipse.equinox.launcher.Main.run(Main.java:1311)
at org.eclipse.equinox.launcher.Main.main(Main.java:1287)
at org.eclipse.core.launcher.Main.main(Main.java:34)
Contains: Could not delete '/ClientTest/WebContent'.
org.eclipse.core.internal.resources.ResourceException: Problems encountered while deleting resources.
at org.eclipse.core.internal.localstore.FileSystemResourceManager.delete(FileSystemResourceManager.java:257)
at org.eclipse.core.internal.resources.ResourceTree.internalDeleteFolder(ResourceTree.java:351)
at org.eclipse.core.internal.resources.ResourceTree.internalDeleteProject(ResourceTree.java:386)
at org.eclipse.core.internal.resources.ResourceTree.standardDeleteProject(ResourceTree.java:832)
at org.eclipse.core.internal.resources.Resource.unprotectedDelete(Resource.java:1764)
at org.eclipse.core.internal.resources.Resource.delete(Resource.java:716)
at org.eclipse.core.internal.resources.Project.delete(Project.java:317)
at org.jboss.tools.ws.core.test.command.AbstractJBossWSCommandTest.tearDown(AbstractJBossWSCommandTest.java:146)
at org.jboss.tools.ws.core.test.command.JBossWSJavaFirstCommandTest.tearDown(JBossWSJavaFirstCommandTest.java:92)
at org.eclipse.test.EclipseTestRunner.run(EclipseTestRunner.java:354)
at org.eclipse.test.EclipseTestRunner.run(EclipseTestRunner.java:206)
at org.eclipse.test.UITestApplication$3.run(UITestApplication.java:195)
at org.eclipse.swt.widgets.RunnableLock.run(RunnableLock.java:35)
at org.eclipse.swt.widgets.Synchronizer.runAsyncMessages(Synchronizer.java:134)
at org.eclipse.swt.widgets.Display.runAsyncMessages(Display.java:3468)
at org.eclipse.swt.widgets.Display.readAndDispatch(Display.java:3115)
at org.eclipse.ui.internal.Workbench.runEventLoop(Workbench.java:2405)
at org.eclipse.ui.internal.Workbench.runUI(Workbench.java:2369)
at org.eclipse.ui.internal.Workbench.access$4(Workbench.java:2221)
at org.eclipse.ui.internal.Workbench$5.run(Workbench.java:500)
at org.eclipse.core.databinding.observable.Realm.runWithDefault(Realm.java:332)
at org.eclipse.ui.internal.Workbench.createAndRunWorkbench(Workbench.java:493)
at org.eclipse.ui.PlatformUI.createAndRunWorkbench(PlatformUI.java:149)
at org.eclipse.ui.internal.ide.application.IDEApplication.start(IDEApplication.java:113)
at org.eclipse.test.UITestApplication.runApplication(UITestApplication.java:138)
at org.eclipse.test.UITestApplication.run(UITestApplication.java:60)
at org.eclipse.test.UITestApplication.start(UITestApplication.java:210)
at org.eclipse.equinox.internal.app.EclipseAppHandle.run(EclipseAppHandle.java:194)
at org.eclipse.core.runtime.internal.adaptor.EclipseAppLauncher.runApplication(EclipseAppLauncher.java:110)
at org.eclipse.core.runtime.internal.adaptor.EclipseAppLauncher.start(EclipseAppLauncher.java:79)
at org.eclipse.core.runtime.adaptor.EclipseStarter.run(EclipseStarter.java:368)
at org.eclipse.core.runtime.adaptor.EclipseStarter.run(EclipseStarter.java:179)
at org.eclipse.equinox.launcher.Main.invokeFramework(Main.java:559)
at org.eclipse.equinox.launcher.Main.basicRun(Main.java:514)
at org.eclipse.equinox.launcher.Main.run(Main.java:1311)
at org.eclipse.equinox.launcher.Main.main(Main.java:1287)
at org.eclipse.core.launcher.Main.main(Main.java:34)
Contains: Problems encountered while deleting files.
Contains: Could not delete: /qa/services/hudson/hudson_workspace/workspace/jbosstools-nightly-3.1.0.M2/jbds-build/3.1.0.M1/200906100601/tests/workspace/ClientTest/WebContent/WEB-INF.
Contains: Could not delete: /qa/services/hudson/hudson_workspace/workspace/jbosstools-nightly-3.1.0.M2/jbds-build/3.1.0.M1/200906100601/tests/workspace/ClientTest/WebContent.
Contains: Could not delete '/qa/services/hudson/hudson_workspace/workspace/jbosstools-nightly-3.1.0.M2/jbds-build/3.1.0.M1/200906100601/tests/workspace/ClientTest'.
FAILED: JBossWSCoreAllTests
Error Message:
*********************** Create Web Service Client... Create Web Service... Create Web Service Operation... Server said: Hello World Server said: Hello qq ***********************
Stack Trace:
junit.framework.AssertionFailedError: ***********************
Create Web Service Client...
Create Web Service...
Create Web Service Operation...
Server said: Hello World
Server said: Hello qq
***********************
at org.jboss.tools.ws.core.test.command.JBossWSJavaFirstCommandTest.checkText(JBossWSJavaFirstCommandTest.java:237)
at org.jboss.tools.ws.core.test.command.JBossWSJavaFirstCommandTest.testDeployResult(JBossWSJavaFirstCommandTest.java:222)
at org.eclipse.test.EclipseTestRunner.run(EclipseTestRunner.java:354)
at org.eclipse.test.EclipseTestRunner.run(EclipseTestRunner.java:206)
at org.eclipse.test.UITestApplication$3.run(UITestApplication.java:195)
at org.eclipse.swt.widgets.RunnableLock.run(RunnableLock.java:35)
at org.eclipse.swt.widgets.Synchronizer.runAsyncMessages(Synchronizer.java:134)
at org.eclipse.swt.widgets.Display.runAsyncMessages(Display.java:3468)
at org.eclipse.swt.widgets.Display.readAndDispatch(Display.java:3115)
at org.eclipse.ui.internal.Workbench.runEventLoop(Workbench.java:2405)
at org.eclipse.ui.internal.Workbench.runUI(Workbench.java:2369)
at org.eclipse.ui.internal.Workbench.access$4(Workbench.java:2221)
at org.eclipse.ui.internal.Workbench$5.run(Workbench.java:500)
at org.eclipse.core.databinding.observable.Realm.runWithDefault(Realm.java:332)
at org.eclipse.ui.internal.Workbench.createAndRunWorkbench(Workbench.java:493)
at org.eclipse.ui.PlatformUI.createAndRunWorkbench(PlatformUI.java:149)
at org.eclipse.ui.internal.ide.application.IDEApplication.start(IDEApplication.java:113)
at org.eclipse.test.UITestApplication.runApplication(UITestApplication.java:138)
at org.eclipse.test.UITestApplication.run(UITestApplication.java:60)
at org.eclipse.test.UITestApplication.start(UITestApplication.java:210)
at org.eclipse.equinox.internal.app.EclipseAppHandle.run(EclipseAppHandle.java:194)
at org.eclipse.core.runtime.internal.adaptor.EclipseAppLauncher.runApplication(EclipseAppLauncher.java:110)
at org.eclipse.core.runtime.internal.adaptor.EclipseAppLauncher.start(EclipseAppLauncher.java:79)
at org.eclipse.core.runtime.adaptor.EclipseStarter.run(EclipseStarter.java:368)
at org.eclipse.core.runtime.adaptor.EclipseStarter.run(EclipseStarter.java:179)
at org.eclipse.equinox.launcher.Main.invokeFramework(Main.java:559)
at org.eclipse.equinox.launcher.Main.basicRun(Main.java:514)
at org.eclipse.equinox.launcher.Main.run(Main.java:1311)
at org.eclipse.equinox.launcher.Main.main(Main.java:1287)
at org.eclipse.core.launcher.Main.main(Main.java:34)
FAILED: AllTests
Error Message:
expected:<103> but was:<102>
Stack Trace:
junit.framework.AssertionFailedError: expected:<103> but was:<102>
at org.drools.eclipse.editors.completion.CompletionContextTest.testCheckLHSLocationDetermination_INSIDE_CONDITION_END4(CompletionContextTest.java:583)
at org.eclipse.test.EclipseTestRunner.run(EclipseTestRunner.java:354)
at org.eclipse.test.EclipseTestRunner.run(EclipseTestRunner.java:206)
at org.eclipse.test.UITestApplication$3.run(UITestApplication.java:195)
at org.eclipse.swt.widgets.RunnableLock.run(RunnableLock.java:35)
at org.eclipse.swt.widgets.Synchronizer.runAsyncMessages(Synchronizer.java:134)
at org.eclipse.swt.widgets.Display.runAsyncMessages(Display.java:3468)
at org.eclipse.swt.widgets.Display.readAndDispatch(Display.java:3115)
at org.eclipse.ui.internal.Workbench.runEventLoop(Workbench.java:2405)
at org.eclipse.ui.internal.Workbench.runUI(Workbench.java:2369)
at org.eclipse.ui.internal.Workbench.access$4(Workbench.java:2221)
at org.eclipse.ui.internal.Workbench$5.run(Workbench.java:500)
at org.eclipse.core.databinding.observable.Realm.runWithDefault(Realm.java:332)
at org.eclipse.ui.internal.Workbench.createAndRunWorkbench(Workbench.java:493)
at org.eclipse.ui.PlatformUI.createAndRunWorkbench(PlatformUI.java:149)
at org.eclipse.ui.internal.ide.application.IDEApplication.start(IDEApplication.java:113)
at org.eclipse.test.UITestApplication.runApplication(UITestApplication.java:138)
at org.eclipse.test.UITestApplication.run(UITestApplication.java:60)
at org.eclipse.test.UITestApplication.start(UITestApplication.java:210)
at org.eclipse.equinox.internal.app.EclipseAppHandle.run(EclipseAppHandle.java:194)
at org.eclipse.core.runtime.internal.adaptor.EclipseAppLauncher.runApplication(EclipseAppLauncher.java:110)
at org.eclipse.core.runtime.internal.adaptor.EclipseAppLauncher.start(EclipseAppLauncher.java:79)
at org.eclipse.core.runtime.adaptor.EclipseStarter.run(EclipseStarter.java:368)
at org.eclipse.core.runtime.adaptor.EclipseStarter.run(EclipseStarter.java:179)
at org.eclipse.equinox.launcher.Main.invokeFramework(Main.java:559)
at org.eclipse.equinox.launcher.Main.basicRun(Main.java:514)
at org.eclipse.equinox.launcher.Main.run(Main.java:1311)
at org.eclipse.equinox.launcher.Main.main(Main.java:1287)
at org.eclipse.core.launcher.Main.main(Main.java:34)
FAILED: AllTests
Error Message:
expected:<100> but was:<103>
Stack Trace:
junit.framework.AssertionFailedError: expected:<100> but was:<103>
at org.drools.eclipse.editors.completion.CompletionContextTest.testCheckLHSLocationDetermination_INSIDE_CONDITION_START14(CompletionContextTest.java:593)
at org.eclipse.test.EclipseTestRunner.run(EclipseTestRunner.java:354)
at org.eclipse.test.EclipseTestRunner.run(EclipseTestRunner.java:206)
at org.eclipse.test.UITestApplication$3.run(UITestApplication.java:195)
at org.eclipse.swt.widgets.RunnableLock.run(RunnableLock.java:35)
at org.eclipse.swt.widgets.Synchronizer.runAsyncMessages(Synchronizer.java:134)
at org.eclipse.swt.widgets.Display.runAsyncMessages(Display.java:3468)
at org.eclipse.swt.widgets.Display.readAndDispatch(Display.java:3115)
at org.eclipse.ui.internal.Workbench.runEventLoop(Workbench.java:2405)
at org.eclipse.ui.internal.Workbench.runUI(Workbench.java:2369)
at org.eclipse.ui.internal.Workbench.access$4(Workbench.java:2221)
at org.eclipse.ui.internal.Workbench$5.run(Workbench.java:500)
at org.eclipse.core.databinding.observable.Realm.runWithDefault(Realm.java:332)
at org.eclipse.ui.internal.Workbench.createAndRunWorkbench(Workbench.java:493)
at org.eclipse.ui.PlatformUI.createAndRunWorkbench(PlatformUI.java:149)
at org.eclipse.ui.internal.ide.application.IDEApplication.start(IDEApplication.java:113)
at org.eclipse.test.UITestApplication.runApplication(UITestApplication.java:138)
at org.eclipse.test.UITestApplication.run(UITestApplication.java:60)
at org.eclipse.test.UITestApplication.start(UITestApplication.java:210)
at org.eclipse.equinox.internal.app.EclipseAppHandle.run(EclipseAppHandle.java:194)
at org.eclipse.core.runtime.internal.adaptor.EclipseAppLauncher.runApplication(EclipseAppLauncher.java:110)
at org.eclipse.core.runtime.internal.adaptor.EclipseAppLauncher.start(EclipseAppLauncher.java:79)
at org.eclipse.core.runtime.adaptor.EclipseStarter.run(EclipseStarter.java:368)
at org.eclipse.core.runtime.adaptor.EclipseStarter.run(EclipseStarter.java:179)
at org.eclipse.equinox.launcher.Main.invokeFramework(Main.java:559)
at org.eclipse.equinox.launcher.Main.basicRun(Main.java:514)
at org.eclipse.equinox.launcher.Main.run(Main.java:1311)
at org.eclipse.equinox.launcher.Main.main(Main.java:1287)
at org.eclipse.core.launcher.Main.main(Main.java:34)
FAILED: SeamCoreAllTests
Error Message:
Problem marker was found in varAttributes.xhtml file. Validator did not recognize 'var' attribute. expected:<0> but was:<1>
Stack Trace:
junit.framework.AssertionFailedError: Problem marker was found in varAttributes.xhtml file. Validator did not recognize 'var' attribute. expected:<0> but was:<1>
at org.jboss.tools.seam.core.test.SeamValidatorsTest.testVarAttributes(SeamValidatorsTest.java:103)
at junit.extensions.TestDecorator.basicRun(TestDecorator.java:24)
at junit.extensions.TestSetup$1.protect(TestSetup.java:21)
at junit.extensions.TestSetup.run(TestSetup.java:25)
at org.eclipse.test.EclipseTestRunner.run(EclipseTestRunner.java:354)
at org.eclipse.test.EclipseTestRunner.run(EclipseTestRunner.java:206)
at org.eclipse.test.UITestApplication$3.run(UITestApplication.java:195)
at org.eclipse.swt.widgets.RunnableLock.run(RunnableLock.java:35)
at org.eclipse.swt.widgets.Synchronizer.runAsyncMessages(Synchronizer.java:134)
at org.eclipse.swt.widgets.Display.runAsyncMessages(Display.java:3468)
at org.eclipse.swt.widgets.Display.readAndDispatch(Display.java:3115)
at org.eclipse.ui.internal.Workbench.runEventLoop(Workbench.java:2405)
at org.eclipse.ui.internal.Workbench.runUI(Workbench.java:2369)
at org.eclipse.ui.internal.Workbench.access$4(Workbench.java:2221)
at org.eclipse.ui.internal.Workbench$5.run(Workbench.java:500)
at org.eclipse.core.databinding.observable.Realm.runWithDefault(Realm.java:332)
at org.eclipse.ui.internal.Workbench.createAndRunWorkbench(Workbench.java:493)
at org.eclipse.ui.PlatformUI.createAndRunWorkbench(PlatformUI.java:149)
at org.eclipse.ui.internal.ide.application.IDEApplication.start(IDEApplication.java:113)
at org.eclipse.test.UITestApplication.runApplication(UITestApplication.java:138)
at org.eclipse.test.UITestApplication.run(UITestApplication.java:60)
at org.eclipse.test.UITestApplication.start(UITestApplication.java:210)
at org.eclipse.equinox.internal.app.EclipseAppHandle.run(EclipseAppHandle.java:194)
at org.eclipse.core.runtime.internal.adaptor.EclipseAppLauncher.runApplication(EclipseAppLauncher.java:110)
at org.eclipse.core.runtime.internal.adaptor.EclipseAppLauncher.start(EclipseAppLauncher.java:79)
at org.eclipse.core.runtime.adaptor.EclipseStarter.run(EclipseStarter.java:368)
at org.eclipse.core.runtime.adaptor.EclipseStarter.run(EclipseStarter.java:179)
at org.eclipse.equinox.launcher.Main.invokeFramework(Main.java:559)
at org.eclipse.equinox.launcher.Main.basicRun(Main.java:514)
at org.eclipse.equinox.launcher.Main.run(Main.java:1311)
at org.eclipse.equinox.launcher.Main.main(Main.java:1287)
at org.eclipse.core.launcher.Main.main(Main.java:34)
FAILED: SeamCoreAllTests
Error Message:
Problem marker was found in abcComponent.xhtml expected:<0> but was:<1>
Stack Trace:
junit.framework.AssertionFailedError: Problem marker was found in abcComponent.xhtml expected:<0> but was:<1>
at org.jboss.tools.seam.core.test.SeamValidatorsTest.testExpressionLanguageValidator(SeamValidatorsTest.java:702)
at junit.extensions.TestDecorator.basicRun(TestDecorator.java:24)
at junit.extensions.TestSetup$1.protect(TestSetup.java:21)
at junit.extensions.TestSetup.run(TestSetup.java:25)
at org.eclipse.test.EclipseTestRunner.run(EclipseTestRunner.java:354)
at org.eclipse.test.EclipseTestRunner.run(EclipseTestRunner.java:206)
at org.eclipse.test.UITestApplication$3.run(UITestApplication.java:195)
at org.eclipse.swt.widgets.RunnableLock.run(RunnableLock.java:35)
at org.eclipse.swt.widgets.Synchronizer.runAsyncMessages(Synchronizer.java:134)
at org.eclipse.swt.widgets.Display.runAsyncMessages(Display.java:3468)
at org.eclipse.swt.widgets.Display.readAndDispatch(Display.java:3115)
at org.eclipse.ui.internal.Workbench.runEventLoop(Workbench.java:2405)
at org.eclipse.ui.internal.Workbench.runUI(Workbench.java:2369)
at org.eclipse.ui.internal.Workbench.access$4(Workbench.java:2221)
at org.eclipse.ui.internal.Workbench$5.run(Workbench.java:500)
at org.eclipse.core.databinding.observable.Realm.runWithDefault(Realm.java:332)
at org.eclipse.ui.internal.Workbench.createAndRunWorkbench(Workbench.java:493)
at org.eclipse.ui.PlatformUI.createAndRunWorkbench(PlatformUI.java:149)
at org.eclipse.ui.internal.ide.application.IDEApplication.start(IDEApplication.java:113)
at org.eclipse.test.UITestApplication.runApplication(UITestApplication.java:138)
at org.eclipse.test.UITestApplication.run(UITestApplication.java:60)
at org.eclipse.test.UITestApplication.start(UITestApplication.java:210)
at org.eclipse.equinox.internal.app.EclipseAppHandle.run(EclipseAppHandle.java:194)
at org.eclipse.core.runtime.internal.adaptor.EclipseAppLauncher.runApplication(EclipseAppLauncher.java:110)
at org.eclipse.core.runtime.internal.adaptor.EclipseAppLauncher.start(EclipseAppLauncher.java:79)
at org.eclipse.core.runtime.adaptor.EclipseStarter.run(EclipseStarter.java:368)
at org.eclipse.core.runtime.adaptor.EclipseStarter.run(EclipseStarter.java:179)
at org.eclipse.equinox.launcher.Main.invokeFramework(Main.java:559)
at org.eclipse.equinox.launcher.Main.basicRun(Main.java:514)
at org.eclipse.equinox.launcher.Main.run(Main.java:1311)
at org.eclipse.equinox.launcher.Main.main(Main.java:1287)
at org.eclipse.core.launcher.Main.main(Main.java:34)
--------------------------------------------------
Changes:
[Grid.Qian] JBIDE-4461: filter the xsd and wsdl when user click Import an XSD or Import a WSDL button
[rob.stryker(a)jboss.com] It WORKS =DDD
[scabanovich] https://jira.jboss.org/jira/browse/JBIDE-4393
[Grid.Qian] JBIDE-4460: the org.eclipse.swt.swtexception:Invalid Thread access when choose a wsdl file in the import wsdl wizard
[Grid.Qian] JBIDE-4459: no refresh the properties view when change the import of the bpel process in the Source tab of the bpel editor
[Grid.Qian] JBIDE-4458: don't display the correct wizardpage of the import xsd wizard
[Grid.Qian] JBIDE-4457: can't save the change of a element location
[DartPeng] Add the "whatnew" for smooks tools
[Grid.Qian] initial operation: import the eclipse bpel codes to trunk
[Grid.Qian] add the plugins folder in the bpel module
--------------------------------------------------
Console log:
[...truncated 26127 lines...]
[jar] Building jar: /home/hudson/hudson_workspace/workspace/jbosstools-nightly-3.1.0.M2/jbds-build/site/eclipse/plugins/org.jboss.tools.vpe.html_3.1.0.M1-N200906100601-H248.jar
[jar] Building jar: /home/hudson/hudson_workspace/workspace/jbosstools-nightly-3.1.0.M2/jbds-build/site/eclipse/plugins/org.jboss.tools.vpe.jsp_3.1.0.M1-N200906100601-H248.jar
[jar] Building jar: /home/hudson/hudson_workspace/workspace/jbosstools-nightly-3.1.0.M2/jbds-build/site/eclipse/plugins/org.jboss.tools.vpe.ui.palette_3.1.0.M1-N200906100601-H248.jar
[jar] Building jar: /home/hudson/hudson_workspace/workspace/jbosstools-nightly-3.1.0.M2/jbds-build/site/eclipse/plugins/org.jboss.tools.vpe_3.1.0.M1-N200906100601-H248.jar
[jar] Building jar: /home/hudson/hudson_workspace/workspace/jbosstools-nightly-3.1.0.M2/jbds-build/site/eclipse/plugins/org.jboss.tools.xulrunner_1.0.0.GA-N200906100601-H248.jar
[jar] Building jar: /home/hudson/hudson_workspace/workspace/jbosstools-nightly-3.1.0.M2/jbds-build/site/eclipse/plugins/org.mozilla.xpcom_1.8.1.3-20070904.jar
[jar] Building jar: /home/hudson/hudson_workspace/workspace/jbosstools-nightly-3.1.0.M2/jbds-build/site/eclipse/plugins/org.mozilla.xulrunner.carbon.macosx_1.8.1.3-20070904.jar
[jar] Building jar: /home/hudson/hudson_workspace/workspace/jbosstools-nightly-3.1.0.M2/jbds-build/site/eclipse/plugins/org.mozilla.xulrunner.gtk.linux.x86_1.8.1.3-20070904.jar
[jar] Building jar: /home/hudson/hudson_workspace/workspace/jbosstools-nightly-3.1.0.M2/jbds-build/site/eclipse/plugins/org.mozilla.xulrunner.gtk.linux.x86_64_1.8.1.4-20080112.jar
[jar] Building jar: /home/hudson/hudson_workspace/workspace/jbosstools-nightly-3.1.0.M2/jbds-build/site/eclipse/plugins/org.mozilla.xulrunner.win32.win32.x86_1.8.1.3-20070904.jar
load.properties:
[echo] Getting version for 'jmx' builder to property 'jmx.versionTag' from /qa/services/hudson/hudson_workspace/workspace/jbosstools-nightly-3.1.0.M2/org.jboss.ide.eclipse.releng/builders/product/versionTags/jbosstools/3.1.0.M1.tags
[echo]
[echo] jbds-jmx-filename=JMX-1.1.0.M1-N200906100601-H248.zip
[echo] jbds-jmx-nodeps-filename=JMX-nodeps-1.1.0.M1-N200906100601-H248.zip
[echo]
[echo] Getting version for 'drools-ide' builder to property 'drools-ide.versionTag' from /qa/services/hudson/hudson_workspace/workspace/jbosstools-nightly-3.1.0.M2/org.jboss.ide.eclipse.releng/builders/product/versionTags/jbosstools/3.1.0.M1.tags
[echo]
[echo] jbds-drools-ide-filename=DroolsIDE-5.1.0.trunk-N200906100601-H248.zip
[echo] jbds-drools-ide-nodeps-filename=DroolsIDE-nodeps-5.1.0.trunk-N200906100601-H248.zip
[echo]
[echo] Getting version for 'archives' builder to property 'archives.versionTag' from /qa/services/hudson/hudson_workspace/workspace/jbosstools-nightly-3.1.0.M2/org.jboss.ide.eclipse.releng/builders/product/versionTags/jbosstools/3.1.0.M1.tags
[echo]
[echo] jbds-archives-filename=JBossTools-Archives-3.1.0.M1-N200906100601-H248.zip
[echo] jbds-archives-nodeps-filename=JBossTools-Archives-nodeps-3.1.0.M1-N200906100601-H248.zip
[echo]
[echo] Getting version for 'xulrunner' builder to property 'xulrunner.versionTag' from /qa/services/hudson/hudson_workspace/workspace/jbosstools-nightly-3.1.0.M2/org.jboss.ide.eclipse.releng/builders/product/versionTags/jbosstools/3.1.0.M1.tags
[echo]
[echo] jbds-xulrunner-win32-filename=XulRunner-win32-1.0.0.GA-N200906100601-H248.zip
[echo] jbds-xulrunner-win32-nodeps-filename=XulRunner-win32-nodeps-1.0.0.GA-N200906100601-H248.zip
[echo]
[echo] Getting version for 'xulrunner' builder to property 'xulrunner.versionTag' from /qa/services/hudson/hudson_workspace/workspace/jbosstools-nightly-3.1.0.M2/org.jboss.ide.eclipse.releng/builders/product/versionTags/jbosstools/3.1.0.M1.tags
[echo]
[echo] jbds-xulrunner-linux-gtk-filename=XulRunner-linux-gtk-1.0.0.GA-N200906100601-H248.zip
[echo] jbds-xulrunner-linux-gtk-nodeps-filename=XulRunner-linux-gtk-nodeps-1.0.0.GA-N200906100601-H248.zip
[echo]
[echo] Getting version for 'richfaces' builder to property 'richfaces.versionTag' from /qa/services/hudson/hudson_workspace/workspace/jbosstools-nightly-3.1.0.M2/org.jboss.ide.eclipse.releng/builders/product/versionTags/jbosstools/3.1.0.M1.tags
[echo]
[echo] jbds-richfaces-win32-filename=RichFaces-VPE-win32-3.1.0.M1-N200906100601-H248.zip
[echo] jbds-richfaces-win32-nodeps-filename=RichFaces-VPE-win32-nodeps-3.1.0.M1-N200906100601-H248.zip
[echo]
[echo] Getting version for 'richfaces' builder to property 'richfaces.versionTag' from /qa/services/hudson/hudson_workspace/workspace/jbosstools-nightly-3.1.0.M2/org.jboss.ide.eclipse.releng/builders/product/versionTags/jbosstools/3.1.0.M1.tags
[echo]
[echo] jbds-richfaces-linux-gtk-filename=RichFaces-VPE-linux-gtk-3.1.0.M1-N200906100601-H248.zip
[echo] jbds-richfaces-linux-gtk-nodeps-filename=RichFaces-VPE-linux-gtk-nodeps-3.1.0.M1-N200906100601-H248.zip
[echo]
[echo] Getting version for 'jbpm-convert' builder to property 'jbpm-convert.versionTag' from /qa/services/hudson/hudson_workspace/workspace/jbosstools-nightly-3.1.0.M2/org.jboss.ide.eclipse.releng/builders/product/versionTags/jbosstools/3.1.0.M1.tags
[echo]
[echo] jbds-jbpm-convert-filename=jBPM-Convert-1.1.0.M1-N200906100601-H248.zip
[echo] jbds-jbpm-convert-nodeps-filename=jBPM-Convert-nodeps-1.1.0.M1-N200906100601-H248.zip
[echo]
[echo] Getting version for 'freemarker' builder to property 'freemarker.versionTag' from /qa/services/hudson/hudson_workspace/workspace/jbosstools-nightly-3.1.0.M2/org.jboss.ide.eclipse.releng/builders/product/versionTags/jbosstools/3.1.0.M1.tags
[echo]
[echo] jbds-freemarker-filename=FreeMarkerIDE-1.1.0.M1-N200906100601-H248.zip
[echo] jbds-freemarker-nodeps-filename=
[echo]
[length] /home/hudson/hudson_workspace/workspace/jbosstools-nightly-3.1.0.M2/jbds-build/3.1.0.M1/200906100601/freemarker is a directory; length unspecified
[echo] Getting version for 'hibernate-tools' builder to property 'hibernate-tools.versionTag' from /qa/services/hudson/hudson_workspace/workspace/jbosstools-nightly-3.1.0.M2/org.jboss.ide.eclipse.releng/builders/product/versionTags/jbosstools/3.1.0.M1.tags
[echo]
[echo] jbds-hibernate-tools-filename=HibernateTools-3.3.0.M1-N200906100601-H248.zip
[echo] jbds-hibernate-tools-nodeps-filename=HibernateTools-nodeps-3.3.0.M1-N200906100601-H248.zip
[echo]
[echo] Getting version for 'struts' builder to property 'struts.versionTag' from /qa/services/hudson/hudson_workspace/workspace/jbosstools-nightly-3.1.0.M2/org.jboss.ide.eclipse.releng/builders/product/versionTags/jbosstools/3.1.0.M1.tags
[echo]
[echo] jbds-struts-filename=StrutsTools-3.1.0.M1-N200906100601-H248.zip
[echo] jbds-struts-nodeps-filename=StrutsTools-nodeps-3.1.0.M1-N200906100601-H248.zip
[echo]
[echo] Getting version for 'jbpm' builder to property 'jbpm.versionTag' from /qa/services/hudson/hudson_workspace/workspace/jbosstools-nightly-3.1.0.M2/org.jboss.ide.eclipse.releng/builders/product/versionTags/jbosstools/3.1.0.M1.tags
[echo]
[echo] jbds-jbpm-filename=jBPM-Designer-3.1.7.GA-N200906100601-H248.zip
[echo] jbds-jbpm-nodeps-filename=jBPM-Designer-nodeps-3.1.7.GA-N200906100601-H248.zip
[echo]
[echo] Getting version for 'as' builder to property 'as.versionTag' from /qa/services/hudson/hudson_workspace/workspace/jbosstools-nightly-3.1.0.M2/org.jboss.ide.eclipse.releng/builders/product/versionTags/jbosstools/3.1.0.M1.tags
[echo]
[echo] jbds-as-filename=JBossAS-Tools-2.1.0.M1-N200906100601-H248.zip
[echo] jbds-as-nodeps-filename=JBossAS-Tools-nodeps-2.1.0.M1-N200906100601-H248.zip
[echo]
[echo] Getting version for 'seam' builder to property 'seam.versionTag' from /qa/services/hudson/hudson_workspace/workspace/jbosstools-nightly-3.1.0.M2/org.jboss.ide.eclipse.releng/builders/product/versionTags/jbosstools/3.1.0.M1.tags
[echo]
[echo] jbds-seam-filename=SeamTools-3.1.0.M1-N200906100601-H248.zip
[echo] jbds-seam-nodeps-filename=SeamTools-nodeps-3.1.0.M1-N200906100601-H248.zip
[echo]
[echo] Getting version for 'examples' builder to property 'examples.versionTag' from /qa/services/hudson/hudson_workspace/workspace/jbosstools-nightly-3.1.0.M2/org.jboss.ide.eclipse.releng/builders/product/versionTags/jbosstools/3.1.0.M1.tags
[echo]
[echo] jbds-examples-filename=JBossTools-Examples-1.1.0.M1-N200906100601-H248.zip
[echo] jbds-examples-nodeps-filename=JBossTools-Examples-nodeps-1.1.0.M1-N200906100601-H248.zip
[echo]
[echo] Getting version for 'esb' builder to property 'esb.versionTag' from /qa/services/hudson/hudson_workspace/workspace/jbosstools-nightly-3.1.0.M2/org.jboss.ide.eclipse.releng/builders/product/versionTags/jbosstools/3.1.0.M1.tags
[echo]
[echo] jbds-esb-filename=JBossTools-ESB-1.3.0.M1-N200906100601-H248.zip
[echo] jbds-esb-nodeps-filename=JBossTools-ESB-nodeps-1.3.0.M1-N200906100601-H248.zip
[echo]
[echo] Getting version for 'ws' builder to property 'ws.versionTag' from /qa/services/hudson/hudson_workspace/workspace/jbosstools-nightly-3.1.0.M2/org.jboss.ide.eclipse.releng/builders/product/versionTags/jbosstools/3.1.0.M1.tags
[echo]
[echo] jbds-ws-filename=JBossWS-Tools-1.1.0.M1-N200906100601-H248.zip
[echo] jbds-ws-nodeps-filename=JBossWS-Tools-nodeps-1.1.0.M1-N200906100601-H248.zip
[echo]
[echo] Getting version for 'birt' builder to property 'birt.versionTag' from /qa/services/hudson/hudson_workspace/workspace/jbosstools-nightly-3.1.0.M2/org.jboss.ide.eclipse.releng/builders/product/versionTags/jbosstools/3.1.0.M1.tags
[echo]
[echo] jbds-birt-filename=JBossTools-BIRT-1.1.0.M1-N200906100601-H248.zip
[echo] jbds-birt-nodeps-filename=JBossTools-BIRT-nodeps-1.1.0.M1-N200906100601-H248.zip
[echo]
[echo] Getting version for 'portlet' builder to property 'portlet.versionTag' from /qa/services/hudson/hudson_workspace/workspace/jbosstools-nightly-3.1.0.M2/org.jboss.ide.eclipse.releng/builders/product/versionTags/jbosstools/3.1.0.M1.tags
[echo]
[echo] jbds-portlet-filename=JBoss-Portlet-Tools-1.1.0.M1-N200906100601-H248.zip
[echo] jbds-portlet-nodeps-filename=JBoss-Portlet-Tools-nodeps-1.1.0.M1-N200906100601-H248.zip
[echo]
[echo] Getting version for 'smooks' builder to property 'smooks.versionTag' from /qa/services/hudson/hudson_workspace/workspace/jbosstools-nightly-3.1.0.M2/org.jboss.ide.eclipse.releng/builders/product/versionTags/jbosstools/3.1.0.M1.tags
[echo]
[echo] jbds-smooks-filename=JBossTools-Smooks-1.1.0.M1-N200906100601-H248.zip
[echo] jbds-smooks-nodeps-filename=JBossTools-Smooks-nodeps-1.1.0.M1-N200906100601-H248.zip
[echo]
[echo] Getting version for 'tptp' builder to property 'tptp.versionTag' from /qa/services/hudson/hudson_workspace/workspace/jbosstools-nightly-3.1.0.M2/org.jboss.ide.eclipse.releng/builders/product/versionTags/jbosstools/3.1.0.M1.tags
[echo]
[echo] jbds-tptp-filename=JBoss-TPTP-Tools-1.1.0.M1-N200906100601-H248.zip
[echo] jbds-tptp-nodeps-filename=JBoss-TPTP-Tools-nodeps-1.1.0.M1-N200906100601-H248.zip
[echo]
pack200:
[echo] Using /qa/tools/opt/jdk1.5.0_15/jre/bin/pack200 to pack update site jars...
[mkdir] Created dir: /qa/services/hudson/hudson_workspace/workspace/jbosstools-nightly-3.1.0.M2/org.jboss.ide.eclipse.releng/builders/product/updateSite/updateSitePackTmp/output
[mkdir] Created dir: /qa/services/hudson/hudson_workspace/workspace/jbosstools-nightly-3.1.0.M2/org.jboss.ide.eclipse.releng/builders/product/updateSite/updateSitePackTmp/input
[echo] Zip update jars in /home/hudson/hudson_workspace/workspace/jbosstools-nightly-3.1.0.M2/jbds-build/site to temporary Master zip (to avoid packing nested jars) ...
[zip] Building zip: /qa/services/hudson/hudson_workspace/workspace/jbosstools-nightly-3.1.0.M2/org.jboss.ide.eclipse.releng/builders/product/updateSite/updateSitePackTmp/input/Master.zip
[exec] 42M updateSite/updateSitePackTmp/input/Master.zip
[echo] Pack jars ...
[echo] Run jarprocessor.pack200 using launcherjar = /home/hudson/hudson_workspace/workspace/jbosstools-nightly-3.1.0.M2/jbds-build/clean-eclipse/eclipse/plugins/org.eclipse.equinox.launcher_1.0.200.v20090520.jar
[exec] 166M updateSite/updateSitePackTmp/output/Master.zip
[unzip] Expanding: /qa/services/hudson/hudson_workspace/workspace/jbosstools-nightly-3.1.0.M2/org.jboss.ide.eclipse.releng/builders/product/updateSite/updateSitePackTmp/output/Master.zip into /home/hudson/hudson_workspace/workspace/jbosstools-nightly-3.1.0.M2/jbds-build/site
[delete] Deleting directory /qa/services/hudson/hudson_workspace/workspace/jbosstools-nightly-3.1.0.M2/org.jboss.ide.eclipse.releng/builders/product/updateSite/updateSitePackTmp
copy.site.rootfiles:
[echo] Build development jbosstools update site...
[copy] Copying 4 files to /home/hudson/hudson_workspace/workspace/jbosstools-nightly-3.1.0.M2/jbds-build/site/eclipse
p2:
[echo] Run p2 metadata generator using launcherjar = /home/hudson/hudson_workspace/workspace/jbosstools-nightly-3.1.0.M2/jbds-build/clean-eclipse/eclipse/plugins/org.eclipse.equinox.launcher_1.0.200.v20090520.jar
[p2] Generating metadata for /home/hudson/hudson_workspace/workspace/jbosstools-nightly-3.1.0.M2/jbds-build/site/eclipse.
[p2] Generation completed with success [11 seconds].
build.metadata:
publish.site:
post-build:
publish.results:
send.notification.email:
[mail] Failed to initialise MIME mail: javax/mail/MessagingException
publish.log:
init:
clean.all.subfolders:
BUILD SUCCESSFUL
Total time: 181 minutes 58 seconds
+ cd ../configs/jbds
+ zip build.log.zip build.log
updating: build.log (deflated 95%)
+ cd ../..
++ date +%s
+ endtime=1244639830
++ echo 'scale=2; (1244639830 - 1244628790)/60'
++ bc -l
+ elapsed=184.00
+ echo 'Elapsed time: 184.00mins.'
Elapsed time: 184.00mins.
+ [[ '' == \l\o\c\a\l ]]
++ grep product.releaseNumber
++ perl -ne 's/[\s\t]+product.releaseNumber=//g;print;'
++ cat /home/hudson/hudson_workspace/workspace/jbosstools-nightly-3.1.0.M2/jbds-build/buildData.properties
+ version=3.1.0.M1
++ cat /home/hudson/hudson_workspace/workspace/jbosstools-nightly-3.1.0.M2/jbds-build/buildData.properties
++ grep upload.to
++ perl -ne 's/[\s\t]+upload.to=//g;print;'
+ builddir=nightly/3.1.0.M1/200906100601
++ cat /home/hudson/hudson_workspace/workspace/jbosstools-nightly-3.1.0.M2/jbds-build/buildData.properties
++ grep product.buildDesc
++ perl -ne 's/[\s\t]+product.buildDesc=//g; print;'
+ buildtype=nightly
++ cat /home/hudson/hudson_workspace/workspace/jbosstools-nightly-3.1.0.M2/jbds-build/buildData.properties
++ grep product.releaseNumber
++ perl -ne 's/[\s\t]+product.releaseNumber=//g; print;'
+ releaseNumber=3.1.0.M1
+ DESTINATION=jbossqa@download.jboss.org:/htdocs/jbosstools
+ scp -r /home/hudson/hudson_workspace/workspace/jbosstools-nightly-3.1.0.M2/jbds-build/3.1.0.M1 jbossqa@download.jboss.org:/htdocs/jbosstools/builds/nightly/
+ scp configs/jbds/build.log.zip jbossqa@download.jboss.org:/htdocs/jbosstools/builds/nightly/3.1.0.M1/200906100601/
+ scp /home/hudson/hudson_workspace/workspace/jbosstools-nightly-3.1.0.M2/jbds-build/latestBuild.html jbossqa@download.jboss.org:/htdocs/jbosstools/builds/nightly/
++ date +%s
+ endtime=1244642843
++ echo 'scale=2; (1244642843 - 1244628790)/60'
++ bc -l
+ elapsed=234.21
+ echo 'Elapsed time: 234.21mins.'
Elapsed time: 234.21mins.
+ [[ -d /home/hudson/hudson_workspace/workspace/jbosstools-nightly-3.1.0.M2/jbds-build/site/eclipse ]]
+ mkdir -p /home/hudson/hudson_workspace/workspace/jbosstools-nightly-3.1.0.M2/jbds-build/site/nightly/trunk
+ mv /home/hudson/hudson_workspace/workspace/jbosstools-nightly-3.1.0.M2/jbds-build/site/eclipse/artifacts.jar /home/hudson/hudson_workspace/workspace/jbosstools-nightly-3.1.0.M2/jbds-build/site/eclipse/associateSites.xml /home/hudson/hudson_workspace/workspace/jbosstools-nightly-3.1.0.M2/jbds-build/site/eclipse/content.jar /home/hudson/hudson_workspace/workspace/jbosstools-nightly-3.1.0.M2/jbds-build/site/eclipse/features /home/hudson/hudson_workspace/workspace/jbosstools-nightly-3.1.0.M2/jbds-build/site/eclipse/index.html /home/hudson/hudson_workspace/workspace/jbosstools-nightly-3.1.0.M2/jbds-build/site/eclipse/plugins /home/hudson/hudson_workspace/workspace/jbosstools-nightly-3.1.0.M2/jbds-build/site/eclipse/site.xml /home/hudson/hudson_workspace/workspace/jbosstools-nightly-3.1.0.M2/jbds-build/site/eclipse/web /home/hudson/hudson_workspace/workspace/jbosstools-nightly-3.1.0.M2/jbds-build/site/nightly/trunk
++ find /home/hudson/hudson_workspace/workspace/jbosstools-nightly-3.1.0.M2/jbds-build/site/nightly/trunk/features -name '*.jar'
+ [[ -n /home/hudson/hudson_workspace/workspace/jbosstools-nightly-3.1.0.M2/jbds-build/site/nightly/trunk/features/org.jboss.tools.xulrunner.feature_1.8.1.3-20070904.jar
/home/hudson/hudson_workspace/workspace/jbosstools-nightly-3.1.0.M2/jbds-build/site/nightly/trunk/features/org.jboss.tools.jmx.feature_1.1.0.M1-N200906100601-H248.jar
/home/hudson/hudson_workspace/workspace/jbosstools-nightly-3.1.0.M2/jbds-build/site/nightly/trunk/features/org.jboss.tools.portlet.feature_1.1.0.M1-N200906100601-H248.jar
/home/hudson/hudson_workspace/workspace/jbosstools-nightly-3.1.0.M2/jbds-build/site/nightly/trunk/features/org.jboss.tools.seam.feature_3.1.0.M1-N200906100601-H248.jar
/home/hudson/hudson_workspace/workspace/jbosstools-nightly-3.1.0.M2/jbds-build/site/nightly/trunk/features/org.jboss.ide.eclipse.as.feature_2.1.0.M1-N200906100601-H248.jar
/home/hudson/hudson_workspace/workspace/jbosstools-nightly-3.1.0.M2/jbds-build/site/nightly/trunk/features/org.jboss.tools.birt.feature_1.1.0.M1-N200906100601-H248.jar
/home/hudson/hudson_workspace/workspace/jbosstools-nightly-3.1.0.M2/jbds-build/site/nightly/trunk/features/org.jboss.ide.eclipse.freemarker.feature_1.1.0.M1-N200906100601-H248.jar
/home/hudson/hudson_workspace/workspace/jbosstools-nightly-3.1.0.M2/jbds-build/site/nightly/trunk/features/org.jboss.tools.struts_feature_3.1.0.M1-N200906100601-H248.jar
/home/hudson/hudson_workspace/workspace/jbosstools-nightly-3.1.0.M2/jbds-build/site/nightly/trunk/features/org.jboss.tools.richfaces.feature_3.1.0.M1-N200906100601-H248.jar
/home/hudson/hudson_workspace/workspace/jbosstools-nightly-3.1.0.M2/jbds-build/site/nightly/trunk/features/org.jboss.tools.smooks.feature_1.1.0.M1-N200906100601-H248.jar
/home/hudson/hudson_workspace/workspace/jbosstools-nightly-3.1.0.M2/jbds-build/site/nightly/trunk/features/org.jbpm.gd.jpdl.feature_3.1.7.GA-N200906100601-H248.jar
/home/hudson/hudson_workspace/workspace/jbosstools-nightly-3.1.0.M2/jbds-build/site/nightly/trunk/features/org.jboss.tools.tptp.feature_1.1.0.M1-N200906100601-H248.jar
/home/hudson/hudson_workspace/workspace/jbosstools-nightly-3.1.0.M2/jbds-build/site/nightly/trunk/features/org.jboss.tools.esb.feature_1.3.0.M1-N200906100601-H248.jar
/home/hudson/hudson_workspace/workspace/jbosstools-nightly-3.1.0.M2/jbds-build/site/nightly/trunk/features/org.hibernate.eclipse.feature_3.3.0.M1-N200906100601-H248.jar
/home/hudson/hudson_workspace/workspace/jbosstools-nightly-3.1.0.M2/jbds-build/site/nightly/trunk/features/org.jboss.tools.ws.feature_1.1.0.M1-N200906100601-H248.jar
/home/hudson/hudson_workspace/workspace/jbosstools-nightly-3.1.0.M2/jbds-build/site/nightly/trunk/features/org.guvnor.tools.feature_5.1.0.trunk-N200906100601-H248.jar
/home/hudson/hudson_workspace/workspace/jbosstools-nightly-3.1.0.M2/jbds-build/site/nightly/trunk/features/org.drools.eclipse.feature_5.1.0.trunk-N200906100601-H248.jar
/home/hudson/hudson_workspace/workspace/jbosstools-nightly-3.1.0.M2/jbds-build/site/nightly/trunk/features/org.drools.eclipse.task.feature_5.1.0.trunk-N200906100601-H248.jar
/home/hudson/hudson_workspace/workspace/jbosstools-nightly-3.1.0.M2/jbds-build/site/nightly/trunk/features/org.jboss.ide.eclipse.archives.feature_3.1.0.M1-N200906100601-H248.jar
/home/hudson/hudson_workspace/workspace/jbosstools-nightly-3.1.0.M2/jbds-build/site/nightly/trunk/features/org.jboss.tools.jbpm.convert.feature_1.1.0.M1-N200906100601-H248.jar
/home/hudson/hudson_workspace/workspace/jbosstools-nightly-3.1.0.M2/jbds-build/site/nightly/trunk/features/org.jboss.tools.project.examples.feature_1.1.0.M1-N200906100601-H248.jar ]]
+ mkdir -p jbossqa@download.jboss.org:/htdocs/jbosstools/updates/nightly/
+ rsync -arz --delete /home/hudson/hudson_workspace/workspace/jbosstools-nightly-3.1.0.M2/jbds-build/site/nightly/trunk jbossqa@download.jboss.org:/htdocs/jbosstools/updates/nightly/
++ date +%s
+ endtime=1244642999
++ echo 'scale=2; (1244642999 - 1244628790)/60'
++ bc -l
+ elapsed=236.81
+ echo 'Elapsed time: 236.81mins.'
Elapsed time: 236.81mins.
Terminating xvnc
[jbosstools-nightly-3.1.0.M2] $ vncserver -kill :11
Killing Xvnc process ID 30583
[jbosstools-nightly-3.1.0.M2] $ bash -xe /tmp/hudson8892517964079277994.sh
+ kill 30564
Recording test results
Recording Emma reports jbds-build/coverage.xml
[PMD] Collecting PMD analysis files...
[PMD] Found 5995 annotations (0 new, 784 high, 5209 normal, 2 low)
[PMD] Don't changing build status, no threshold has been exceeded
Build was marked for publishing on https://hudson.jboss.org/hudson/
Email was triggered for: Unstable
Email was triggered for: Still Unstable
Trigger Unstable was overridden by another trigger and will not send an email.
There are 1 triggered emails.
Sending email for trigger: Still Unstable
--------------------------------------------------
15 years, 8 months
[Still Unstable] jbosstools-nightly-3.1.0.M2 #247
by jboss-qa-internal@redhat.com
Public:
https://hudson.jboss.org/hudson//job/jbosstools-nightly-3.1.0.M2/247
https://hudson.jboss.org/hudson//job/jbosstools-nightly-3.1.0.M2/247/test...
https://hudson.jboss.org/hudson//job/jbosstools-nightly-3.1.0.M2/247/changes
https://hudson.jboss.org/hudson//job/jbosstools-nightly-3.1.0.M2/247/console
Internal:
http://hudson.qa.jboss.com/hudson/job/jbosstools-nightly-3.1.0.M2/247/
http://hudson.qa.jboss.com/hudson/job/jbosstools-nightly-3.1.0.M2/247//te...
http://hudson.qa.jboss.com/hudson/job/jbosstools-nightly-3.1.0.M2/247//ch...
http://hudson.qa.jboss.com/hudson/job/jbosstools-nightly-3.1.0.M2/247//co...
--------------------------------------------------
Failed Tests:
4 tests failed.
REGRESSION: AllTests
Error Message:
expected:<103> but was:<102>
Stack Trace:
junit.framework.AssertionFailedError: expected:<103> but was:<102>
at org.drools.eclipse.editors.completion.CompletionContextTest.testCheckLHSLocationDetermination_INSIDE_CONDITION_END4(CompletionContextTest.java:583)
at org.eclipse.test.EclipseTestRunner.run(EclipseTestRunner.java:354)
at org.eclipse.test.EclipseTestRunner.run(EclipseTestRunner.java:206)
at org.eclipse.test.UITestApplication$3.run(UITestApplication.java:195)
at org.eclipse.swt.widgets.RunnableLock.run(RunnableLock.java:35)
at org.eclipse.swt.widgets.Synchronizer.runAsyncMessages(Synchronizer.java:134)
at org.eclipse.swt.widgets.Display.runAsyncMessages(Display.java:3468)
at org.eclipse.swt.widgets.Display.readAndDispatch(Display.java:3115)
at org.eclipse.ui.internal.Workbench.runEventLoop(Workbench.java:2405)
at org.eclipse.ui.internal.Workbench.runUI(Workbench.java:2369)
at org.eclipse.ui.internal.Workbench.access$4(Workbench.java:2221)
at org.eclipse.ui.internal.Workbench$5.run(Workbench.java:500)
at org.eclipse.core.databinding.observable.Realm.runWithDefault(Realm.java:332)
at org.eclipse.ui.internal.Workbench.createAndRunWorkbench(Workbench.java:493)
at org.eclipse.ui.PlatformUI.createAndRunWorkbench(PlatformUI.java:149)
at org.eclipse.ui.internal.ide.application.IDEApplication.start(IDEApplication.java:113)
at org.eclipse.test.UITestApplication.runApplication(UITestApplication.java:138)
at org.eclipse.test.UITestApplication.run(UITestApplication.java:60)
at org.eclipse.test.UITestApplication.start(UITestApplication.java:210)
at org.eclipse.equinox.internal.app.EclipseAppHandle.run(EclipseAppHandle.java:194)
at org.eclipse.core.runtime.internal.adaptor.EclipseAppLauncher.runApplication(EclipseAppLauncher.java:110)
at org.eclipse.core.runtime.internal.adaptor.EclipseAppLauncher.start(EclipseAppLauncher.java:79)
at org.eclipse.core.runtime.adaptor.EclipseStarter.run(EclipseStarter.java:368)
at org.eclipse.core.runtime.adaptor.EclipseStarter.run(EclipseStarter.java:179)
at org.eclipse.equinox.launcher.Main.invokeFramework(Main.java:559)
at org.eclipse.equinox.launcher.Main.basicRun(Main.java:514)
at org.eclipse.equinox.launcher.Main.run(Main.java:1311)
at org.eclipse.equinox.launcher.Main.main(Main.java:1287)
at org.eclipse.core.launcher.Main.main(Main.java:34)
REGRESSION: AllTests
Error Message:
expected:<100> but was:<103>
Stack Trace:
junit.framework.AssertionFailedError: expected:<100> but was:<103>
at org.drools.eclipse.editors.completion.CompletionContextTest.testCheckLHSLocationDetermination_INSIDE_CONDITION_START14(CompletionContextTest.java:593)
at org.eclipse.test.EclipseTestRunner.run(EclipseTestRunner.java:354)
at org.eclipse.test.EclipseTestRunner.run(EclipseTestRunner.java:206)
at org.eclipse.test.UITestApplication$3.run(UITestApplication.java:195)
at org.eclipse.swt.widgets.RunnableLock.run(RunnableLock.java:35)
at org.eclipse.swt.widgets.Synchronizer.runAsyncMessages(Synchronizer.java:134)
at org.eclipse.swt.widgets.Display.runAsyncMessages(Display.java:3468)
at org.eclipse.swt.widgets.Display.readAndDispatch(Display.java:3115)
at org.eclipse.ui.internal.Workbench.runEventLoop(Workbench.java:2405)
at org.eclipse.ui.internal.Workbench.runUI(Workbench.java:2369)
at org.eclipse.ui.internal.Workbench.access$4(Workbench.java:2221)
at org.eclipse.ui.internal.Workbench$5.run(Workbench.java:500)
at org.eclipse.core.databinding.observable.Realm.runWithDefault(Realm.java:332)
at org.eclipse.ui.internal.Workbench.createAndRunWorkbench(Workbench.java:493)
at org.eclipse.ui.PlatformUI.createAndRunWorkbench(PlatformUI.java:149)
at org.eclipse.ui.internal.ide.application.IDEApplication.start(IDEApplication.java:113)
at org.eclipse.test.UITestApplication.runApplication(UITestApplication.java:138)
at org.eclipse.test.UITestApplication.run(UITestApplication.java:60)
at org.eclipse.test.UITestApplication.start(UITestApplication.java:210)
at org.eclipse.equinox.internal.app.EclipseAppHandle.run(EclipseAppHandle.java:194)
at org.eclipse.core.runtime.internal.adaptor.EclipseAppLauncher.runApplication(EclipseAppLauncher.java:110)
at org.eclipse.core.runtime.internal.adaptor.EclipseAppLauncher.start(EclipseAppLauncher.java:79)
at org.eclipse.core.runtime.adaptor.EclipseStarter.run(EclipseStarter.java:368)
at org.eclipse.core.runtime.adaptor.EclipseStarter.run(EclipseStarter.java:179)
at org.eclipse.equinox.launcher.Main.invokeFramework(Main.java:559)
at org.eclipse.equinox.launcher.Main.basicRun(Main.java:514)
at org.eclipse.equinox.launcher.Main.run(Main.java:1311)
at org.eclipse.equinox.launcher.Main.main(Main.java:1287)
at org.eclipse.core.launcher.Main.main(Main.java:34)
FAILED: SeamCoreAllTests
Error Message:
Problem marker was found in varAttributes.xhtml file. Validator did not recognize 'var' attribute. expected:<0> but was:<1>
Stack Trace:
junit.framework.AssertionFailedError: Problem marker was found in varAttributes.xhtml file. Validator did not recognize 'var' attribute. expected:<0> but was:<1>
at org.jboss.tools.seam.core.test.SeamValidatorsTest.testVarAttributes(SeamValidatorsTest.java:103)
at junit.extensions.TestDecorator.basicRun(TestDecorator.java:24)
at junit.extensions.TestSetup$1.protect(TestSetup.java:21)
at junit.extensions.TestSetup.run(TestSetup.java:25)
at org.eclipse.test.EclipseTestRunner.run(EclipseTestRunner.java:354)
at org.eclipse.test.EclipseTestRunner.run(EclipseTestRunner.java:206)
at org.eclipse.test.UITestApplication$3.run(UITestApplication.java:195)
at org.eclipse.swt.widgets.RunnableLock.run(RunnableLock.java:35)
at org.eclipse.swt.widgets.Synchronizer.runAsyncMessages(Synchronizer.java:134)
at org.eclipse.swt.widgets.Display.runAsyncMessages(Display.java:3468)
at org.eclipse.swt.widgets.Display.readAndDispatch(Display.java:3115)
at org.eclipse.ui.internal.Workbench.runEventLoop(Workbench.java:2405)
at org.eclipse.ui.internal.Workbench.runUI(Workbench.java:2369)
at org.eclipse.ui.internal.Workbench.access$4(Workbench.java:2221)
at org.eclipse.ui.internal.Workbench$5.run(Workbench.java:500)
at org.eclipse.core.databinding.observable.Realm.runWithDefault(Realm.java:332)
at org.eclipse.ui.internal.Workbench.createAndRunWorkbench(Workbench.java:493)
at org.eclipse.ui.PlatformUI.createAndRunWorkbench(PlatformUI.java:149)
at org.eclipse.ui.internal.ide.application.IDEApplication.start(IDEApplication.java:113)
at org.eclipse.test.UITestApplication.runApplication(UITestApplication.java:138)
at org.eclipse.test.UITestApplication.run(UITestApplication.java:60)
at org.eclipse.test.UITestApplication.start(UITestApplication.java:210)
at org.eclipse.equinox.internal.app.EclipseAppHandle.run(EclipseAppHandle.java:194)
at org.eclipse.core.runtime.internal.adaptor.EclipseAppLauncher.runApplication(EclipseAppLauncher.java:110)
at org.eclipse.core.runtime.internal.adaptor.EclipseAppLauncher.start(EclipseAppLauncher.java:79)
at org.eclipse.core.runtime.adaptor.EclipseStarter.run(EclipseStarter.java:368)
at org.eclipse.core.runtime.adaptor.EclipseStarter.run(EclipseStarter.java:179)
at org.eclipse.equinox.launcher.Main.invokeFramework(Main.java:559)
at org.eclipse.equinox.launcher.Main.basicRun(Main.java:514)
at org.eclipse.equinox.launcher.Main.run(Main.java:1311)
at org.eclipse.equinox.launcher.Main.main(Main.java:1287)
at org.eclipse.core.launcher.Main.main(Main.java:34)
FAILED: SeamCoreAllTests
Error Message:
Problem marker was found in abcComponent.xhtml expected:<0> but was:<1>
Stack Trace:
junit.framework.AssertionFailedError: Problem marker was found in abcComponent.xhtml expected:<0> but was:<1>
at org.jboss.tools.seam.core.test.SeamValidatorsTest.testExpressionLanguageValidator(SeamValidatorsTest.java:702)
at junit.extensions.TestDecorator.basicRun(TestDecorator.java:24)
at junit.extensions.TestSetup$1.protect(TestSetup.java:21)
at junit.extensions.TestSetup.run(TestSetup.java:25)
at org.eclipse.test.EclipseTestRunner.run(EclipseTestRunner.java:354)
at org.eclipse.test.EclipseTestRunner.run(EclipseTestRunner.java:206)
at org.eclipse.test.UITestApplication$3.run(UITestApplication.java:195)
at org.eclipse.swt.widgets.RunnableLock.run(RunnableLock.java:35)
at org.eclipse.swt.widgets.Synchronizer.runAsyncMessages(Synchronizer.java:134)
at org.eclipse.swt.widgets.Display.runAsyncMessages(Display.java:3468)
at org.eclipse.swt.widgets.Display.readAndDispatch(Display.java:3115)
at org.eclipse.ui.internal.Workbench.runEventLoop(Workbench.java:2405)
at org.eclipse.ui.internal.Workbench.runUI(Workbench.java:2369)
at org.eclipse.ui.internal.Workbench.access$4(Workbench.java:2221)
at org.eclipse.ui.internal.Workbench$5.run(Workbench.java:500)
at org.eclipse.core.databinding.observable.Realm.runWithDefault(Realm.java:332)
at org.eclipse.ui.internal.Workbench.createAndRunWorkbench(Workbench.java:493)
at org.eclipse.ui.PlatformUI.createAndRunWorkbench(PlatformUI.java:149)
at org.eclipse.ui.internal.ide.application.IDEApplication.start(IDEApplication.java:113)
at org.eclipse.test.UITestApplication.runApplication(UITestApplication.java:138)
at org.eclipse.test.UITestApplication.run(UITestApplication.java:60)
at org.eclipse.test.UITestApplication.start(UITestApplication.java:210)
at org.eclipse.equinox.internal.app.EclipseAppHandle.run(EclipseAppHandle.java:194)
at org.eclipse.core.runtime.internal.adaptor.EclipseAppLauncher.runApplication(EclipseAppLauncher.java:110)
at org.eclipse.core.runtime.internal.adaptor.EclipseAppLauncher.start(EclipseAppLauncher.java:79)
at org.eclipse.core.runtime.adaptor.EclipseStarter.run(EclipseStarter.java:368)
at org.eclipse.core.runtime.adaptor.EclipseStarter.run(EclipseStarter.java:179)
at org.eclipse.equinox.launcher.Main.invokeFramework(Main.java:559)
at org.eclipse.equinox.launcher.Main.basicRun(Main.java:514)
at org.eclipse.equinox.launcher.Main.run(Main.java:1311)
at org.eclipse.equinox.launcher.Main.main(Main.java:1287)
at org.eclipse.core.launcher.Main.main(Main.java:34)
--------------------------------------------------
Changes:
[Grid.Qian] add bpel module
[Grid.Qian] wrong place
[Grid.Qian] add the bpel module
--------------------------------------------------
Console log:
[...truncated 23991 lines...]
[jar] Building jar: /home/hudson/hudson_workspace/workspace/jbosstools-nightly-3.1.0.M2/jbds-build/site/eclipse/plugins/org.jboss.tools.vpe.html_3.1.0.M1-N200906100018-H247.jar
[jar] Building jar: /home/hudson/hudson_workspace/workspace/jbosstools-nightly-3.1.0.M2/jbds-build/site/eclipse/plugins/org.jboss.tools.vpe.jsp_3.1.0.M1-N200906100018-H247.jar
[jar] Building jar: /home/hudson/hudson_workspace/workspace/jbosstools-nightly-3.1.0.M2/jbds-build/site/eclipse/plugins/org.jboss.tools.vpe.ui.palette_3.1.0.M1-N200906100018-H247.jar
[jar] Building jar: /home/hudson/hudson_workspace/workspace/jbosstools-nightly-3.1.0.M2/jbds-build/site/eclipse/plugins/org.jboss.tools.vpe_3.1.0.M1-N200906100018-H247.jar
[jar] Building jar: /home/hudson/hudson_workspace/workspace/jbosstools-nightly-3.1.0.M2/jbds-build/site/eclipse/plugins/org.jboss.tools.xulrunner_1.0.0.GA-N200906100018-H247.jar
[jar] Building jar: /home/hudson/hudson_workspace/workspace/jbosstools-nightly-3.1.0.M2/jbds-build/site/eclipse/plugins/org.mozilla.xpcom_1.8.1.3-20070904.jar
[jar] Building jar: /home/hudson/hudson_workspace/workspace/jbosstools-nightly-3.1.0.M2/jbds-build/site/eclipse/plugins/org.mozilla.xulrunner.carbon.macosx_1.8.1.3-20070904.jar
[jar] Building jar: /home/hudson/hudson_workspace/workspace/jbosstools-nightly-3.1.0.M2/jbds-build/site/eclipse/plugins/org.mozilla.xulrunner.gtk.linux.x86_1.8.1.3-20070904.jar
[jar] Building jar: /home/hudson/hudson_workspace/workspace/jbosstools-nightly-3.1.0.M2/jbds-build/site/eclipse/plugins/org.mozilla.xulrunner.gtk.linux.x86_64_1.8.1.4-20080112.jar
[jar] Building jar: /home/hudson/hudson_workspace/workspace/jbosstools-nightly-3.1.0.M2/jbds-build/site/eclipse/plugins/org.mozilla.xulrunner.win32.win32.x86_1.8.1.3-20070904.jar
load.properties:
[echo] Getting version for 'jmx' builder to property 'jmx.versionTag' from /qa/services/hudson/hudson_workspace/workspace/jbosstools-nightly-3.1.0.M2/org.jboss.ide.eclipse.releng/builders/product/versionTags/jbosstools/3.1.0.M1.tags
[echo]
[echo] jbds-jmx-filename=JMX-1.1.0.M1-N200906100018-H247.zip
[echo] jbds-jmx-nodeps-filename=JMX-nodeps-1.1.0.M1-N200906100018-H247.zip
[echo]
[echo] Getting version for 'drools-ide' builder to property 'drools-ide.versionTag' from /qa/services/hudson/hudson_workspace/workspace/jbosstools-nightly-3.1.0.M2/org.jboss.ide.eclipse.releng/builders/product/versionTags/jbosstools/3.1.0.M1.tags
[echo]
[echo] jbds-drools-ide-filename=DroolsIDE-5.1.0.trunk-N200906100018-H247.zip
[echo] jbds-drools-ide-nodeps-filename=DroolsIDE-nodeps-5.1.0.trunk-N200906100018-H247.zip
[echo]
[echo] Getting version for 'archives' builder to property 'archives.versionTag' from /qa/services/hudson/hudson_workspace/workspace/jbosstools-nightly-3.1.0.M2/org.jboss.ide.eclipse.releng/builders/product/versionTags/jbosstools/3.1.0.M1.tags
[echo]
[echo] jbds-archives-filename=JBossTools-Archives-3.1.0.M1-N200906100018-H247.zip
[echo] jbds-archives-nodeps-filename=JBossTools-Archives-nodeps-3.1.0.M1-N200906100018-H247.zip
[echo]
[echo] Getting version for 'xulrunner' builder to property 'xulrunner.versionTag' from /qa/services/hudson/hudson_workspace/workspace/jbosstools-nightly-3.1.0.M2/org.jboss.ide.eclipse.releng/builders/product/versionTags/jbosstools/3.1.0.M1.tags
[echo]
[echo] jbds-xulrunner-win32-filename=XulRunner-win32-1.0.0.GA-N200906100018-H247.zip
[echo] jbds-xulrunner-win32-nodeps-filename=XulRunner-win32-nodeps-1.0.0.GA-N200906100018-H247.zip
[echo]
[echo] Getting version for 'xulrunner' builder to property 'xulrunner.versionTag' from /qa/services/hudson/hudson_workspace/workspace/jbosstools-nightly-3.1.0.M2/org.jboss.ide.eclipse.releng/builders/product/versionTags/jbosstools/3.1.0.M1.tags
[echo]
[echo] jbds-xulrunner-linux-gtk-filename=XulRunner-linux-gtk-1.0.0.GA-N200906100018-H247.zip
[echo] jbds-xulrunner-linux-gtk-nodeps-filename=XulRunner-linux-gtk-nodeps-1.0.0.GA-N200906100018-H247.zip
[echo]
[echo] Getting version for 'richfaces' builder to property 'richfaces.versionTag' from /qa/services/hudson/hudson_workspace/workspace/jbosstools-nightly-3.1.0.M2/org.jboss.ide.eclipse.releng/builders/product/versionTags/jbosstools/3.1.0.M1.tags
[echo]
[echo] jbds-richfaces-win32-filename=RichFaces-VPE-win32-3.1.0.M1-N200906100018-H247.zip
[echo] jbds-richfaces-win32-nodeps-filename=RichFaces-VPE-win32-nodeps-3.1.0.M1-N200906100018-H247.zip
[echo]
[echo] Getting version for 'richfaces' builder to property 'richfaces.versionTag' from /qa/services/hudson/hudson_workspace/workspace/jbosstools-nightly-3.1.0.M2/org.jboss.ide.eclipse.releng/builders/product/versionTags/jbosstools/3.1.0.M1.tags
[echo]
[echo] jbds-richfaces-linux-gtk-filename=RichFaces-VPE-linux-gtk-3.1.0.M1-N200906100018-H247.zip
[echo] jbds-richfaces-linux-gtk-nodeps-filename=RichFaces-VPE-linux-gtk-nodeps-3.1.0.M1-N200906100018-H247.zip
[echo]
[echo] Getting version for 'jbpm-convert' builder to property 'jbpm-convert.versionTag' from /qa/services/hudson/hudson_workspace/workspace/jbosstools-nightly-3.1.0.M2/org.jboss.ide.eclipse.releng/builders/product/versionTags/jbosstools/3.1.0.M1.tags
[echo]
[echo] jbds-jbpm-convert-filename=jBPM-Convert-1.1.0.M1-N200906100018-H247.zip
[echo] jbds-jbpm-convert-nodeps-filename=jBPM-Convert-nodeps-1.1.0.M1-N200906100018-H247.zip
[echo]
[echo] Getting version for 'freemarker' builder to property 'freemarker.versionTag' from /qa/services/hudson/hudson_workspace/workspace/jbosstools-nightly-3.1.0.M2/org.jboss.ide.eclipse.releng/builders/product/versionTags/jbosstools/3.1.0.M1.tags
[echo]
[echo] jbds-freemarker-filename=FreeMarkerIDE-1.1.0.M1-N200906100018-H247.zip
[echo] jbds-freemarker-nodeps-filename=
[echo]
[length] /home/hudson/hudson_workspace/workspace/jbosstools-nightly-3.1.0.M2/jbds-build/3.1.0.M1/200906100018/freemarker is a directory; length unspecified
[echo] Getting version for 'hibernate-tools' builder to property 'hibernate-tools.versionTag' from /qa/services/hudson/hudson_workspace/workspace/jbosstools-nightly-3.1.0.M2/org.jboss.ide.eclipse.releng/builders/product/versionTags/jbosstools/3.1.0.M1.tags
[echo]
[echo] jbds-hibernate-tools-filename=HibernateTools-3.3.0.M1-N200906100018-H247.zip
[echo] jbds-hibernate-tools-nodeps-filename=HibernateTools-nodeps-3.3.0.M1-N200906100018-H247.zip
[echo]
[echo] Getting version for 'struts' builder to property 'struts.versionTag' from /qa/services/hudson/hudson_workspace/workspace/jbosstools-nightly-3.1.0.M2/org.jboss.ide.eclipse.releng/builders/product/versionTags/jbosstools/3.1.0.M1.tags
[echo]
[echo] jbds-struts-filename=StrutsTools-3.1.0.M1-N200906100018-H247.zip
[echo] jbds-struts-nodeps-filename=StrutsTools-nodeps-3.1.0.M1-N200906100018-H247.zip
[echo]
[echo] Getting version for 'jbpm' builder to property 'jbpm.versionTag' from /qa/services/hudson/hudson_workspace/workspace/jbosstools-nightly-3.1.0.M2/org.jboss.ide.eclipse.releng/builders/product/versionTags/jbosstools/3.1.0.M1.tags
[echo]
[echo] jbds-jbpm-filename=jBPM-Designer-3.1.7.GA-N200906100018-H247.zip
[echo] jbds-jbpm-nodeps-filename=jBPM-Designer-nodeps-3.1.7.GA-N200906100018-H247.zip
[echo]
[echo] Getting version for 'as' builder to property 'as.versionTag' from /qa/services/hudson/hudson_workspace/workspace/jbosstools-nightly-3.1.0.M2/org.jboss.ide.eclipse.releng/builders/product/versionTags/jbosstools/3.1.0.M1.tags
[echo]
[echo] jbds-as-filename=JBossAS-Tools-2.1.0.M1-N200906100018-H247.zip
[echo] jbds-as-nodeps-filename=JBossAS-Tools-nodeps-2.1.0.M1-N200906100018-H247.zip
[echo]
[echo] Getting version for 'seam' builder to property 'seam.versionTag' from /qa/services/hudson/hudson_workspace/workspace/jbosstools-nightly-3.1.0.M2/org.jboss.ide.eclipse.releng/builders/product/versionTags/jbosstools/3.1.0.M1.tags
[echo]
[echo] jbds-seam-filename=SeamTools-3.1.0.M1-N200906100018-H247.zip
[echo] jbds-seam-nodeps-filename=SeamTools-nodeps-3.1.0.M1-N200906100018-H247.zip
[echo]
[echo] Getting version for 'examples' builder to property 'examples.versionTag' from /qa/services/hudson/hudson_workspace/workspace/jbosstools-nightly-3.1.0.M2/org.jboss.ide.eclipse.releng/builders/product/versionTags/jbosstools/3.1.0.M1.tags
[echo]
[echo] jbds-examples-filename=JBossTools-Examples-1.1.0.M1-N200906100018-H247.zip
[echo] jbds-examples-nodeps-filename=JBossTools-Examples-nodeps-1.1.0.M1-N200906100018-H247.zip
[echo]
[echo] Getting version for 'esb' builder to property 'esb.versionTag' from /qa/services/hudson/hudson_workspace/workspace/jbosstools-nightly-3.1.0.M2/org.jboss.ide.eclipse.releng/builders/product/versionTags/jbosstools/3.1.0.M1.tags
[echo]
[echo] jbds-esb-filename=JBossTools-ESB-1.3.0.M1-N200906100018-H247.zip
[echo] jbds-esb-nodeps-filename=JBossTools-ESB-nodeps-1.3.0.M1-N200906100018-H247.zip
[echo]
[echo] Getting version for 'ws' builder to property 'ws.versionTag' from /qa/services/hudson/hudson_workspace/workspace/jbosstools-nightly-3.1.0.M2/org.jboss.ide.eclipse.releng/builders/product/versionTags/jbosstools/3.1.0.M1.tags
[echo]
[echo] jbds-ws-filename=JBossWS-Tools-1.1.0.M1-N200906100018-H247.zip
[echo] jbds-ws-nodeps-filename=JBossWS-Tools-nodeps-1.1.0.M1-N200906100018-H247.zip
[echo]
[echo] Getting version for 'birt' builder to property 'birt.versionTag' from /qa/services/hudson/hudson_workspace/workspace/jbosstools-nightly-3.1.0.M2/org.jboss.ide.eclipse.releng/builders/product/versionTags/jbosstools/3.1.0.M1.tags
[echo]
[echo] jbds-birt-filename=JBossTools-BIRT-1.1.0.M1-N200906100018-H247.zip
[echo] jbds-birt-nodeps-filename=JBossTools-BIRT-nodeps-1.1.0.M1-N200906100018-H247.zip
[echo]
[echo] Getting version for 'portlet' builder to property 'portlet.versionTag' from /qa/services/hudson/hudson_workspace/workspace/jbosstools-nightly-3.1.0.M2/org.jboss.ide.eclipse.releng/builders/product/versionTags/jbosstools/3.1.0.M1.tags
[echo]
[echo] jbds-portlet-filename=JBoss-Portlet-Tools-1.1.0.M1-N200906100018-H247.zip
[echo] jbds-portlet-nodeps-filename=JBoss-Portlet-Tools-nodeps-1.1.0.M1-N200906100018-H247.zip
[echo]
[echo] Getting version for 'smooks' builder to property 'smooks.versionTag' from /qa/services/hudson/hudson_workspace/workspace/jbosstools-nightly-3.1.0.M2/org.jboss.ide.eclipse.releng/builders/product/versionTags/jbosstools/3.1.0.M1.tags
[echo]
[echo] jbds-smooks-filename=JBossTools-Smooks-1.1.0.M1-N200906100018-H247.zip
[echo] jbds-smooks-nodeps-filename=JBossTools-Smooks-nodeps-1.1.0.M1-N200906100018-H247.zip
[echo]
[echo] Getting version for 'tptp' builder to property 'tptp.versionTag' from /qa/services/hudson/hudson_workspace/workspace/jbosstools-nightly-3.1.0.M2/org.jboss.ide.eclipse.releng/builders/product/versionTags/jbosstools/3.1.0.M1.tags
[echo]
[echo] jbds-tptp-filename=JBoss-TPTP-Tools-1.1.0.M1-N200906100018-H247.zip
[echo] jbds-tptp-nodeps-filename=JBoss-TPTP-Tools-nodeps-1.1.0.M1-N200906100018-H247.zip
[echo]
pack200:
[echo] Using /qa/tools/opt/jdk1.5.0_15/jre/bin/pack200 to pack update site jars...
[mkdir] Created dir: /qa/services/hudson/hudson_workspace/workspace/jbosstools-nightly-3.1.0.M2/org.jboss.ide.eclipse.releng/builders/product/updateSite/updateSitePackTmp/output
[mkdir] Created dir: /qa/services/hudson/hudson_workspace/workspace/jbosstools-nightly-3.1.0.M2/org.jboss.ide.eclipse.releng/builders/product/updateSite/updateSitePackTmp/input
[echo] Zip update jars in /home/hudson/hudson_workspace/workspace/jbosstools-nightly-3.1.0.M2/jbds-build/site to temporary Master zip (to avoid packing nested jars) ...
[zip] Building zip: /qa/services/hudson/hudson_workspace/workspace/jbosstools-nightly-3.1.0.M2/org.jboss.ide.eclipse.releng/builders/product/updateSite/updateSitePackTmp/input/Master.zip
[exec] 20M updateSite/updateSitePackTmp/input/Master.zip
[echo] Pack jars ...
[echo] Run jarprocessor.pack200 using launcherjar = /home/hudson/hudson_workspace/workspace/jbosstools-nightly-3.1.0.M2/jbds-build/clean-eclipse/eclipse/plugins/org.eclipse.equinox.launcher_1.0.200.v20090520.jar
[exec] 166M updateSite/updateSitePackTmp/output/Master.zip
[unzip] Expanding: /qa/services/hudson/hudson_workspace/workspace/jbosstools-nightly-3.1.0.M2/org.jboss.ide.eclipse.releng/builders/product/updateSite/updateSitePackTmp/output/Master.zip into /home/hudson/hudson_workspace/workspace/jbosstools-nightly-3.1.0.M2/jbds-build/site
[delete] Deleting directory /qa/services/hudson/hudson_workspace/workspace/jbosstools-nightly-3.1.0.M2/org.jboss.ide.eclipse.releng/builders/product/updateSite/updateSitePackTmp
copy.site.rootfiles:
[echo] Build development jbosstools update site...
[copy] Copying 4 files to /home/hudson/hudson_workspace/workspace/jbosstools-nightly-3.1.0.M2/jbds-build/site/eclipse
p2:
[echo] Run p2 metadata generator using launcherjar = /home/hudson/hudson_workspace/workspace/jbosstools-nightly-3.1.0.M2/jbds-build/clean-eclipse/eclipse/plugins/org.eclipse.equinox.launcher_1.0.200.v20090520.jar
[p2] Generating metadata for /home/hudson/hudson_workspace/workspace/jbosstools-nightly-3.1.0.M2/jbds-build/site/eclipse.
[p2] Generation completed with success [12 seconds].
build.metadata:
publish.site:
post-build:
publish.results:
send.notification.email:
[mail] Failed to initialise MIME mail: javax/mail/MessagingException
publish.log:
init:
clean.all.subfolders:
BUILD SUCCESSFUL
Total time: 182 minutes 5 seconds
+ cd ../configs/jbds
+ zip build.log.zip build.log
updating: build.log (deflated 95%)
+ cd ../..
++ date +%s
+ endtime=1244619462
++ echo 'scale=2; (1244619462 - 1244608372)/60'
++ bc -l
+ elapsed=184.83
+ echo 'Elapsed time: 184.83mins.'
Elapsed time: 184.83mins.
+ [[ '' == \l\o\c\a\l ]]
++ cat /home/hudson/hudson_workspace/workspace/jbosstools-nightly-3.1.0.M2/jbds-build/buildData.properties
++ grep product.releaseNumber
++ perl -ne 's/[\s\t]+product.releaseNumber=//g;print;'
+ version=3.1.0.M1
++ cat /home/hudson/hudson_workspace/workspace/jbosstools-nightly-3.1.0.M2/jbds-build/buildData.properties
++ grep upload.to
++ perl -ne 's/[\s\t]+upload.to=//g;print;'
+ builddir=nightly/3.1.0.M1/200906100018
++ cat /home/hudson/hudson_workspace/workspace/jbosstools-nightly-3.1.0.M2/jbds-build/buildData.properties
++ grep product.buildDesc
++ perl -ne 's/[\s\t]+product.buildDesc=//g; print;'
+ buildtype=nightly
++ cat /home/hudson/hudson_workspace/workspace/jbosstools-nightly-3.1.0.M2/jbds-build/buildData.properties
++ grep product.releaseNumber
++ perl -ne 's/[\s\t]+product.releaseNumber=//g; print;'
+ releaseNumber=3.1.0.M1
+ DESTINATION=jbossqa@download.jboss.org:/htdocs/jbosstools
+ scp -r /home/hudson/hudson_workspace/workspace/jbosstools-nightly-3.1.0.M2/jbds-build/3.1.0.M1 jbossqa@download.jboss.org:/htdocs/jbosstools/builds/nightly/
+ scp configs/jbds/build.log.zip jbossqa@download.jboss.org:/htdocs/jbosstools/builds/nightly/3.1.0.M1/200906100018/
+ scp /home/hudson/hudson_workspace/workspace/jbosstools-nightly-3.1.0.M2/jbds-build/latestBuild.html jbossqa@download.jboss.org:/htdocs/jbosstools/builds/nightly/
++ date +%s
+ endtime=1244622338
++ echo 'scale=2; (1244622338 - 1244608372)/60'
++ bc -l
+ elapsed=232.76
+ echo 'Elapsed time: 232.76mins.'
Elapsed time: 232.76mins.
+ [[ -d /home/hudson/hudson_workspace/workspace/jbosstools-nightly-3.1.0.M2/jbds-build/site/eclipse ]]
+ mkdir -p /home/hudson/hudson_workspace/workspace/jbosstools-nightly-3.1.0.M2/jbds-build/site/nightly/trunk
+ mv /home/hudson/hudson_workspace/workspace/jbosstools-nightly-3.1.0.M2/jbds-build/site/eclipse/artifacts.jar /home/hudson/hudson_workspace/workspace/jbosstools-nightly-3.1.0.M2/jbds-build/site/eclipse/associateSites.xml /home/hudson/hudson_workspace/workspace/jbosstools-nightly-3.1.0.M2/jbds-build/site/eclipse/content.jar /home/hudson/hudson_workspace/workspace/jbosstools-nightly-3.1.0.M2/jbds-build/site/eclipse/features /home/hudson/hudson_workspace/workspace/jbosstools-nightly-3.1.0.M2/jbds-build/site/eclipse/index.html /home/hudson/hudson_workspace/workspace/jbosstools-nightly-3.1.0.M2/jbds-build/site/eclipse/plugins /home/hudson/hudson_workspace/workspace/jbosstools-nightly-3.1.0.M2/jbds-build/site/eclipse/site.xml /home/hudson/hudson_workspace/workspace/jbosstools-nightly-3.1.0.M2/jbds-build/site/eclipse/web /home/hudson/hudson_workspace/workspace/jbosstools-nightly-3.1.0.M2/jbds-build/site/nightly/trunk
++ find /home/hudson/hudson_workspace/workspace/jbosstools-nightly-3.1.0.M2/jbds-build/site/nightly/trunk/features -name '*.jar'
+ [[ -n /home/hudson/hudson_workspace/workspace/jbosstools-nightly-3.1.0.M2/jbds-build/site/nightly/trunk/features/org.jboss.ide.eclipse.as.feature_2.1.0.M1-N200906100018-H247.jar
/home/hudson/hudson_workspace/workspace/jbosstools-nightly-3.1.0.M2/jbds-build/site/nightly/trunk/features/org.jboss.tools.seam.feature_3.1.0.M1-N200906100018-H247.jar
/home/hudson/hudson_workspace/workspace/jbosstools-nightly-3.1.0.M2/jbds-build/site/nightly/trunk/features/org.jboss.tools.struts_feature_3.1.0.M1-N200906100018-H247.jar
/home/hudson/hudson_workspace/workspace/jbosstools-nightly-3.1.0.M2/jbds-build/site/nightly/trunk/features/org.jboss.tools.smooks.feature_1.1.0.M1-N200906100018-H247.jar
/home/hudson/hudson_workspace/workspace/jbosstools-nightly-3.1.0.M2/jbds-build/site/nightly/trunk/features/org.guvnor.tools.feature_5.1.0.trunk-N200906100018-H247.jar
/home/hudson/hudson_workspace/workspace/jbosstools-nightly-3.1.0.M2/jbds-build/site/nightly/trunk/features/org.jboss.tools.tptp.feature_1.1.0.M1-N200906100018-H247.jar
/home/hudson/hudson_workspace/workspace/jbosstools-nightly-3.1.0.M2/jbds-build/site/nightly/trunk/features/org.jbpm.gd.jpdl.feature_3.1.7.GA-N200906100018-H247.jar
/home/hudson/hudson_workspace/workspace/jbosstools-nightly-3.1.0.M2/jbds-build/site/nightly/trunk/features/org.jboss.tools.ws.feature_1.1.0.M1-N200906100018-H247.jar
/home/hudson/hudson_workspace/workspace/jbosstools-nightly-3.1.0.M2/jbds-build/site/nightly/trunk/features/org.jboss.tools.xulrunner.feature_1.8.1.3-20070904.jar
/home/hudson/hudson_workspace/workspace/jbosstools-nightly-3.1.0.M2/jbds-build/site/nightly/trunk/features/org.jboss.tools.esb.feature_1.3.0.M1-N200906100018-H247.jar
/home/hudson/hudson_workspace/workspace/jbosstools-nightly-3.1.0.M2/jbds-build/site/nightly/trunk/features/org.hibernate.eclipse.feature_3.3.0.M1-N200906100018-H247.jar
/home/hudson/hudson_workspace/workspace/jbosstools-nightly-3.1.0.M2/jbds-build/site/nightly/trunk/features/org.jboss.tools.portlet.feature_1.1.0.M1-N200906100018-H247.jar
/home/hudson/hudson_workspace/workspace/jbosstools-nightly-3.1.0.M2/jbds-build/site/nightly/trunk/features/org.jboss.tools.jmx.feature_1.1.0.M1-N200906100018-H247.jar
/home/hudson/hudson_workspace/workspace/jbosstools-nightly-3.1.0.M2/jbds-build/site/nightly/trunk/features/org.jboss.tools.birt.feature_1.1.0.M1-N200906100018-H247.jar
/home/hudson/hudson_workspace/workspace/jbosstools-nightly-3.1.0.M2/jbds-build/site/nightly/trunk/features/org.jboss.tools.jbpm.convert.feature_1.1.0.M1-N200906100018-H247.jar
/home/hudson/hudson_workspace/workspace/jbosstools-nightly-3.1.0.M2/jbds-build/site/nightly/trunk/features/org.jboss.tools.richfaces.feature_3.1.0.M1-N200906100018-H247.jar
/home/hudson/hudson_workspace/workspace/jbosstools-nightly-3.1.0.M2/jbds-build/site/nightly/trunk/features/org.drools.eclipse.feature_5.1.0.trunk-N200906100018-H247.jar
/home/hudson/hudson_workspace/workspace/jbosstools-nightly-3.1.0.M2/jbds-build/site/nightly/trunk/features/org.drools.eclipse.task.feature_5.1.0.trunk-N200906100018-H247.jar
/home/hudson/hudson_workspace/workspace/jbosstools-nightly-3.1.0.M2/jbds-build/site/nightly/trunk/features/org.jboss.ide.eclipse.archives.feature_3.1.0.M1-N200906100018-H247.jar
/home/hudson/hudson_workspace/workspace/jbosstools-nightly-3.1.0.M2/jbds-build/site/nightly/trunk/features/org.jboss.ide.eclipse.freemarker.feature_1.1.0.M1-N200906100018-H247.jar
/home/hudson/hudson_workspace/workspace/jbosstools-nightly-3.1.0.M2/jbds-build/site/nightly/trunk/features/org.jboss.tools.project.examples.feature_1.1.0.M1-N200906100018-H247.jar ]]
+ mkdir -p jbossqa@download.jboss.org:/htdocs/jbosstools/updates/nightly/
+ rsync -arz --delete /home/hudson/hudson_workspace/workspace/jbosstools-nightly-3.1.0.M2/jbds-build/site/nightly/trunk jbossqa@download.jboss.org:/htdocs/jbosstools/updates/nightly/
++ date +%s
+ endtime=1244622487
++ echo 'scale=2; (1244622487 - 1244608372)/60'
++ bc -l
+ elapsed=235.25
+ echo 'Elapsed time: 235.25mins.'
Elapsed time: 235.25mins.
Terminating xvnc
[jbosstools-nightly-3.1.0.M2] $ vncserver -kill :10
Killing Xvnc process ID 31789
[jbosstools-nightly-3.1.0.M2] $ bash -xe /tmp/hudson870366308718240329.sh
+ kill 31770
Recording test results
Recording Emma reports jbds-build/coverage.xml
[PMD] Collecting PMD analysis files...
[PMD] Found 5995 annotations (0 new, 784 high, 5209 normal, 2 low)
[PMD] Don't changing build status, no threshold has been exceeded
Build was marked for publishing on https://hudson.jboss.org/hudson/
Email was triggered for: Unstable
Email was triggered for: Still Unstable
Trigger Unstable was overridden by another trigger and will not send an email.
There are 1 triggered emails.
Sending email for trigger: Still Unstable
--------------------------------------------------
15 years, 8 months
Build failed in Hudson: JBoss-AS-6.0.x-testSuite-sun16 #193
by jboss-qa-internal@redhat.com
See http://hudson.qa.jboss.com/hudson/job/JBoss-AS-6.0.x-testSuite-sun16/193/...
Changes:
[petemuir] remove all deps from Web Beans zip
[bstansberry(a)jboss.com] Fix org.jboss.man version
------------------------------------------
[...truncated 18240 lines...]
[junit] Tests run: 9, Failures: 0, Errors: 0, Time elapsed: 15.179 sec
[junit] Running org.jboss.test.cts.test.BmpUnitTestCase
[junit] Tests run: 11, Failures: 0, Errors: 0, Time elapsed: 22.632 sec
[junit] Running org.jboss.test.cts.test.CmpUnitTestCase
[junit] Tests run: 2, Failures: 0, Errors: 0, Time elapsed: 2.865 sec
[junit] Running org.jboss.test.cts.test.CtsCmp2UnitTestCase
[junit] Tests run: 4, Failures: 0, Errors: 0, Time elapsed: 3.455 sec
[junit] Running org.jboss.test.cts.test.IndependentJarsUnitTestCase
[junit] Tests run: 2, Failures: 0, Errors: 0, Time elapsed: 4.356 sec
[junit] Running org.jboss.test.cts.test.LocalEjbTestCase
[junit] Tests run: 1, Failures: 0, Errors: 0, Time elapsed: 3.754 sec
[junit] Running org.jboss.test.cts.test.LongWaitStatefulSessionUnitTestCase
[junit] Tests run: 1, Failures: 0, Errors: 0, Time elapsed: 7.545 sec
[junit] Running org.jboss.test.cts.test.StatefulSessionLocalUnitTestCase
[junit] Tests run: 1, Failures: 0, Errors: 0, Time elapsed: 134.311 sec
[junit] Running org.jboss.test.cts.test.StatefulSessionUnitTestCase
[junit] Tests run: 20, Failures: 0, Errors: 0, Time elapsed: 145.214 sec
[junit] Running org.jboss.test.cts.test.StatelessSessionStressTestCase
[junit] Tests run: 3, Failures: 0, Errors: 0, Time elapsed: 2.593 sec
[junit] Running org.jboss.test.cts.test.StatelessSessionUnitTestCase
[junit] Tests run: 8, Failures: 0, Errors: 0, Time elapsed: 27.831 sec
[junit] Running org.jboss.test.testbean.test.BeanUnitTestCase
[junit] Tests run: 9, Failures: 0, Errors: 0, Time elapsed: 10.466 sec
[server:stop] Shutting down server: jrmp-invoker
[server:stop] shutdownTimeout will be=45
[server:stop] Server stopped.
pooled-invoker-tests:
[echo] creating pooled-invoker config
[copy] Copying 317 files to http://hudson.qa.jboss.com/hudson/job/JBoss-AS-6.0.x-testSuite-sun16/ws/J...
[copy] Copied 98 empty directories to 2 empty directories under http://hudson.qa.jboss.com/hudson/job/JBoss-AS-6.0.x-testSuite-sun16/ws/J...
[echo] Overwriting config descriptors
[copy] Copying 1 file to http://hudson.qa.jboss.com/hudson/job/JBoss-AS-6.0.x-testSuite-sun16/ws/J...
[server:start] Starting server "pooled-invoker", with command (start timeout is 240 seconds ):
[server:start] /qa/tools/opt/jdk1.6.0_11/bin/java -cp http://hudson.qa.jboss.com/hudson/job/JBoss-AS-6.0.x-testSuite-sun16/ws/J... :/qa/tools/opt/jdk1.6.0_11/lib/tools.jar -Xms128m -Xmx512m -XX:MaxPermSize=128m -Djava.net.preferIPv4Stack=true -Djboss.server.log.threshold=DEBUG org.jboss.Main -c pooled-invoker -b 10.16.93.89 -g DefaultPartition -u 227.43.89.26
[server:start] Server started.
[echo] Starting patternset=jrmp-invoker.includes config=Pooled-Invoker
[junit] Running org.jboss.test.bank.test.BankEJB20StressTestCase
[junit] Tests run: 9, Failures: 0, Errors: 0, Time elapsed: 12.301 sec
[junit] Running org.jboss.test.cts.test.BmpUnitTestCase
[junit] Tests run: 11, Failures: 0, Errors: 0, Time elapsed: 23.707 sec
[junit] Running org.jboss.test.cts.test.CmpUnitTestCase
[junit] Tests run: 2, Failures: 0, Errors: 0, Time elapsed: 2.721 sec
[junit] Running org.jboss.test.cts.test.CtsCmp2UnitTestCase
[junit] Tests run: 4, Failures: 0, Errors: 0, Time elapsed: 3.509 sec
[junit] Running org.jboss.test.cts.test.IndependentJarsUnitTestCase
[junit] Tests run: 2, Failures: 0, Errors: 0, Time elapsed: 4.08 sec
[junit] Running org.jboss.test.cts.test.LocalEjbTestCase
[junit] Tests run: 1, Failures: 0, Errors: 0, Time elapsed: 3.682 sec
[junit] Running org.jboss.test.cts.test.LongWaitStatefulSessionUnitTestCase
[junit] Tests run: 1, Failures: 0, Errors: 0, Time elapsed: 8.057 sec
[junit] Running org.jboss.test.cts.test.StatefulSessionLocalUnitTestCase
[junit] Tests run: 1, Failures: 0, Errors: 0, Time elapsed: 134.174 sec
[junit] Running org.jboss.test.cts.test.StatefulSessionUnitTestCase
[junit] Tests run: 20, Failures: 0, Errors: 0, Time elapsed: 208.542 sec
[junit] Running org.jboss.test.cts.test.StatelessSessionStressTestCase
[junit] Tests run: 3, Failures: 0, Errors: 0, Time elapsed: 3.683 sec
[junit] Running org.jboss.test.cts.test.StatelessSessionUnitTestCase
[junit] Tests run: 8, Failures: 0, Errors: 0, Time elapsed: 28.497 sec
[junit] Running org.jboss.test.testbean.test.BeanUnitTestCase
[junit] Tests run: 9, Failures: 0, Errors: 0, Time elapsed: 8.32 sec
[server:stop] Shutting down server: pooled-invoker
[server:stop] shutdownTimeout will be=45
[server:stop] Server stopped.
tests-clustered-profileservice:
[echo] creating cluster-profilesvc-0 config, jboss.dist=http://hudson.qa.jboss.com/hudson/job/JBoss-AS-6.0.x-testSuite...
[copy] Copying 359 files to http://hudson.qa.jboss.com/hudson/job/JBoss-AS-6.0.x-testSuite-sun16/ws/J...
[copy] Copied 116 empty directories to 2 empty directories under http://hudson.qa.jboss.com/hudson/job/JBoss-AS-6.0.x-testSuite-sun16/ws/J...
[echo] Overwriting config descriptors
[copy] Copying 16 files to http://hudson.qa.jboss.com/hudson/job/JBoss-AS-6.0.x-testSuite-sun16/ws/J...
[echo] creating cluster-profilesvc-1 config, jboss.dist=http://hudson.qa.jboss.com/hudson/job/JBoss-AS-6.0.x-testSuite...
[copy] Copying 359 files to http://hudson.qa.jboss.com/hudson/job/JBoss-AS-6.0.x-testSuite-sun16/ws/J...
[copy] Copied 116 empty directories to 2 empty directories under http://hudson.qa.jboss.com/hudson/job/JBoss-AS-6.0.x-testSuite-sun16/ws/J...
[echo] Overwriting config descriptors
[copy] Copying 11 files to http://hudson.qa.jboss.com/hudson/job/JBoss-AS-6.0.x-testSuite-sun16/ws/J...
[server:start] Starting server "cluster-profilesvc-0", with command (start timeout is 240 seconds ):
[server:start] /qa/tools/opt/jdk1.6.0_11/bin/java -cp http://hudson.qa.jboss.com/hudson/job/JBoss-AS-6.0.x-testSuite-sun16/ws/J... :/qa/tools/opt/jdk1.6.0_11/lib/tools.jar -Xms128m -Xmx512m -XX:MaxPermSize=512m -XX:+HeapDumpOnOutOfMemoryError -Djava.net.preferIPv4Stack=true -Djava.endorsed.dirs=http://hudson.qa.jboss.com/hudson/job/JBoss-AS-6.0.x-testSuite-sun16/ws/JBossAS/build/output/jboss-6.0.0.Alpha1/lib/endorsed -Dresolve.dns=false -Djgroups.udp.ip_ttl=0 -Djboss.messaging.ServerPeerID=0 -Djboss.partition.name=DefaultPartition -Djgroups.bind_addr=10.16.93.89 -Djboss.server.log.threshold=DEBUG org.jboss.Main -c cluster-profilesvc-0 -b 10.16.93.89 -g DefaultPartition -u 227.43.89.26
[server:start] Server started.
[server:start] Starting server "cluster-profilesvc-1", with command (start timeout is 240 seconds ):
[server:start] /qa/tools/opt/jdk1.6.0_11/bin/java -cp http://hudson.qa.jboss.com/hudson/job/JBoss-AS-6.0.x-testSuite-sun16/ws/J... :/qa/tools/opt/jdk1.6.0_11/lib/tools.jar -Xms128m -Xmx512m -XX:MaxPermSize=512m -XX:+HeapDumpOnOutOfMemoryError -Djava.net.preferIPv4Stack=true -Djava.endorsed.dirs=http://hudson.qa.jboss.com/hudson/job/JBoss-AS-6.0.x-testSuite-sun16/ws/JBossAS/build/output/jboss-6.0.0.Alpha1/lib/endorsed -Dresolve.dns=false -Djgroups.udp.ip_ttl=0 -Djboss.messaging.ServerPeerID=1 -Djboss.partition.name=DefaultPartition -Djgroups.bind_addr=10.16.93.90 -Djboss.server.log.threshold=DEBUG org.jboss.Main -c cluster-profilesvc-1 -b 10.16.93.90 -g DefaultPartition -u 227.43.89.26
[server:start] Server started.
tests-clustering-unit:
[junit] Running org.jboss.test.cluster.defaultcfg.profileservice.test.ClusteredDeploymentRepoAddContentTestCase
[junit] Tests run: 2, Failures: 0, Errors: 0, Time elapsed: 18.211 sec
[junit] Running org.jboss.test.cluster.defaultcfg.profileservice.test.FarmedClusterStartupTestCase
[junit] Tests run: 7, Failures: 0, Errors: 0, Time elapsed: 1.342 sec
[junit] Running org.jboss.test.cluster.defaultcfg.profileservice.test.ProfileRepositoryHASingletonDeployerTestCase
[junit] Tests run: 3, Failures: 0, Errors: 0, Time elapsed: 14.161 sec
[server:stop] Shutting down server: cluster-profilesvc-0
[server:stop] shutdownTimeout will be=45
[server:stop] Server stopped.
[server:stop] Shutting down server: cluster-profilesvc-1
[server:stop] shutdownTimeout will be=45
[server:stop] Server stopped.
tests-web-profile:
[server:start] Starting server "web", with command (start timeout is 240 seconds ):
[server:start] /qa/tools/opt/jdk1.6.0_11/bin/java -cp http://hudson.qa.jboss.com/hudson/job/JBoss-AS-6.0.x-testSuite-sun16/ws/J... :/qa/tools/opt/jdk1.6.0_11/lib/tools.jar -Xms128m -Xmx512m -XX:MaxPermSize=512m -XX:+HeapDumpOnOutOfMemoryError -Djava.net.preferIPv4Stack=true -Djava.endorsed.dirs=http://hudson.qa.jboss.com/hudson/job/JBoss-AS-6.0.x-testSuite-sun16/ws/JBossAS/build/output/jboss-6.0.0.Alpha1/lib/endorsed -Djgroups.udp.ip_ttl=0 -Djboss.server.log.threshold=DEBUG org.jboss.Main -c web -b 10.16.93.89 -g DefaultPartition -u 227.43.89.26
[server:start] Server started.
init:
run-web-profile-unit:
[echo]
[echo] junit.timeout: 300000
[echo] jbosstest.iterationcount: 10
[echo] jbosstest.threadcount: 5
[echo] jbosstest.beancount: 5
[echo]
[junit] Running org.jboss.test.jpa.test.WebClassesJPAUnitTestCase
[junit] Tests run: 1, Failures: 0, Errors: 0, Time elapsed: 8.689 sec
[junit] Running org.jboss.test.jpa.test.WebLibsJPAUnitTestCase
[junit] Tests run: 1, Failures: 0, Errors: 0, Time elapsed: 1.137 sec
[server:stop] Shutting down server: web
[server:stop] shutdownTimeout will be=45
[server:stop] Server stopped.
tests-classloader-leak:
[echo] creating classloader-leak config
[copy] Copying 359 files to http://hudson.qa.jboss.com/hudson/job/JBoss-AS-6.0.x-testSuite-sun16/ws/J...
[copy] Copied 116 empty directories to 2 empty directories under http://hudson.qa.jboss.com/hudson/job/JBoss-AS-6.0.x-testSuite-sun16/ws/J...
[echo] Overwriting config descriptors
[copy] Warning: http://hudson.qa.jboss.com/hudson/job/JBoss-AS-6.0.x-testSuite-sun16/ws/J... not found.
[server:start] Starting server "classloader-leak", with command (start timeout is 240 seconds ):
[server:start] /qa/tools/opt/jdk1.6.0_11/bin/java -cp http://hudson.qa.jboss.com/hudson/job/JBoss-AS-6.0.x-testSuite-sun16/ws/J... :/qa/tools/opt/jdk1.6.0_11/lib/tools.jar -Xms128m -Xmx512m -XX:MaxPermSize=256m -XX:+HeapDumpOnOutOfMemoryError -Djava.net.preferIPv4Stack=true -Djava.endorsed.dirs=http://hudson.qa.jboss.com/hudson/job/JBoss-AS-6.0.x-testSuite-sun16/ws/JBossAS/build/output/jboss-6.0.0.Alpha1/lib/endorsed -Djgroups.udp.ip_ttl=0 -Djboss.server.log.threshold=DEBUG org.jboss.Main -c classloader-leak -b 10.16.93.89 -g DefaultPartition -u 227.43.89.26
[server:start] Server started.
[junit] Running org.jboss.test.classloader.leak.test.EarWithCommonsLoggingClassloaderLeakTestCase
[junit] Tests run: 1, Failures: 0, Errors: 0, Time elapsed: 56.66 sec
[junit] Running org.jboss.test.classloader.leak.test.EarWithDualCommonsLoggingClassloaderLeakTestCase
[junit] Tests run: 1, Failures: 0, Errors: 0, Time elapsed: 40.996 sec
[junit] Running org.jboss.test.classloader.leak.test.IsolatedEarClassloaderLeakTestCase
[junit] Tests run: 1, Failures: 0, Errors: 0, Time elapsed: 38.55 sec
[junit] Running org.jboss.test.classloader.leak.test.IsolatedEarWithCommonsLoggingClassloaderLeakTestCase
[junit] Tests run: 1, Failures: 0, Errors: 0, Time elapsed: 39.624 sec
[junit] Running org.jboss.test.classloader.leak.test.IsolatedEarWithDualCommonsLoggingClassloaderLeakTestCase
[junit] Tests run: 1, Failures: 0, Errors: 0, Time elapsed: 40.796 sec
[junit] Running org.jboss.test.classloader.leak.test.IsolatedEjb3EarClassloaderLeakTestCase
[junit] Tests run: 1, Failures: 0, Errors: 0, Time elapsed: 36.098 sec
[junit] Running org.jboss.test.classloader.leak.test.IsolatedNoWebEarClassloaderLeakTestCase
[junit] Tests run: 1, Failures: 0, Errors: 0, Time elapsed: 35.53 sec
[junit] Running org.jboss.test.classloader.leak.test.IsolatedNoWebEjb3EarClassloaderLeakTestCase
[junit] Tests run: 1, Failures: 0, Errors: 0, Time elapsed: 36.315 sec
[junit] Running org.jboss.test.classloader.leak.test.NoWebEarClassloaderLeakTestCase
[junit] Tests run: 1, Failures: 0, Errors: 0, Time elapsed: 36.057 sec
[junit] Running org.jboss.test.classloader.leak.test.NoWebEjb3EarClassloaderLeakTestCase
[junit] Tests run: 1, Failures: 0, Errors: 0, Time elapsed: 37.056 sec
[junit] Running org.jboss.test.classloader.leak.test.SimpleEarClassloaderLeakTestCase
[junit] Tests run: 1, Failures: 0, Errors: 0, Time elapsed: 38.587 sec
[junit] Running org.jboss.test.classloader.leak.test.SimpleEjb2ClassloaderLeakTestCase
[junit] Tests run: 1, Failures: 0, Errors: 0, Time elapsed: 36.362 sec
[junit] Running org.jboss.test.classloader.leak.test.SimpleEjb3ClassloaderLeakTestCase
[junit] Tests run: 1, Failures: 0, Errors: 0, Time elapsed: 35.711 sec
[junit] Running org.jboss.test.classloader.leak.test.SimpleEjb3EarClassloaderLeakTestCase
[junit] Tests run: 1, Failures: 0, Errors: 0, Time elapsed: 33.247 sec
[junit] Running org.jboss.test.classloader.leak.test.SimpleWarClassloaderLeakTestCase
[junit] Tests run: 1, Failures: 0, Errors: 0, Time elapsed: 7.865 sec
[junit] Running org.jboss.test.classloader.leak.test.WarWithCommonsLoggingClassloaderLeakTestCase
[junit] Tests run: 1, Failures: 0, Errors: 0, Time elapsed: 7.367 sec
[server:stop] Shutting down server: classloader-leak
[server:stop] shutdownTimeout will be=45
[server:stop] Server stopped.
tests-clustered-classloader-leak:
[echo] creating cluster-classloader-leak-0 config, jboss.dist=http://hudson.qa.jboss.com/hudson/job/JBoss-AS-6.0.x-testSuite...
[copy] Copying 360 files to http://hudson.qa.jboss.com/hudson/job/JBoss-AS-6.0.x-testSuite-sun16/ws/J...
[copy] Copied 118 empty directories to 3 empty directories under http://hudson.qa.jboss.com/hudson/job/JBoss-AS-6.0.x-testSuite-sun16/ws/J...
[echo] Overwriting config descriptors
[copy] Warning: http://hudson.qa.jboss.com/hudson/job/JBoss-AS-6.0.x-testSuite-sun16/ws/J... not found.
[echo] creating cluster-classloader-leak-1 config, jboss.dist=http://hudson.qa.jboss.com/hudson/job/JBoss-AS-6.0.x-testSuite...
[copy] Copying 360 files to http://hudson.qa.jboss.com/hudson/job/JBoss-AS-6.0.x-testSuite-sun16/ws/J...
[copy] Copied 118 empty directories to 3 empty directories under http://hudson.qa.jboss.com/hudson/job/JBoss-AS-6.0.x-testSuite-sun16/ws/J...
[echo] Overwriting config descriptors
[copy] Warning: http://hudson.qa.jboss.com/hudson/job/JBoss-AS-6.0.x-testSuite-sun16/ws/J... not found.
[server:start] Starting server "cluster-classloader-leak-0", with command (start timeout is 240 seconds ):
[server:start] /qa/tools/opt/jdk1.6.0_11/bin/java -cp http://hudson.qa.jboss.com/hudson/job/JBoss-AS-6.0.x-testSuite-sun16/ws/J... :/qa/tools/opt/jdk1.6.0_11/lib/tools.jar -Xms128m -Xmx512m -XX:MaxPermSize=256m -XX:+HeapDumpOnOutOfMemoryError -Djava.net.preferIPv4Stack=true -Djava.endorsed.dirs=http://hudson.qa.jboss.com/hudson/job/JBoss-AS-6.0.x-testSuite-sun16/ws/JBossAS/build/output/jboss-6.0.0.Alpha1/lib/endorsed -Dresolve.dns=false -Djgroups.udp.ip_ttl=0 -Djboss.messaging.ServerPeerID=0 -Dnode0.bind.address=10.16.93.89 -Djboss.partition.name=DefaultPartition -Djgroups.bind_addr=10.16.93.89 -Djboss.server.log.threshold=DEBUG org.jboss.Main -c cluster-classloader-leak-0 -b 10.16.93.89 -g DefaultPartition -u 227.43.89.26
[server:start] Server started.
[server:start] Starting server "cluster-classloader-leak-1", with command (start timeout is 240 seconds ):
[server:start] /qa/tools/opt/jdk1.6.0_11/bin/java -cp http://hudson.qa.jboss.com/hudson/job/JBoss-AS-6.0.x-testSuite-sun16/ws/J... :/qa/tools/opt/jdk1.6.0_11/lib/tools.jar -Xms128m -Xmx512m -XX:MaxPermSize=256m -XX:+HeapDumpOnOutOfMemoryError -Djava.net.preferIPv4Stack=true -Djava.endorsed.dirs=http://hudson.qa.jboss.com/hudson/job/JBoss-AS-6.0.x-testSuite-sun16/ws/JBossAS/build/output/jboss-6.0.0.Alpha1/lib/endorsed -Dresolve.dns=false -Djgroups.udp.ip_ttl=0 -Djboss.messaging.ServerPeerID=1 -Dnode0.bind.address=10.16.93.89 -Djboss.partition.name=DefaultPartition -Djgroups.bind_addr=10.16.93.90 -Djboss.server.log.threshold=DEBUG org.jboss.Main -c cluster-classloader-leak-1 -b 10.16.93.90 -g DefaultPartition -u 227.43.89.26
[server:start] Server started.
tests-clustering-unit:
[junit] Running org.jboss.test.cluster.classloader.leak.test.NoPassivationWarClassloaderLeakTestCase
[junit] Tests run: 2, Failures: 0, Errors: 0, Time elapsed: 78.301 sec
[junit] Running org.jboss.test.cluster.classloader.leak.test.SimpleWarClassloaderLeakTestCase
[junit] Tests run: 2, Failures: 0, Errors: 0, Time elapsed: 136.909 sec
[server:stop] Shutting down server: cluster-classloader-leak-0
[server:stop] shutdownTimeout will be=45
[server:stop] Server stopped.
[server:stop] Shutting down server: cluster-classloader-leak-1
[server:stop] shutdownTimeout will be=45
[server:stop] Server stopped.
compile-stylesheets:
tests-report-html:
[mkdir] Created dir: http://hudson.qa.jboss.com/hudson/job/JBoss-AS-6.0.x-testSuite-sun16/ws/J...
[junitreport] Processing http://hudson.qa.jboss.com/hudson/job/JBoss-AS-6.0.x-testSuite-sun16/ws/J... to /tmp/null916913167
[junitreport] Loading stylesheet http://hudson.qa.jboss.com/hudson/job/JBoss-AS-6.0.x-testSuite-sun16/ws/J...
[junitreport] Transform time: 95403ms
[junitreport] Deleting: /tmp/null916913167
tests-report-text:
[mkdir] Created dir: http://hudson.qa.jboss.com/hudson/job/JBoss-AS-6.0.x-testSuite-sun16/ws/J...
[style] Warning: the task name <style> is deprecated. Use <xslt> instead.
[style] Transforming into http://hudson.qa.jboss.com/hudson/job/JBoss-AS-6.0.x-testSuite-sun16/ws/J...
[style] Processing http://hudson.qa.jboss.com/hudson/job/JBoss-AS-6.0.x-testSuite-sun16/ws/J... to http://hudson.qa.jboss.com/hudson/job/JBoss-AS-6.0.x-testSuite-sun16/ws/J...
[style] Loading stylesheet http://hudson.qa.jboss.com/hudson/job/JBoss-AS-6.0.x-testSuite-sun16/ws/J...
tests-report-xml:
[mkdir] Created dir: http://hudson.qa.jboss.com/hudson/job/JBoss-AS-6.0.x-testSuite-sun16/ws/J...
[style] Warning: the task name <style> is deprecated. Use <xslt> instead.
[style] Transforming into http://hudson.qa.jboss.com/hudson/job/JBoss-AS-6.0.x-testSuite-sun16/ws/J...
[style] Processing http://hudson.qa.jboss.com/hudson/job/JBoss-AS-6.0.x-testSuite-sun16/ws/J... to http://hudson.qa.jboss.com/hudson/job/JBoss-AS-6.0.x-testSuite-sun16/ws/J...
[style] Loading stylesheet http://hudson.qa.jboss.com/hudson/job/JBoss-AS-6.0.x-testSuite-sun16/ws/J...
tests-report:
[tar] Building tar: http://hudson.qa.jboss.com/hudson/job/JBoss-AS-6.0.x-testSuite-sun16/ws/J...
BUILD FAILED
http://hudson.qa.jboss.com/hudson/job/JBoss-AS-6.0.x-testSuite-sun16/ws/J... :1020: Some servers failed to shutdown cleanly.
Total time: 1,052 minutes 58 seconds
+ BSTATUS=1
+ [[ 1 -ne 0 ]]
+ kill-jboss
++ uname -s
+ [[ Linux == \L\i\n\u\x ]]
+ ps -eaf --columns 2200
+ grep run.jar
+ grep -v grep
+ awk '{ print $2; }'
+ xargs kill
usage: kill [ -s signal | -p ] [ -a ] pid ...
kill -l [ signal ]
+ sleep 10
+ ps -eaf --columns 2200
+ grep run.jar
+ grep -v grep
+ awk '{ print $2; }'
+ xargs kill -9
usage: kill [ -s signal | -p ] [ -a ] pid ...
kill -l [ signal ]
+ return 0
+ exit 1
[JBoss-AS-6.0.x-testSuite-sun16] $ bash -xe /tmp/hudson136301579285678524.sh
+ kill 31465
Recording test results
15 years, 8 months
JBoss-AS-4.0.x-CompatibilityMatrix - Build # 334 - Failure!
by jboss-qa-internal@redhat.com
JBoss-AS-4.0.x-CompatibilityMatrix - Build # 334 - Failure:
Check console output at https://hudson.jboss.org/hudson//job/JBoss-AS-4.0.x-CompatibilityMatrix/334 to view the results.
Modifications since last build:
-------------------------------------------------------------------------
[...truncated 20414 lines...]
execute-matrix-unit-target:
[echo] >>>>>> Executing test=testbyvalue filter=org/jboss/test/testbyvalue/test/**/*TestCase.class
[junit] Running org.jboss.test.compatibility.test.matrix.MatrixTestContainer
[junit] Tests run: 4, Failures: 0, Errors: 0, Time elapsed: 19.69 sec
execute-matrix-unit-target:
[echo] >>>>>> Executing test=client filter=org/jboss/test/client/**/*TestCase.class
[junit] Running org.jboss.test.compatibility.test.matrix.MatrixTestContainer
[junit] Tests run: 8, Failures: 0, Errors: 0, Time elapsed: 7.185 sec
execute-matrix-unit-target:
[echo] >>>>>> Executing test=bmp filter=org/jboss/test/bmp/**/*TestCase.class
[junit] Running org.jboss.test.compatibility.test.matrix.MatrixTestContainer
[junit] Tests run: 2, Failures: 0, Errors: 0, Time elapsed: 14.326 sec
execute-matrix-unit-target:
[echo] >>>>>> Executing test=cmp2 filter=org/jboss/test/cmp2/**/*TestCase.class
[junit] Running org.jboss.test.compatibility.test.matrix.MatrixTestContainer
[junit] Tests run: 280, Failures: 0, Errors: 0, Time elapsed: 104.144 sec
execute-matrix-unit-target:
[echo] >>>>>> Executing test=jms filter=org/jboss/test/jbossmq/test/JBossMQUnitTest.class
[junit] Running org.jboss.test.compatibility.test.matrix.MatrixTestContainer
[junit] Tests run: 18, Failures: 0, Errors: 0, Time elapsed: 29.105 sec
[echo] Will stop the jboss instance at url jnp://localhost:1099
[java] The jvmargs attribute is deprecated. Please use nested jvmarg elements.
[java] Shutdown message has been posted to the server.
[java] Server shutdown may take a while - check logfiles for completion
[echo] Waiting for 'all' server to stop...
[echo] Will start the jboss instance localhost with all, dist=/mnt/hudson_workspace/workspace/JBoss-AS-4.0.x-CompatibilityMatrix/Branch_4_0/build/output/jboss-4.0.5.SP1
[echo] Waiting for localhost to start...
tests-standard-unit-matrix-version:
execute-matrix-unit-target:
[echo] >>>>>> Executing test=testbyvalue filter=org/jboss/test/testbyvalue/test/**/*TestCase.class
[junit] Running org.jboss.test.compatibility.test.matrix.MatrixTestContainer
[junit] Tests run: 4, Failures: 0, Errors: 0, Time elapsed: 19.552 sec
execute-matrix-unit-target:
[echo] >>>>>> Executing test=client filter=org/jboss/test/client/**/*TestCase.class
[junit] Running org.jboss.test.compatibility.test.matrix.MatrixTestContainer
[junit] Tests run: 8, Failures: 0, Errors: 0, Time elapsed: 6.926 sec
execute-matrix-unit-target:
[echo] >>>>>> Executing test=bmp filter=org/jboss/test/bmp/**/*TestCase.class
[junit] Running org.jboss.test.compatibility.test.matrix.MatrixTestContainer
[junit] Tests run: 2, Failures: 0, Errors: 0, Time elapsed: 13.67 sec
execute-matrix-unit-target:
[echo] >>>>>> Executing test=cmp2 filter=org/jboss/test/cmp2/**/*TestCase.class
[junit] Running org.jboss.test.compatibility.test.matrix.MatrixTestContainer
[junit] Tests run: 280, Failures: 0, Errors: 0, Time elapsed: 106.788 sec
execute-matrix-unit-target:
[echo] >>>>>> Executing test=jms filter=org/jboss/test/jbossmq/test/JBossMQUnitTest.class
[junit] Running org.jboss.test.compatibility.test.matrix.MatrixTestContainer
[junit] Tests run: 18, Failures: 0, Errors: 0, Time elapsed: 30.115 sec
[echo] Will stop the jboss instance at url jnp://localhost:1099
[java] The jvmargs attribute is deprecated. Please use nested jvmarg elements.
[java] Shutdown message has been posted to the server.
[java] Server shutdown may take a while - check logfiles for completion
[echo] Waiting for 'all' server to stop...
[echo] Will start the jboss instance localhost with all, dist=/mnt/hudson_workspace/workspace/JBoss-AS-4.0.x-CompatibilityMatrix/Branch_4_0/build/output/jboss-4.0.5.SP1
[echo] Waiting for localhost to start...
tests-standard-unit-matrix-version:
execute-matrix-unit-target:
[echo] >>>>>> Executing test=testbyvalue filter=org/jboss/test/testbyvalue/test/**/*TestCase.class
[junit] Running org.jboss.test.compatibility.test.matrix.MatrixTestContainer
[junit] Tests run: 4, Failures: 0, Errors: 0, Time elapsed: 16.807 sec
execute-matrix-unit-target:
[echo] >>>>>> Executing test=client filter=org/jboss/test/client/**/*TestCase.class
[junit] Running org.jboss.test.compatibility.test.matrix.MatrixTestContainer
[junit] Tests run: 8, Failures: 0, Errors: 0, Time elapsed: 8.462 sec
execute-matrix-unit-target:
[echo] >>>>>> Executing test=bmp filter=org/jboss/test/bmp/**/*TestCase.class
[junit] Running org.jboss.test.compatibility.test.matrix.MatrixTestContainer
[junit] Tests run: 2, Failures: 0, Errors: 0, Time elapsed: 14.6 sec
execute-matrix-unit-target:
[echo] >>>>>> Executing test=cmp2 filter=org/jboss/test/cmp2/**/*TestCase.class
[junit] Running org.jboss.test.compatibility.test.matrix.MatrixTestContainer
[junit] Tests run: 280, Failures: 0, Errors: 0, Time elapsed: 119.336 sec
execute-matrix-unit-target:
[echo] >>>>>> Executing test=jms filter=org/jboss/test/jbossmq/test/JBossMQUnitTest.class
[junit] Running org.jboss.test.compatibility.test.matrix.MatrixTestContainer
[junit] Tests run: 18, Failures: 0, Errors: 0, Time elapsed: 29.175 sec
[echo] Will stop the jboss instance at url jnp://localhost:1099
[java] The jvmargs attribute is deprecated. Please use nested jvmarg elements.
[java] Shutdown message has been posted to the server.
[java] Server shutdown may take a while - check logfiles for completion
[echo] Waiting for 'all' server to stop...
[echo] Will start the jboss instance localhost with all, dist=/mnt/hudson_workspace/workspace/JBoss-AS-4.0.x-CompatibilityMatrix/Branch_4_0/build/output/jboss-4.0.5.SP1
[echo] Waiting for localhost to start...
tests-standard-unit-matrix-version:
execute-matrix-unit-target:
[echo] >>>>>> Executing test=testbyvalue filter=org/jboss/test/testbyvalue/test/**/*TestCase.class
[junit] Running org.jboss.test.compatibility.test.matrix.MatrixTestContainer
[junit] Tests run: 4, Failures: 0, Errors: 0, Time elapsed: 19.161 sec
execute-matrix-unit-target:
[echo] >>>>>> Executing test=client filter=org/jboss/test/client/**/*TestCase.class
[junit] Running org.jboss.test.compatibility.test.matrix.MatrixTestContainer
[junit] Tests run: 8, Failures: 0, Errors: 0, Time elapsed: 8.706 sec
execute-matrix-unit-target:
[echo] >>>>>> Executing test=bmp filter=org/jboss/test/bmp/**/*TestCase.class
[junit] Running org.jboss.test.compatibility.test.matrix.MatrixTestContainer
[junit] Tests run: 2, Failures: 0, Errors: 0, Time elapsed: 15.826 sec
execute-matrix-unit-target:
[echo] >>>>>> Executing test=cmp2 filter=org/jboss/test/cmp2/**/*TestCase.class
[junit] Running org.jboss.test.compatibility.test.matrix.MatrixTestContainer
[junit] Tests run: 280, Failures: 0, Errors: 0, Time elapsed: 121.485 sec
execute-matrix-unit-target:
[echo] >>>>>> Executing test=jms filter=org/jboss/test/jbossmq/test/JBossMQUnitTest.class
[junit] Running org.jboss.test.compatibility.test.matrix.MatrixTestContainer
[junit] Tests run: 18, Failures: 0, Errors: 0, Time elapsed: 30.189 sec
[echo] Will stop the jboss instance at url jnp://localhost:1099
[java] The jvmargs attribute is deprecated. Please use nested jvmarg elements.
[java] Shutdown message has been posted to the server.
[java] Server shutdown may take a while - check logfiles for completion
[echo] Waiting for 'all' server to stop...
[echo] Will start the jboss instance localhost with all, dist=/mnt/hudson_workspace/workspace/JBoss-AS-4.0.x-CompatibilityMatrix/Branch_4_0/build/output/jboss-4.0.5.SP1
[echo] Waiting for localhost to start...
tests-standard-unit-matrix-version:
execute-matrix-unit-target:
[echo] >>>>>> Executing test=testbyvalue filter=org/jboss/test/testbyvalue/test/**/*TestCase.class
[junit] Running org.jboss.test.compatibility.test.matrix.MatrixTestContainer
[junit] Tests run: 4, Failures: 0, Errors: 0, Time elapsed: 23.983 sec
execute-matrix-unit-target:
[echo] >>>>>> Executing test=client filter=org/jboss/test/client/**/*TestCase.class
[junit] Running org.jboss.test.compatibility.test.matrix.MatrixTestContainer
[junit] Tests run: 8, Failures: 0, Errors: 0, Time elapsed: 10.204 sec
execute-matrix-unit-target:
[echo] >>>>>> Executing test=bmp filter=org/jboss/test/bmp/**/*TestCase.class
[junit] Running org.jboss.test.compatibility.test.matrix.MatrixTestContainer
[junit] Tests run: 2, Failures: 0, Errors: 0, Time elapsed: 14.012 sec
execute-matrix-unit-target:
[echo] >>>>>> Executing test=cmp2 filter=org/jboss/test/cmp2/**/*TestCase.class
[junit] Running org.jboss.test.compatibility.test.matrix.MatrixTestContainer
[junit] Tests run: 280, Failures: 0, Errors: 0, Time elapsed: 148.046 sec
execute-matrix-unit-target:
[echo] >>>>>> Executing test=jms filter=org/jboss/test/jbossmq/test/JBossMQUnitTest.class
[junit] Running org.jboss.test.compatibility.test.matrix.MatrixTestContainer
[junit] Tests run: 18, Failures: 0, Errors: 0, Time elapsed: 30.989 sec
[echo] Will stop the jboss instance at url jnp://localhost:1099
[java] The jvmargs attribute is deprecated. Please use nested jvmarg elements.
[java] Shutdown message has been posted to the server.
[java] Server shutdown may take a while - check logfiles for completion
[echo] Waiting for 'all' server to stop...
[echo] Will start the jboss instance localhost with all, dist=/mnt/hudson_workspace/workspace/JBoss-AS-4.0.x-CompatibilityMatrix/Branch_4_0/build/output/jboss-4.0.5.SP1
[echo] Waiting for localhost to start...
tests-standard-unit-matrix-version:
execute-matrix-unit-target:
[echo] >>>>>> Executing test=testbyvalue filter=org/jboss/test/testbyvalue/test/**/*TestCase.class
[junit] Running org.jboss.test.compatibility.test.matrix.MatrixTestContainer
[junit] Tests run: 4, Failures: 0, Errors: 0, Time elapsed: 39.332 sec
execute-matrix-unit-target:
[echo] >>>>>> Executing test=client filter=org/jboss/test/client/**/*TestCase.class
[junit] Running org.jboss.test.compatibility.test.matrix.MatrixTestContainer
[junit] Tests run: 8, Failures: 0, Errors: 0, Time elapsed: 13.054 sec
execute-matrix-unit-target:
[echo] >>>>>> Executing test=bmp filter=org/jboss/test/bmp/**/*TestCase.class
[junit] Running org.jboss.test.compatibility.test.matrix.MatrixTestContainer
[junit] Tests run: 2, Failures: 0, Errors: 0, Time elapsed: 16.604 sec
execute-matrix-unit-target:
[echo] >>>>>> Executing test=cmp2 filter=org/jboss/test/cmp2/**/*TestCase.class
[junit] Running org.jboss.test.compatibility.test.matrix.MatrixTestContainer
[junit] Tests run: 280, Failures: 0, Errors: 0, Time elapsed: 129.1 sec
execute-matrix-unit-target:
[echo] >>>>>> Executing test=jms filter=org/jboss/test/jbossmq/test/JBossMQUnitTest.class
[junit] Running org.jboss.test.compatibility.test.matrix.MatrixTestContainer
[junit] Tests run: 18, Failures: 0, Errors: 0, Time elapsed: 30.015 sec
[echo] Will stop the jboss instance at url jnp://localhost:1099
[java] The jvmargs attribute is deprecated. Please use nested jvmarg elements.
[java] Shutdown message has been posted to the server.
[java] Server shutdown may take a while - check logfiles for completion
[echo] Waiting for 'all' server to stop...
[echo] Will start the jboss instance localhost with all, dist=/mnt/hudson_workspace/workspace/JBoss-AS-4.0.x-CompatibilityMatrix/Branch_4_0/build/output/jboss-4.0.5.SP1
[echo] Waiting for localhost to start...
tests-standard-unit-matrix-version:
execute-matrix-unit-target:
[echo] >>>>>> Executing test=testbyvalue filter=org/jboss/test/testbyvalue/test/**/*TestCase.class
[junit] Running org.jboss.test.compatibility.test.matrix.MatrixTestContainer
[junit] Tests run: 4, Failures: 0, Errors: 0, Time elapsed: 31.301 sec
execute-matrix-unit-target:
[echo] >>>>>> Executing test=client filter=org/jboss/test/client/**/*TestCase.class
[junit] Running org.jboss.test.compatibility.test.matrix.MatrixTestContainer
[junit] Tests run: 8, Failures: 0, Errors: 0, Time elapsed: 12.455 sec
execute-matrix-unit-target:
[echo] >>>>>> Executing test=bmp filter=org/jboss/test/bmp/**/*TestCase.class
[junit] Running org.jboss.test.compatibility.test.matrix.MatrixTestContainer
[junit] Tests run: 2, Failures: 0, Errors: 0, Time elapsed: 15.045 sec
execute-matrix-unit-target:
[echo] >>>>>> Executing test=cmp2 filter=org/jboss/test/cmp2/**/*TestCase.class
[junit] Running org.jboss.test.compatibility.test.matrix.MatrixTestContainer
[junit] Tests run: 280, Failures: 0, Errors: 0, Time elapsed: 150.964 sec
execute-matrix-unit-target:
[echo] >>>>>> Executing test=jms filter=org/jboss/test/jbossmq/test/JBossMQUnitTest.class
[junit] Running org.jboss.test.compatibility.test.matrix.MatrixTestContainer
[junit] Tests run: 18, Failures: 0, Errors: 0, Time elapsed: 29.283 sec
[echo] Will stop the jboss instance at url jnp://localhost:1099
[java] The jvmargs attribute is deprecated. Please use nested jvmarg elements.
[java] Shutdown message has been posted to the server.
[java] Server shutdown may take a while - check logfiles for completion
[echo] Waiting for 'all' server to stop...
[echo] Will start the jboss instance localhost with all, dist=/mnt/hudson_workspace/workspace/JBoss-AS-4.0.x-CompatibilityMatrix/Branch_4_0/build/output/jboss-4.0.5.SP1
[echo] Waiting for localhost to start...
BUILD FAILED
/mnt/hudson_workspace/workspace/JBoss-AS-4.0.x-CompatibilityMatrix/Branch_4_0/testsuite/build.xml:3286: The following error occurred while executing this line:
/mnt/hudson_workspace/workspace/JBoss-AS-4.0.x-CompatibilityMatrix/Branch_4_0/testsuite/build.xml:3330: The following error occurred while executing this line:
/mnt/hudson_workspace/workspace/JBoss-AS-4.0.x-CompatibilityMatrix/Branch_4_0/testsuite/build.xml:510: Timeout waiting for nodes to start
Total time: 44 minutes 39 seconds
[JBoss-AS-4.0.x-CompatibilityMatrix] $ bash -xe /tmp/hudson334655317438663778.sh
+ kill 12995
Recording test results
Build was marked for publishing on https://hudson.jboss.org/hudson/
Email was triggered for: Failure
There are 1 triggered emails.
Sending email for trigger: Failure
15 years, 8 months
[Still Unstable] jbosstools-nightly-3.1.0.M2 #246
by jboss-qa-internal@redhat.com
Public:
https://hudson.jboss.org/hudson//job/jbosstools-nightly-3.1.0.M2/246
https://hudson.jboss.org/hudson//job/jbosstools-nightly-3.1.0.M2/246/test...
https://hudson.jboss.org/hudson//job/jbosstools-nightly-3.1.0.M2/246/changes
https://hudson.jboss.org/hudson//job/jbosstools-nightly-3.1.0.M2/246/console
Internal:
http://hudson.qa.jboss.com/hudson/job/jbosstools-nightly-3.1.0.M2/246/
http://hudson.qa.jboss.com/hudson/job/jbosstools-nightly-3.1.0.M2/246//te...
http://hudson.qa.jboss.com/hudson/job/jbosstools-nightly-3.1.0.M2/246//ch...
http://hudson.qa.jboss.com/hudson/job/jbosstools-nightly-3.1.0.M2/246//co...
--------------------------------------------------
Failed Tests:
1 tests failed.
REGRESSION: ArchivesTestSuite
Error Message:
org.eclipse.core.runtime.CoreException: An error occurred while building project archives
Stack Trace:
java.lang.RuntimeException: org.eclipse.core.runtime.CoreException: An error occurred while building project archives
at org.jboss.ide.eclipse.archives.test.ui.BuildActionTest.waitForGo(BuildActionTest.java:124)
at org.jboss.ide.eclipse.archives.test.ui.BuildActionTest.testBuildAction(BuildActionTest.java:91)
at org.eclipse.test.EclipseTestRunner.run(EclipseTestRunner.java:354)
at org.eclipse.test.EclipseTestRunner.run(EclipseTestRunner.java:206)
at org.eclipse.test.UITestApplication$3.run(UITestApplication.java:195)
at org.eclipse.swt.widgets.RunnableLock.run(RunnableLock.java:35)
at org.eclipse.swt.widgets.Synchronizer.runAsyncMessages(Synchronizer.java:134)
at org.eclipse.swt.widgets.Display.runAsyncMessages(Display.java:3468)
at org.eclipse.swt.widgets.Display.readAndDispatch(Display.java:3115)
at org.eclipse.ui.internal.Workbench.runEventLoop(Workbench.java:2405)
at org.eclipse.ui.internal.Workbench.runUI(Workbench.java:2369)
at org.eclipse.ui.internal.Workbench.access$4(Workbench.java:2221)
at org.eclipse.ui.internal.Workbench$5.run(Workbench.java:500)
at org.eclipse.core.databinding.observable.Realm.runWithDefault(Realm.java:332)
at org.eclipse.ui.internal.Workbench.createAndRunWorkbench(Workbench.java:493)
at org.eclipse.ui.PlatformUI.createAndRunWorkbench(PlatformUI.java:149)
at org.eclipse.ui.internal.ide.application.IDEApplication.start(IDEApplication.java:113)
at org.eclipse.test.UITestApplication.runApplication(UITestApplication.java:138)
at org.eclipse.test.UITestApplication.run(UITestApplication.java:60)
at org.eclipse.test.UITestApplication.start(UITestApplication.java:210)
at org.eclipse.equinox.internal.app.EclipseAppHandle.run(EclipseAppHandle.java:194)
at org.eclipse.core.runtime.internal.adaptor.EclipseAppLauncher.runApplication(EclipseAppLauncher.java:110)
at org.eclipse.core.runtime.internal.adaptor.EclipseAppLauncher.start(EclipseAppLauncher.java:79)
at org.eclipse.core.runtime.adaptor.EclipseStarter.run(EclipseStarter.java:368)
at org.eclipse.core.runtime.adaptor.EclipseStarter.run(EclipseStarter.java:179)
at org.eclipse.equinox.launcher.Main.invokeFramework(Main.java:559)
at org.eclipse.equinox.launcher.Main.basicRun(Main.java:514)
at org.eclipse.equinox.launcher.Main.run(Main.java:1311)
at org.eclipse.equinox.launcher.Main.main(Main.java:1287)
at org.eclipse.core.launcher.Main.main(Main.java:34)
Caused by: org.eclipse.core.runtime.CoreException: An error occurred while building project archives
at org.jboss.ide.eclipse.archives.test.ui.BuildActionTest$1.done(BuildActionTest.java:62)
at org.eclipse.core.internal.jobs.JobListeners$3.notify(JobListeners.java:39)
at org.eclipse.core.internal.jobs.JobListeners.doNotify(JobListeners.java:96)
at org.eclipse.core.internal.jobs.JobListeners.done(JobListeners.java:152)
at org.eclipse.core.internal.jobs.JobManager.endJob(JobManager.java:570)
at org.eclipse.core.internal.jobs.WorkerPool.endJob(WorkerPool.java:105)
at org.eclipse.core.internal.jobs.Worker.run(Worker.java:72)
--------------------------------------------------
Changes:
[dgolovin] https://jira.jboss.org/jira/browse/JBIDE-351 bad exception handling fix
[dgolovin] code cleanup: unused packages/classes/files were removed
[akazakov] https://jira.jboss.org/jira/browse/JBIDE-4393
[dgolovin] code cleanup: unused packages/classes/files were removed
[nickboldt] [JBDS-729] ensure Mac versions of eclipse.ini are expanded too
[nickboldt] add readme w/ link to splash image
[nickboldt] first attempt at a JBDS 3 splash
--------------------------------------------------
Console log:
[...truncated 24713 lines...]
[jar] Building jar: /home/hudson/hudson_workspace/workspace/jbosstools-nightly-3.1.0.M2/jbds-build/site/eclipse/plugins/org.jboss.tools.vpe.html_3.1.0.M1-N200906091927-H246.jar
[jar] Building jar: /home/hudson/hudson_workspace/workspace/jbosstools-nightly-3.1.0.M2/jbds-build/site/eclipse/plugins/org.jboss.tools.vpe.jsp_3.1.0.M1-N200906091927-H246.jar
[jar] Building jar: /home/hudson/hudson_workspace/workspace/jbosstools-nightly-3.1.0.M2/jbds-build/site/eclipse/plugins/org.jboss.tools.vpe.ui.palette_3.1.0.M1-N200906091927-H246.jar
[jar] Building jar: /home/hudson/hudson_workspace/workspace/jbosstools-nightly-3.1.0.M2/jbds-build/site/eclipse/plugins/org.jboss.tools.vpe_3.1.0.M1-N200906091927-H246.jar
[jar] Building jar: /home/hudson/hudson_workspace/workspace/jbosstools-nightly-3.1.0.M2/jbds-build/site/eclipse/plugins/org.jboss.tools.xulrunner_1.0.0.GA-N200906091927-H246.jar
[jar] Building jar: /home/hudson/hudson_workspace/workspace/jbosstools-nightly-3.1.0.M2/jbds-build/site/eclipse/plugins/org.mozilla.xpcom_1.8.1.3-20070904.jar
[jar] Building jar: /home/hudson/hudson_workspace/workspace/jbosstools-nightly-3.1.0.M2/jbds-build/site/eclipse/plugins/org.mozilla.xulrunner.carbon.macosx_1.8.1.3-20070904.jar
[jar] Building jar: /home/hudson/hudson_workspace/workspace/jbosstools-nightly-3.1.0.M2/jbds-build/site/eclipse/plugins/org.mozilla.xulrunner.gtk.linux.x86_1.8.1.3-20070904.jar
[jar] Building jar: /home/hudson/hudson_workspace/workspace/jbosstools-nightly-3.1.0.M2/jbds-build/site/eclipse/plugins/org.mozilla.xulrunner.gtk.linux.x86_64_1.8.1.4-20080112.jar
[jar] Building jar: /home/hudson/hudson_workspace/workspace/jbosstools-nightly-3.1.0.M2/jbds-build/site/eclipse/plugins/org.mozilla.xulrunner.win32.win32.x86_1.8.1.3-20070904.jar
load.properties:
[echo] Getting version for 'jmx' builder to property 'jmx.versionTag' from /qa/services/hudson/hudson_workspace/workspace/jbosstools-nightly-3.1.0.M2/org.jboss.ide.eclipse.releng/builders/product/versionTags/jbosstools/3.1.0.M1.tags
[echo]
[echo] jbds-jmx-filename=JMX-1.1.0.M1-N200906091927-H246.zip
[echo] jbds-jmx-nodeps-filename=JMX-nodeps-1.1.0.M1-N200906091927-H246.zip
[echo]
[echo] Getting version for 'drools-ide' builder to property 'drools-ide.versionTag' from /qa/services/hudson/hudson_workspace/workspace/jbosstools-nightly-3.1.0.M2/org.jboss.ide.eclipse.releng/builders/product/versionTags/jbosstools/3.1.0.M1.tags
[echo]
[echo] jbds-drools-ide-filename=DroolsIDE-5.1.0.trunk-N200906091927-H246.zip
[echo] jbds-drools-ide-nodeps-filename=DroolsIDE-nodeps-5.1.0.trunk-N200906091927-H246.zip
[echo]
[echo] Getting version for 'archives' builder to property 'archives.versionTag' from /qa/services/hudson/hudson_workspace/workspace/jbosstools-nightly-3.1.0.M2/org.jboss.ide.eclipse.releng/builders/product/versionTags/jbosstools/3.1.0.M1.tags
[echo]
[echo] jbds-archives-filename=JBossTools-Archives-3.1.0.M1-N200906091927-H246.zip
[echo] jbds-archives-nodeps-filename=JBossTools-Archives-nodeps-3.1.0.M1-N200906091927-H246.zip
[echo]
[echo] Getting version for 'xulrunner' builder to property 'xulrunner.versionTag' from /qa/services/hudson/hudson_workspace/workspace/jbosstools-nightly-3.1.0.M2/org.jboss.ide.eclipse.releng/builders/product/versionTags/jbosstools/3.1.0.M1.tags
[echo]
[echo] jbds-xulrunner-win32-filename=XulRunner-win32-1.0.0.GA-N200906091927-H246.zip
[echo] jbds-xulrunner-win32-nodeps-filename=XulRunner-win32-nodeps-1.0.0.GA-N200906091927-H246.zip
[echo]
[echo] Getting version for 'xulrunner' builder to property 'xulrunner.versionTag' from /qa/services/hudson/hudson_workspace/workspace/jbosstools-nightly-3.1.0.M2/org.jboss.ide.eclipse.releng/builders/product/versionTags/jbosstools/3.1.0.M1.tags
[echo]
[echo] jbds-xulrunner-linux-gtk-filename=XulRunner-linux-gtk-1.0.0.GA-N200906091927-H246.zip
[echo] jbds-xulrunner-linux-gtk-nodeps-filename=XulRunner-linux-gtk-nodeps-1.0.0.GA-N200906091927-H246.zip
[echo]
[echo] Getting version for 'richfaces' builder to property 'richfaces.versionTag' from /qa/services/hudson/hudson_workspace/workspace/jbosstools-nightly-3.1.0.M2/org.jboss.ide.eclipse.releng/builders/product/versionTags/jbosstools/3.1.0.M1.tags
[echo]
[echo] jbds-richfaces-win32-filename=RichFaces-VPE-win32-3.1.0.M1-N200906091927-H246.zip
[echo] jbds-richfaces-win32-nodeps-filename=RichFaces-VPE-win32-nodeps-3.1.0.M1-N200906091927-H246.zip
[echo]
[echo] Getting version for 'richfaces' builder to property 'richfaces.versionTag' from /qa/services/hudson/hudson_workspace/workspace/jbosstools-nightly-3.1.0.M2/org.jboss.ide.eclipse.releng/builders/product/versionTags/jbosstools/3.1.0.M1.tags
[echo]
[echo] jbds-richfaces-linux-gtk-filename=RichFaces-VPE-linux-gtk-3.1.0.M1-N200906091927-H246.zip
[echo] jbds-richfaces-linux-gtk-nodeps-filename=RichFaces-VPE-linux-gtk-nodeps-3.1.0.M1-N200906091927-H246.zip
[echo]
[echo] Getting version for 'jbpm-convert' builder to property 'jbpm-convert.versionTag' from /qa/services/hudson/hudson_workspace/workspace/jbosstools-nightly-3.1.0.M2/org.jboss.ide.eclipse.releng/builders/product/versionTags/jbosstools/3.1.0.M1.tags
[echo]
[echo] jbds-jbpm-convert-filename=jBPM-Convert-1.1.0.M1-N200906091927-H246.zip
[echo] jbds-jbpm-convert-nodeps-filename=jBPM-Convert-nodeps-1.1.0.M1-N200906091927-H246.zip
[echo]
[echo] Getting version for 'freemarker' builder to property 'freemarker.versionTag' from /qa/services/hudson/hudson_workspace/workspace/jbosstools-nightly-3.1.0.M2/org.jboss.ide.eclipse.releng/builders/product/versionTags/jbosstools/3.1.0.M1.tags
[echo]
[echo] jbds-freemarker-filename=FreeMarkerIDE-1.1.0.M1-N200906091927-H246.zip
[echo] jbds-freemarker-nodeps-filename=
[echo]
[length] /home/hudson/hudson_workspace/workspace/jbosstools-nightly-3.1.0.M2/jbds-build/3.1.0.M1/200906091927/freemarker is a directory; length unspecified
[echo] Getting version for 'hibernate-tools' builder to property 'hibernate-tools.versionTag' from /qa/services/hudson/hudson_workspace/workspace/jbosstools-nightly-3.1.0.M2/org.jboss.ide.eclipse.releng/builders/product/versionTags/jbosstools/3.1.0.M1.tags
[echo]
[echo] jbds-hibernate-tools-filename=HibernateTools-3.3.0.M1-N200906091927-H246.zip
[echo] jbds-hibernate-tools-nodeps-filename=HibernateTools-nodeps-3.3.0.M1-N200906091927-H246.zip
[echo]
[echo] Getting version for 'struts' builder to property 'struts.versionTag' from /qa/services/hudson/hudson_workspace/workspace/jbosstools-nightly-3.1.0.M2/org.jboss.ide.eclipse.releng/builders/product/versionTags/jbosstools/3.1.0.M1.tags
[echo]
[echo] jbds-struts-filename=StrutsTools-3.1.0.M1-N200906091927-H246.zip
[echo] jbds-struts-nodeps-filename=StrutsTools-nodeps-3.1.0.M1-N200906091927-H246.zip
[echo]
[echo] Getting version for 'jbpm' builder to property 'jbpm.versionTag' from /qa/services/hudson/hudson_workspace/workspace/jbosstools-nightly-3.1.0.M2/org.jboss.ide.eclipse.releng/builders/product/versionTags/jbosstools/3.1.0.M1.tags
[echo]
[echo] jbds-jbpm-filename=jBPM-Designer-3.1.7.GA-N200906091927-H246.zip
[echo] jbds-jbpm-nodeps-filename=jBPM-Designer-nodeps-3.1.7.GA-N200906091927-H246.zip
[echo]
[echo] Getting version for 'as' builder to property 'as.versionTag' from /qa/services/hudson/hudson_workspace/workspace/jbosstools-nightly-3.1.0.M2/org.jboss.ide.eclipse.releng/builders/product/versionTags/jbosstools/3.1.0.M1.tags
[echo]
[echo] jbds-as-filename=JBossAS-Tools-2.1.0.M1-N200906091927-H246.zip
[echo] jbds-as-nodeps-filename=JBossAS-Tools-nodeps-2.1.0.M1-N200906091927-H246.zip
[echo]
[echo] Getting version for 'seam' builder to property 'seam.versionTag' from /qa/services/hudson/hudson_workspace/workspace/jbosstools-nightly-3.1.0.M2/org.jboss.ide.eclipse.releng/builders/product/versionTags/jbosstools/3.1.0.M1.tags
[echo]
[echo] jbds-seam-filename=SeamTools-3.1.0.M1-N200906091927-H246.zip
[echo] jbds-seam-nodeps-filename=SeamTools-nodeps-3.1.0.M1-N200906091927-H246.zip
[echo]
[echo] Getting version for 'examples' builder to property 'examples.versionTag' from /qa/services/hudson/hudson_workspace/workspace/jbosstools-nightly-3.1.0.M2/org.jboss.ide.eclipse.releng/builders/product/versionTags/jbosstools/3.1.0.M1.tags
[echo]
[echo] jbds-examples-filename=JBossTools-Examples-1.1.0.M1-N200906091927-H246.zip
[echo] jbds-examples-nodeps-filename=JBossTools-Examples-nodeps-1.1.0.M1-N200906091927-H246.zip
[echo]
[echo] Getting version for 'esb' builder to property 'esb.versionTag' from /qa/services/hudson/hudson_workspace/workspace/jbosstools-nightly-3.1.0.M2/org.jboss.ide.eclipse.releng/builders/product/versionTags/jbosstools/3.1.0.M1.tags
[echo]
[echo] jbds-esb-filename=JBossTools-ESB-1.3.0.M1-N200906091927-H246.zip
[echo] jbds-esb-nodeps-filename=JBossTools-ESB-nodeps-1.3.0.M1-N200906091927-H246.zip
[echo]
[echo] Getting version for 'ws' builder to property 'ws.versionTag' from /qa/services/hudson/hudson_workspace/workspace/jbosstools-nightly-3.1.0.M2/org.jboss.ide.eclipse.releng/builders/product/versionTags/jbosstools/3.1.0.M1.tags
[echo]
[echo] jbds-ws-filename=JBossWS-Tools-1.1.0.M1-N200906091927-H246.zip
[echo] jbds-ws-nodeps-filename=JBossWS-Tools-nodeps-1.1.0.M1-N200906091927-H246.zip
[echo]
[echo] Getting version for 'birt' builder to property 'birt.versionTag' from /qa/services/hudson/hudson_workspace/workspace/jbosstools-nightly-3.1.0.M2/org.jboss.ide.eclipse.releng/builders/product/versionTags/jbosstools/3.1.0.M1.tags
[echo]
[echo] jbds-birt-filename=JBossTools-BIRT-1.1.0.M1-N200906091927-H246.zip
[echo] jbds-birt-nodeps-filename=JBossTools-BIRT-nodeps-1.1.0.M1-N200906091927-H246.zip
[echo]
[echo] Getting version for 'portlet' builder to property 'portlet.versionTag' from /qa/services/hudson/hudson_workspace/workspace/jbosstools-nightly-3.1.0.M2/org.jboss.ide.eclipse.releng/builders/product/versionTags/jbosstools/3.1.0.M1.tags
[echo]
[echo] jbds-portlet-filename=JBoss-Portlet-Tools-1.1.0.M1-N200906091927-H246.zip
[echo] jbds-portlet-nodeps-filename=JBoss-Portlet-Tools-nodeps-1.1.0.M1-N200906091927-H246.zip
[echo]
[echo] Getting version for 'smooks' builder to property 'smooks.versionTag' from /qa/services/hudson/hudson_workspace/workspace/jbosstools-nightly-3.1.0.M2/org.jboss.ide.eclipse.releng/builders/product/versionTags/jbosstools/3.1.0.M1.tags
[echo]
[echo] jbds-smooks-filename=JBossTools-Smooks-1.1.0.M1-N200906091927-H246.zip
[echo] jbds-smooks-nodeps-filename=JBossTools-Smooks-nodeps-1.1.0.M1-N200906091927-H246.zip
[echo]
[echo] Getting version for 'tptp' builder to property 'tptp.versionTag' from /qa/services/hudson/hudson_workspace/workspace/jbosstools-nightly-3.1.0.M2/org.jboss.ide.eclipse.releng/builders/product/versionTags/jbosstools/3.1.0.M1.tags
[echo]
[echo] jbds-tptp-filename=JBoss-TPTP-Tools-1.1.0.M1-N200906091927-H246.zip
[echo] jbds-tptp-nodeps-filename=JBoss-TPTP-Tools-nodeps-1.1.0.M1-N200906091927-H246.zip
[echo]
pack200:
[echo] Using /qa/tools/opt/jdk1.5.0_15/jre/bin/pack200 to pack update site jars...
[mkdir] Created dir: /qa/services/hudson/hudson_workspace/workspace/jbosstools-nightly-3.1.0.M2/org.jboss.ide.eclipse.releng/builders/product/updateSite/updateSitePackTmp/output
[mkdir] Created dir: /qa/services/hudson/hudson_workspace/workspace/jbosstools-nightly-3.1.0.M2/org.jboss.ide.eclipse.releng/builders/product/updateSite/updateSitePackTmp/input
[echo] Zip update jars in /home/hudson/hudson_workspace/workspace/jbosstools-nightly-3.1.0.M2/jbds-build/site to temporary Master zip (to avoid packing nested jars) ...
[zip] Building zip: /qa/services/hudson/hudson_workspace/workspace/jbosstools-nightly-3.1.0.M2/org.jboss.ide.eclipse.releng/builders/product/updateSite/updateSitePackTmp/input/Master.zip
[exec] 69M updateSite/updateSitePackTmp/input/Master.zip
[echo] Pack jars ...
[echo] Run jarprocessor.pack200 using launcherjar = /home/hudson/hudson_workspace/workspace/jbosstools-nightly-3.1.0.M2/jbds-build/clean-eclipse/eclipse/plugins/org.eclipse.equinox.launcher_1.0.200.v20090520.jar
[exec] 166M updateSite/updateSitePackTmp/output/Master.zip
[unzip] Expanding: /qa/services/hudson/hudson_workspace/workspace/jbosstools-nightly-3.1.0.M2/org.jboss.ide.eclipse.releng/builders/product/updateSite/updateSitePackTmp/output/Master.zip into /home/hudson/hudson_workspace/workspace/jbosstools-nightly-3.1.0.M2/jbds-build/site
[delete] Deleting directory /qa/services/hudson/hudson_workspace/workspace/jbosstools-nightly-3.1.0.M2/org.jboss.ide.eclipse.releng/builders/product/updateSite/updateSitePackTmp
copy.site.rootfiles:
[echo] Build development jbosstools update site...
[copy] Copying 4 files to /home/hudson/hudson_workspace/workspace/jbosstools-nightly-3.1.0.M2/jbds-build/site/eclipse
p2:
[echo] Run p2 metadata generator using launcherjar = /home/hudson/hudson_workspace/workspace/jbosstools-nightly-3.1.0.M2/jbds-build/clean-eclipse/eclipse/plugins/org.eclipse.equinox.launcher_1.0.200.v20090520.jar
[p2] Generating metadata for /home/hudson/hudson_workspace/workspace/jbosstools-nightly-3.1.0.M2/jbds-build/site/eclipse.
[p2] Generation completed with success [11 seconds].
build.metadata:
publish.site:
post-build:
publish.results:
send.notification.email:
[mail] Failed to initialise MIME mail: javax/mail/MessagingException
publish.log:
init:
clean.all.subfolders:
BUILD SUCCESSFUL
Total time: 228 minutes 49 seconds
+ cd ../configs/jbds
+ zip build.log.zip build.log
updating: build.log (deflated 95%)
+ cd ../..
++ date +%s
+ endtime=1244604292
++ echo 'scale=2; (1244604292 - 1244590479)/60'
++ bc -l
+ elapsed=230.21
+ echo 'Elapsed time: 230.21mins.'
Elapsed time: 230.21mins.
+ [[ '' == \l\o\c\a\l ]]
++ cat /home/hudson/hudson_workspace/workspace/jbosstools-nightly-3.1.0.M2/jbds-build/buildData.properties
++ grep product.releaseNumber
++ perl -ne 's/[\s\t]+product.releaseNumber=//g;print;'
+ version=3.1.0.M1
++ cat /home/hudson/hudson_workspace/workspace/jbosstools-nightly-3.1.0.M2/jbds-build/buildData.properties
++ grep upload.to
++ perl -ne 's/[\s\t]+upload.to=//g;print;'
+ builddir=nightly/3.1.0.M1/200906091927
++ cat /home/hudson/hudson_workspace/workspace/jbosstools-nightly-3.1.0.M2/jbds-build/buildData.properties
++ perl -ne 's/[\s\t]+product.buildDesc=//g; print;'
++ grep product.buildDesc
+ buildtype=nightly
++ cat /home/hudson/hudson_workspace/workspace/jbosstools-nightly-3.1.0.M2/jbds-build/buildData.properties
++ grep product.releaseNumber
++ perl -ne 's/[\s\t]+product.releaseNumber=//g; print;'
+ releaseNumber=3.1.0.M1
+ DESTINATION=jbossqa@download.jboss.org:/htdocs/jbosstools
+ scp -r /home/hudson/hudson_workspace/workspace/jbosstools-nightly-3.1.0.M2/jbds-build/3.1.0.M1 jbossqa@download.jboss.org:/htdocs/jbosstools/builds/nightly/
+ scp configs/jbds/build.log.zip jbossqa@download.jboss.org:/htdocs/jbosstools/builds/nightly/3.1.0.M1/200906091927/
+ scp /home/hudson/hudson_workspace/workspace/jbosstools-nightly-3.1.0.M2/jbds-build/latestBuild.html jbossqa@download.jboss.org:/htdocs/jbosstools/builds/nightly/
++ date +%s
+ endtime=1244607212
++ echo 'scale=2; (1244607212 - 1244590479)/60'
++ bc -l
+ elapsed=278.88
+ echo 'Elapsed time: 278.88mins.'
Elapsed time: 278.88mins.
+ [[ -d /home/hudson/hudson_workspace/workspace/jbosstools-nightly-3.1.0.M2/jbds-build/site/eclipse ]]
+ mkdir -p /home/hudson/hudson_workspace/workspace/jbosstools-nightly-3.1.0.M2/jbds-build/site/nightly/trunk
+ mv /home/hudson/hudson_workspace/workspace/jbosstools-nightly-3.1.0.M2/jbds-build/site/eclipse/artifacts.jar /home/hudson/hudson_workspace/workspace/jbosstools-nightly-3.1.0.M2/jbds-build/site/eclipse/associateSites.xml /home/hudson/hudson_workspace/workspace/jbosstools-nightly-3.1.0.M2/jbds-build/site/eclipse/content.jar /home/hudson/hudson_workspace/workspace/jbosstools-nightly-3.1.0.M2/jbds-build/site/eclipse/features /home/hudson/hudson_workspace/workspace/jbosstools-nightly-3.1.0.M2/jbds-build/site/eclipse/index.html /home/hudson/hudson_workspace/workspace/jbosstools-nightly-3.1.0.M2/jbds-build/site/eclipse/plugins /home/hudson/hudson_workspace/workspace/jbosstools-nightly-3.1.0.M2/jbds-build/site/eclipse/site.xml /home/hudson/hudson_workspace/workspace/jbosstools-nightly-3.1.0.M2/jbds-build/site/eclipse/web /home/hudson/hudson_workspace/workspace/jbosstools-nightly-3.1.0.M2/jbds-build/site/nightly/trunk
++ find /home/hudson/hudson_workspace/workspace/jbosstools-nightly-3.1.0.M2/jbds-build/site/nightly/trunk/features -name '*.jar'
+ [[ -n /home/hudson/hudson_workspace/workspace/jbosstools-nightly-3.1.0.M2/jbds-build/site/nightly/trunk/features/org.jboss.tools.jmx.feature_1.1.0.M1-N200906091927-H246.jar
/home/hudson/hudson_workspace/workspace/jbosstools-nightly-3.1.0.M2/jbds-build/site/nightly/trunk/features/org.guvnor.tools.feature_5.1.0.trunk-N200906091927-H246.jar
/home/hudson/hudson_workspace/workspace/jbosstools-nightly-3.1.0.M2/jbds-build/site/nightly/trunk/features/org.hibernate.eclipse.feature_3.3.0.M1-N200906091927-H246.jar
/home/hudson/hudson_workspace/workspace/jbosstools-nightly-3.1.0.M2/jbds-build/site/nightly/trunk/features/org.jboss.tools.seam.feature_3.1.0.M1-N200906091927-H246.jar
/home/hudson/hudson_workspace/workspace/jbosstools-nightly-3.1.0.M2/jbds-build/site/nightly/trunk/features/org.jboss.tools.portlet.feature_1.1.0.M1-N200906091927-H246.jar
/home/hudson/hudson_workspace/workspace/jbosstools-nightly-3.1.0.M2/jbds-build/site/nightly/trunk/features/org.jboss.tools.xulrunner.feature_1.8.1.3-20070904.jar
/home/hudson/hudson_workspace/workspace/jbosstools-nightly-3.1.0.M2/jbds-build/site/nightly/trunk/features/org.jboss.tools.smooks.feature_1.1.0.M1-N200906091927-H246.jar
/home/hudson/hudson_workspace/workspace/jbosstools-nightly-3.1.0.M2/jbds-build/site/nightly/trunk/features/org.jboss.ide.eclipse.as.feature_2.1.0.M1-N200906091927-H246.jar
/home/hudson/hudson_workspace/workspace/jbosstools-nightly-3.1.0.M2/jbds-build/site/nightly/trunk/features/org.jbpm.gd.jpdl.feature_3.1.7.GA-N200906091927-H246.jar
/home/hudson/hudson_workspace/workspace/jbosstools-nightly-3.1.0.M2/jbds-build/site/nightly/trunk/features/org.jboss.tools.struts_feature_3.1.0.M1-N200906091927-H246.jar
/home/hudson/hudson_workspace/workspace/jbosstools-nightly-3.1.0.M2/jbds-build/site/nightly/trunk/features/org.jboss.tools.birt.feature_1.1.0.M1-N200906091927-H246.jar
/home/hudson/hudson_workspace/workspace/jbosstools-nightly-3.1.0.M2/jbds-build/site/nightly/trunk/features/org.jboss.tools.esb.feature_1.3.0.M1-N200906091927-H246.jar
/home/hudson/hudson_workspace/workspace/jbosstools-nightly-3.1.0.M2/jbds-build/site/nightly/trunk/features/org.jboss.tools.tptp.feature_1.1.0.M1-N200906091927-H246.jar
/home/hudson/hudson_workspace/workspace/jbosstools-nightly-3.1.0.M2/jbds-build/site/nightly/trunk/features/org.jboss.tools.richfaces.feature_3.1.0.M1-N200906091927-H246.jar
/home/hudson/hudson_workspace/workspace/jbosstools-nightly-3.1.0.M2/jbds-build/site/nightly/trunk/features/org.jboss.tools.ws.feature_1.1.0.M1-N200906091927-H246.jar
/home/hudson/hudson_workspace/workspace/jbosstools-nightly-3.1.0.M2/jbds-build/site/nightly/trunk/features/org.jboss.ide.eclipse.freemarker.feature_1.1.0.M1-N200906091927-H246.jar
/home/hudson/hudson_workspace/workspace/jbosstools-nightly-3.1.0.M2/jbds-build/site/nightly/trunk/features/org.drools.eclipse.feature_5.1.0.trunk-N200906091927-H246.jar
/home/hudson/hudson_workspace/workspace/jbosstools-nightly-3.1.0.M2/jbds-build/site/nightly/trunk/features/org.drools.eclipse.task.feature_5.1.0.trunk-N200906091927-H246.jar
/home/hudson/hudson_workspace/workspace/jbosstools-nightly-3.1.0.M2/jbds-build/site/nightly/trunk/features/org.jboss.ide.eclipse.archives.feature_3.1.0.M1-N200906091927-H246.jar
/home/hudson/hudson_workspace/workspace/jbosstools-nightly-3.1.0.M2/jbds-build/site/nightly/trunk/features/org.jboss.tools.jbpm.convert.feature_1.1.0.M1-N200906091927-H246.jar
/home/hudson/hudson_workspace/workspace/jbosstools-nightly-3.1.0.M2/jbds-build/site/nightly/trunk/features/org.jboss.tools.project.examples.feature_1.1.0.M1-N200906091927-H246.jar ]]
+ mkdir -p jbossqa@download.jboss.org:/htdocs/jbosstools/updates/nightly/
+ rsync -arz --delete /home/hudson/hudson_workspace/workspace/jbosstools-nightly-3.1.0.M2/jbds-build/site/nightly/trunk jbossqa@download.jboss.org:/htdocs/jbosstools/updates/nightly/
++ date +%s
+ endtime=1244607378
++ echo 'scale=2; (1244607378 - 1244590479)/60'
++ bc -l
+ elapsed=281.65
+ echo 'Elapsed time: 281.65mins.'
Elapsed time: 281.65mins.
Terminating xvnc
[jbosstools-nightly-3.1.0.M2] $ vncserver -kill :12
Killing Xvnc process ID 27622
[jbosstools-nightly-3.1.0.M2] $ bash -xe /tmp/hudson1030995004507688133.sh
+ kill 27603
Recording test results
Recording Emma reports jbds-build/coverage.xml
[PMD] Collecting PMD analysis files...
[PMD] Found 5995 annotations (5 new, 784 high, 5209 normal, 2 low)
[PMD] Don't changing build status, no threshold has been exceeded
Build was marked for publishing on https://hudson.jboss.org/hudson/
Email was triggered for: Unstable
Email was triggered for: Still Unstable
Trigger Unstable was overridden by another trigger and will not send an email.
There are 1 triggered emails.
Sending email for trigger: Still Unstable
--------------------------------------------------
15 years, 8 months
JBoss-AS-6.0.x-compatibilityMatrix - Build # 84 - Still Failing!
by jboss-qa-internal@redhat.com
JBoss-AS-6.0.x-compatibilityMatrix - Build # 84 - Still Failing:
Check console output at https://hudson.jboss.org/hudson//job/JBoss-AS-6.0.x-compatibilityMatrix/84 to view the results.
Modifications since last build:
[smarlow(a)redhat.com] JBAS-7005: limit logging of classes used during startup. Comment out new category limits.
[bstansberry(a)jboss.com] [JBAS-6094] Expose lifecycle methods as managed operations
[smarlow(a)redhat.com] JBAS-7005: limit logging of classes used during startup. Note this also reduces the debug/trace output (category limits can then be commented out to enable trace for a subset of functionality).
[bstansberry(a)jboss.com] [JBAS-6802] Extract ServiceBindingManager into its own project
[pete.muir(a)jboss.org] minor
[jaikiran] JBAS-7004 Fixed the usage of a MC API which was resulting in picking irrelevant deployments
[petemuir] remove all deps from Web Beans zip
-------------------------------------------------------------------------
[...truncated 91132 lines...]
[junit] junit.framework.TestListener: endTest(org.jboss.test.cmp2.simple.SimpleUnitTestCase::testTimestampComparison)
[junit] junit.framework.TestListener: startTest(org.jboss.test.cmp2.simple.SimpleUnitTestCase::testTimestampIn)
[junit] junit.framework.TestListener: endTest(org.jboss.test.cmp2.simple.SimpleUnitTestCase::testTimestampIn)
[junit] junit.framework.TestListener: startTest(org.jboss.test.cmp2.simple.SimpleUnitTestCase::testStringBetween)
[junit] junit.framework.TestListener: endTest(org.jboss.test.cmp2.simple.SimpleUnitTestCase::testStringBetween)
[junit] junit.framework.TestListener: startTest(org.jboss.test.cmp2.simple.SimpleUnitTestCase::testStringComparison)
[junit] junit.framework.TestListener: endTest(org.jboss.test.cmp2.simple.SimpleUnitTestCase::testStringComparison)
[junit] junit.framework.TestListener: startTest(org.jboss.test.cmp2.simple.SimpleUnitTestCase::testStringIn)
[junit] junit.framework.TestListener: endTest(org.jboss.test.cmp2.simple.SimpleUnitTestCase::testStringIn)
[junit] junit.framework.TestListener: startTest(org.jboss.test.cmp2.simple.SimpleUnitTestCase::testLike)
[junit] junit.framework.TestListener: endTest(org.jboss.test.cmp2.simple.SimpleUnitTestCase::testLike)
[junit] junit.framework.TestListener: startTest(org.jboss.test.cmp2.simple.SimpleUnitTestCase::testNumericIn)
[junit] junit.framework.TestListener: endTest(org.jboss.test.cmp2.simple.SimpleUnitTestCase::testNumericIn)
[junit] junit.framework.TestListener: startTest(org.jboss.test.cmp2.simple.SimpleUnitTestCase::testNumbericComparison)
[junit] junit.framework.TestListener: endTest(org.jboss.test.cmp2.simple.SimpleUnitTestCase::testNumbericComparison)
[junit] junit.framework.TestListener: startTest(org.jboss.test.cmp2.simple.SimpleUnitTestCase::testConcatFunction)
[junit] junit.framework.TestListener: endTest(org.jboss.test.cmp2.simple.SimpleUnitTestCase::testConcatFunction)
[junit] junit.framework.TestListener: startTest(org.jboss.test.cmp2.simple.SimpleUnitTestCase::testLengthFunction)
[junit] junit.framework.TestListener: endTest(org.jboss.test.cmp2.simple.SimpleUnitTestCase::testLengthFunction)
[junit] junit.framework.TestListener: startTest(org.jboss.test.cmp2.simple.SimpleUnitTestCase::testSelectValueClass)
[junit] junit.framework.TestListener: endTest(org.jboss.test.cmp2.simple.SimpleUnitTestCase::testSelectValueClass)
[junit] junit.framework.TestListener: startTest(org.jboss.test.cmp2.simple.SimpleUnitTestCase::testLocateFunction)
[junit] junit.framework.TestListener: endTest(org.jboss.test.cmp2.simple.SimpleUnitTestCase::testLocateFunction)
[junit] junit.framework.TestListener: startTest(org.jboss.test.cmp2.simple.SimpleUnitTestCase::testFindWithByteArray)
[junit] junit.framework.TestListener: endTest(org.jboss.test.cmp2.simple.SimpleUnitTestCase::testFindWithByteArray)
[junit] junit.framework.TestListener: startTest(org.jboss.test.cmp2.simple.SimpleUnitTestCase::testDuplicateKey)
[junit] junit.framework.TestListener: endTest(org.jboss.test.cmp2.simple.SimpleUnitTestCase::testDuplicateKey)
[junit] junit.framework.TestListener: startTest(org.jboss.test.cmp2.simple.SimpleUnitTestCase::testHashtable)
[junit] junit.framework.TestListener: endTest(org.jboss.test.cmp2.simple.SimpleUnitTestCase::testHashtable)
[junit] junit.framework.TestListener: startTest(org.jboss.test.cmp2.simple.SimpleUnitTestCase::testOptionAUpdate)
[junit] junit.framework.TestListener: endTest(org.jboss.test.cmp2.simple.SimpleUnitTestCase::testOptionAUpdate)
[junit] Tests run: 253, Failures: 0, Errors: 0, Time elapsed: 89.984 sec
[antcall] Exiting /qa/services/hudson/hudson_workspace/workspace/JBoss-AS-6.0.x-compatibilityMatrix/JBossAS/testsuite/build.xml.
[antcall] Exiting /qa/services/hudson/hudson_workspace/workspace/JBoss-AS-6.0.x-compatibilityMatrix/JBossAS/testsuite/build.xml.
[echo] Will stop the jboss instance at url jnp://10.16.93.9:1099
[java] The jvmargs attribute is deprecated. Please use nested jvmarg elements.
[java] Executing '/qa/tools/opt/jdk1.6.0_07/bin/java' with arguments:
[java] '-Dnone'
[java] '-classpath'
[java] '/qa/services/hudson/hudson_workspace/workspace/JBoss-AS-6.0.x-compatibilityMatrix/JBossAS/build/output/jboss-6.0.0.Alpha1/bin/shutdown.jar:/qa/services/hudson/hudson_workspace/workspace/JBoss-AS-6.0.x-compatibilityMatrix/JBossAS/build/output/jboss-6.0.0.Alpha1/client/jbossall-client.jar'
[java] 'org.jboss.Shutdown'
[java] '--server'
[java] 'jnp://10.16.93.9:1099'
[java] '--shutdown'
[java]
[java] The ' characters around the executable and arguments are
[java] not part of the command.
[java] Shutdown message has been posted to the server.
[java] Server shutdown may take a while - check logfiles for completion
[sleep] sleeping for 240000 milliseconds
[echo] Will start the jboss instance 10.16.93.9 with default, dist=/qa/services/hudson/hudson_workspace/workspace/JBoss-AS-6.0.x-compatibilityMatrix/JBossAS/build/output/jboss-6.0.0.Alpha1
[java] Executing '/qa/tools/opt/jdk1.6.0_07/bin/java' with arguments:
[java] '-Xmx128m'
[java] '-Xmx512m'
[java] '-XX:MaxPermSize=512m'
[java] '-Dnone'
[java] '-classpath'
[java] '/qa/services/hudson/hudson_workspace/workspace/JBoss-AS-6.0.x-compatibilityMatrix/JBossAS/build/output/jboss-6.0.0.Alpha1/bin/run.jar:/qa/tools/opt/amd64/jdk1.6.0_11/lib/tools.jar'
[java] 'org.jboss.Main'
[java] '-c'
[java] 'default'
[java] '-b'
[java] '10.16.93.9'
[java]
[java] The ' characters around the executable and arguments are
[java] not part of the command.
spawned process java.lang.UNIXProcess@434ac89a
[echo] Waiting for 10.16.93.9 to start...
Checking for http://10.16.93.9:8080/
Checking for http://10.16.93.9:8080/
Checking for http://10.16.93.9:8080/
Checking for http://10.16.93.9:8080/
Checking for http://10.16.93.9:8080/
Checking for http://10.16.93.9:8080/
Checking for http://10.16.93.9:8080/
Checking for http://10.16.93.9:8080/
Checking for http://10.16.93.9:8080/
Checking for http://10.16.93.9:8080/
Checking for http://10.16.93.9:8080/
Checking for http://10.16.93.9:8080/
Result code for http://10.16.93.9:8080/ was 404
waitfor: timeout
BUILD FAILED
/qa/services/hudson/hudson_workspace/workspace/JBoss-AS-6.0.x-compatibilityMatrix/JBossAS/testsuite/build.xml:3618: The following error occurred while executing this line:
/qa/services/hudson/hudson_workspace/workspace/JBoss-AS-6.0.x-compatibilityMatrix/JBossAS/testsuite/build.xml:3636: The following error occurred while executing this line:
/qa/services/hudson/hudson_workspace/workspace/JBoss-AS-6.0.x-compatibilityMatrix/JBossAS/testsuite/build.xml:626: Timeout waiting for nodes to start
at org.apache.tools.ant.ProjectHelper.addLocationToBuildException(ProjectHelper.java:508)
at org.apache.tools.ant.taskdefs.MacroInstance.execute(MacroInstance.java:397)
at org.apache.tools.ant.UnknownElement.execute(UnknownElement.java:288)
at sun.reflect.GeneratedMethodAccessor1.invoke(Unknown Source)
at sun.reflect.DelegatingMethodAccessorImpl.invoke(DelegatingMethodAccessorImpl.java:25)
at java.lang.reflect.Method.invoke(Method.java:597)
at org.apache.tools.ant.dispatch.DispatchUtils.execute(DispatchUtils.java:106)
at org.apache.tools.ant.Task.perform(Task.java:348)
at org.apache.tools.ant.Target.execute(Target.java:357)
at org.apache.tools.ant.Target.performTasks(Target.java:385)
at org.apache.tools.ant.Project.executeSortedTargets(Project.java:1337)
at org.apache.tools.ant.Project.executeTarget(Project.java:1306)
at org.apache.tools.ant.helper.DefaultExecutor.executeTargets(DefaultExecutor.java:41)
at org.apache.tools.ant.Project.executeTargets(Project.java:1189)
at org.apache.tools.ant.Main.runBuild(Main.java:758)
at org.apache.tools.ant.Main.startAnt(Main.java:217)
at org.apache.tools.ant.launch.Launcher.run(Launcher.java:257)
at org.apache.tools.ant.launch.Launcher.main(Launcher.java:104)
Caused by: /qa/services/hudson/hudson_workspace/workspace/JBoss-AS-6.0.x-compatibilityMatrix/JBossAS/testsuite/build.xml:3636: The following error occurred while executing this line:
/qa/services/hudson/hudson_workspace/workspace/JBoss-AS-6.0.x-compatibilityMatrix/JBossAS/testsuite/build.xml:626: Timeout waiting for nodes to start
at org.apache.tools.ant.ProjectHelper.addLocationToBuildException(ProjectHelper.java:508)
at org.apache.tools.ant.taskdefs.MacroInstance.execute(MacroInstance.java:397)
at org.apache.tools.ant.UnknownElement.execute(UnknownElement.java:288)
at sun.reflect.GeneratedMethodAccessor1.invoke(Unknown Source)
at sun.reflect.DelegatingMethodAccessorImpl.invoke(DelegatingMethodAccessorImpl.java:25)
at java.lang.reflect.Method.invoke(Method.java:597)
at org.apache.tools.ant.dispatch.DispatchUtils.execute(DispatchUtils.java:106)
at org.apache.tools.ant.Task.perform(Task.java:348)
at org.apache.tools.ant.taskdefs.Sequential.execute(Sequential.java:62)
at org.apache.tools.ant.UnknownElement.execute(UnknownElement.java:288)
at sun.reflect.GeneratedMethodAccessor1.invoke(Unknown Source)
at sun.reflect.DelegatingMethodAccessorImpl.invoke(DelegatingMethodAccessorImpl.java:25)
at java.lang.reflect.Method.invoke(Method.java:597)
at org.apache.tools.ant.dispatch.DispatchUtils.execute(DispatchUtils.java:106)
at org.apache.tools.ant.Task.perform(Task.java:348)
at org.apache.tools.ant.taskdefs.MacroInstance.execute(MacroInstance.java:394)
... 16 more
Caused by: /qa/services/hudson/hudson_workspace/workspace/JBoss-AS-6.0.x-compatibilityMatrix/JBossAS/testsuite/build.xml:626: Timeout waiting for nodes to start
at org.apache.tools.ant.taskdefs.Exit.execute(Exit.java:142)
at org.apache.tools.ant.UnknownElement.execute(UnknownElement.java:288)
at sun.reflect.GeneratedMethodAccessor1.invoke(Unknown Source)
at sun.reflect.DelegatingMethodAccessorImpl.invoke(DelegatingMethodAccessorImpl.java:25)
at java.lang.reflect.Method.invoke(Method.java:597)
at org.apache.tools.ant.dispatch.DispatchUtils.execute(DispatchUtils.java:106)
at org.apache.tools.ant.Task.perform(Task.java:348)
at org.apache.tools.ant.taskdefs.Sequential.execute(Sequential.java:62)
at org.apache.tools.ant.UnknownElement.execute(UnknownElement.java:288)
at sun.reflect.GeneratedMethodAccessor1.invoke(Unknown Source)
at sun.reflect.DelegatingMethodAccessorImpl.invoke(DelegatingMethodAccessorImpl.java:25)
at java.lang.reflect.Method.invoke(Method.java:597)
at org.apache.tools.ant.dispatch.DispatchUtils.execute(DispatchUtils.java:106)
at org.apache.tools.ant.Task.perform(Task.java:348)
at org.apache.tools.ant.taskdefs.MacroInstance.execute(MacroInstance.java:394)
... 30 more
--- Nested Exception ---
/qa/services/hudson/hudson_workspace/workspace/JBoss-AS-6.0.x-compatibilityMatrix/JBossAS/testsuite/build.xml:3636: The following error occurred while executing this line:
/qa/services/hudson/hudson_workspace/workspace/JBoss-AS-6.0.x-compatibilityMatrix/JBossAS/testsuite/build.xml:626: Timeout waiting for nodes to start
at org.apache.tools.ant.ProjectHelper.addLocationToBuildException(ProjectHelper.java:508)
at org.apache.tools.ant.taskdefs.MacroInstance.execute(MacroInstance.java:397)
at org.apache.tools.ant.UnknownElement.execute(UnknownElement.java:288)
at sun.reflect.GeneratedMethodAccessor1.invoke(Unknown Source)
at sun.reflect.DelegatingMethodAccessorImpl.invoke(DelegatingMethodAccessorImpl.java:25)
at java.lang.reflect.Method.invoke(Method.java:597)
at org.apache.tools.ant.dispatch.DispatchUtils.execute(DispatchUtils.java:106)
at org.apache.tools.ant.Task.perform(Task.java:348)
at org.apache.tools.ant.taskdefs.Sequential.execute(Sequential.java:62)
at org.apache.tools.ant.UnknownElement.execute(UnknownElement.java:288)
at sun.reflect.GeneratedMethodAccessor1.invoke(Unknown Source)
at sun.reflect.DelegatingMethodAccessorImpl.invoke(DelegatingMethodAccessorImpl.java:25)
at java.lang.reflect.Method.invoke(Method.java:597)
at org.apache.tools.ant.dispatch.DispatchUtils.execute(DispatchUtils.java:106)
at org.apache.tools.ant.Task.perform(Task.java:348)
at org.apache.tools.ant.taskdefs.MacroInstance.execute(MacroInstance.java:394)
at org.apache.tools.ant.UnknownElement.execute(UnknownElement.java:288)
at sun.reflect.GeneratedMethodAccessor1.invoke(Unknown Source)
at sun.reflect.DelegatingMethodAccessorImpl.invoke(DelegatingMethodAccessorImpl.java:25)
at java.lang.reflect.Method.invoke(Method.java:597)
at org.apache.tools.ant.dispatch.DispatchUtils.execute(DispatchUtils.java:106)
at org.apache.tools.ant.Task.perform(Task.java:348)
at org.apache.tools.ant.Target.execute(Target.java:357)
at org.apache.tools.ant.Target.performTasks(Target.java:385)
at org.apache.tools.ant.Project.executeSortedTargets(Project.java:1337)
at org.apache.tools.ant.Project.executeTarget(Project.java:1306)
at org.apache.tools.ant.helper.DefaultExecutor.executeTargets(DefaultExecutor.java:41)
at org.apache.tools.ant.Project.executeTargets(Project.java:1189)
at org.apache.tools.ant.Main.runBuild(Main.java:758)
at org.apache.tools.ant.Main.startAnt(Main.java:217)
at org.apache.tools.ant.launch.Launcher.run(Launcher.java:257)
at org.apache.tools.ant.launch.Launcher.main(Launcher.java:104)
Caused by: /qa/services/hudson/hudson_workspace/workspace/JBoss-AS-6.0.x-compatibilityMatrix/JBossAS/testsuite/build.xml:626: Timeout waiting for nodes to start
at org.apache.tools.ant.taskdefs.Exit.execute(Exit.java:142)
at org.apache.tools.ant.UnknownElement.execute(UnknownElement.java:288)
at sun.reflect.GeneratedMethodAccessor1.invoke(Unknown Source)
at sun.reflect.DelegatingMethodAccessorImpl.invoke(DelegatingMethodAccessorImpl.java:25)
at java.lang.reflect.Method.invoke(Method.java:597)
at org.apache.tools.ant.dispatch.DispatchUtils.execute(DispatchUtils.java:106)
at org.apache.tools.ant.Task.perform(Task.java:348)
at org.apache.tools.ant.taskdefs.Sequential.execute(Sequential.java:62)
at org.apache.tools.ant.UnknownElement.execute(UnknownElement.java:288)
at sun.reflect.GeneratedMethodAccessor1.invoke(Unknown Source)
at sun.reflect.DelegatingMethodAccessorImpl.invoke(DelegatingMethodAccessorImpl.java:25)
at java.lang.reflect.Method.invoke(Method.java:597)
at org.apache.tools.ant.dispatch.DispatchUtils.execute(DispatchUtils.java:106)
at org.apache.tools.ant.Task.perform(Task.java:348)
at org.apache.tools.ant.taskdefs.MacroInstance.execute(MacroInstance.java:394)
... 30 more
--- Nested Exception ---
/qa/services/hudson/hudson_workspace/workspace/JBoss-AS-6.0.x-compatibilityMatrix/JBossAS/testsuite/build.xml:626: Timeout waiting for nodes to start
at org.apache.tools.ant.taskdefs.Exit.execute(Exit.java:142)
at org.apache.tools.ant.UnknownElement.execute(UnknownElement.java:288)
at sun.reflect.GeneratedMethodAccessor1.invoke(Unknown Source)
at sun.reflect.DelegatingMethodAccessorImpl.invoke(DelegatingMethodAccessorImpl.java:25)
at java.lang.reflect.Method.invoke(Method.java:597)
at org.apache.tools.ant.dispatch.DispatchUtils.execute(DispatchUtils.java:106)
at org.apache.tools.ant.Task.perform(Task.java:348)
at org.apache.tools.ant.taskdefs.Sequential.execute(Sequential.java:62)
at org.apache.tools.ant.UnknownElement.execute(UnknownElement.java:288)
at sun.reflect.GeneratedMethodAccessor1.invoke(Unknown Source)
at sun.reflect.DelegatingMethodAccessorImpl.invoke(DelegatingMethodAccessorImpl.java:25)
at java.lang.reflect.Method.invoke(Method.java:597)
at org.apache.tools.ant.dispatch.DispatchUtils.execute(DispatchUtils.java:106)
at org.apache.tools.ant.Task.perform(Task.java:348)
at org.apache.tools.ant.taskdefs.MacroInstance.execute(MacroInstance.java:394)
at org.apache.tools.ant.UnknownElement.execute(UnknownElement.java:288)
at sun.reflect.GeneratedMethodAccessor1.invoke(Unknown Source)
at sun.reflect.DelegatingMethodAccessorImpl.invoke(DelegatingMethodAccessorImpl.java:25)
at java.lang.reflect.Method.invoke(Method.java:597)
at org.apache.tools.ant.dispatch.DispatchUtils.execute(DispatchUtils.java:106)
at org.apache.tools.ant.Task.perform(Task.java:348)
at org.apache.tools.ant.taskdefs.Sequential.execute(Sequential.java:62)
at org.apache.tools.ant.UnknownElement.execute(UnknownElement.java:288)
at sun.reflect.GeneratedMethodAccessor1.invoke(Unknown Source)
at sun.reflect.DelegatingMethodAccessorImpl.invoke(DelegatingMethodAccessorImpl.java:25)
at java.lang.reflect.Method.invoke(Method.java:597)
at org.apache.tools.ant.dispatch.DispatchUtils.execute(DispatchUtils.java:106)
at org.apache.tools.ant.Task.perform(Task.java:348)
at org.apache.tools.ant.taskdefs.MacroInstance.execute(MacroInstance.java:394)
at org.apache.tools.ant.UnknownElement.execute(UnknownElement.java:288)
at sun.reflect.GeneratedMethodAccessor1.invoke(Unknown Source)
at sun.reflect.DelegatingMethodAccessorImpl.invoke(DelegatingMethodAccessorImpl.java:25)
at java.lang.reflect.Method.invoke(Method.java:597)
at org.apache.tools.ant.dispatch.DispatchUtils.execute(DispatchUtils.java:106)
at org.apache.tools.ant.Task.perform(Task.java:348)
at org.apache.tools.ant.Target.execute(Target.java:357)
at org.apache.tools.ant.Target.performTasks(Target.java:385)
at org.apache.tools.ant.Project.executeSortedTargets(Project.java:1337)
at org.apache.tools.ant.Project.executeTarget(Project.java:1306)
at org.apache.tools.ant.helper.DefaultExecutor.executeTargets(DefaultExecutor.java:41)
at org.apache.tools.ant.Project.executeTargets(Project.java:1189)
at org.apache.tools.ant.Main.runBuild(Main.java:758)
at org.apache.tools.ant.Main.startAnt(Main.java:217)
at org.apache.tools.ant.launch.Launcher.run(Launcher.java:257)
at org.apache.tools.ant.launch.Launcher.main(Launcher.java:104)
Total time: 58 minutes 27 seconds
[JBoss-AS-6.0.x-compatibilityMatrix] $ bash -xe /tmp/hudson2877131074960935076.sh
+ kill 7048
Recording test results
Build was marked for publishing on https://hudson.jboss.org/hudson/
Email was triggered for: Failure
There are 1 triggered emails.
Sending email for trigger: Failure
15 years, 8 months
[Unstable] devstudio-nightly-3.0.0.M1 #237
by jboss-qa-internal@redhat.com
Public:
https://hudson.jboss.org/hudson//job/devstudio-nightly-3.0.0.M1/237
https://hudson.jboss.org/hudson//job/devstudio-nightly-3.0.0.M1/237/testR...
https://hudson.jboss.org/hudson//job/devstudio-nightly-3.0.0.M1/237/changes
https://hudson.jboss.org/hudson//job/devstudio-nightly-3.0.0.M1/237/console
Internal:
http://hudson.qa.jboss.com/hudson/job/devstudio-nightly-3.0.0.M1/237/
http://hudson.qa.jboss.com/hudson/job/devstudio-nightly-3.0.0.M1/237//tes...
http://hudson.qa.jboss.com/hudson/job/devstudio-nightly-3.0.0.M1/237//cha...
http://hudson.qa.jboss.com/hudson/job/devstudio-nightly-3.0.0.M1/237//con...
--------------------------------------------------
Failed Tests:
5 tests failed.
FAILED: AllTests
Error Message:
expected:<103> but was:<102>
Stack Trace:
junit.framework.AssertionFailedError: expected:<103> but was:<102>
at org.drools.eclipse.editors.completion.CompletionContextTest.testCheckLHSLocationDetermination_INSIDE_CONDITION_END4(CompletionContextTest.java:583)
at org.eclipse.test.EclipseTestRunner.run(EclipseTestRunner.java:354)
at org.eclipse.test.EclipseTestRunner.run(EclipseTestRunner.java:206)
at org.eclipse.test.UITestApplication$3.run(UITestApplication.java:195)
at org.eclipse.swt.widgets.RunnableLock.run(RunnableLock.java:35)
at org.eclipse.swt.widgets.Synchronizer.runAsyncMessages(Synchronizer.java:134)
at org.eclipse.swt.widgets.Display.runAsyncMessages(Display.java:3468)
at org.eclipse.swt.widgets.Display.readAndDispatch(Display.java:3115)
at org.eclipse.ui.internal.Workbench.runEventLoop(Workbench.java:2405)
at org.eclipse.ui.internal.Workbench.runUI(Workbench.java:2369)
at org.eclipse.ui.internal.Workbench.access$4(Workbench.java:2221)
at org.eclipse.ui.internal.Workbench$5.run(Workbench.java:500)
at org.eclipse.core.databinding.observable.Realm.runWithDefault(Realm.java:332)
at org.eclipse.ui.internal.Workbench.createAndRunWorkbench(Workbench.java:493)
at org.eclipse.ui.PlatformUI.createAndRunWorkbench(PlatformUI.java:149)
at org.eclipse.ui.internal.ide.application.IDEApplication.start(IDEApplication.java:113)
at org.eclipse.test.UITestApplication.runApplication(UITestApplication.java:138)
at org.eclipse.test.UITestApplication.run(UITestApplication.java:60)
at org.eclipse.test.UITestApplication.start(UITestApplication.java:210)
at org.eclipse.equinox.internal.app.EclipseAppHandle.run(EclipseAppHandle.java:194)
at org.eclipse.core.runtime.internal.adaptor.EclipseAppLauncher.runApplication(EclipseAppLauncher.java:110)
at org.eclipse.core.runtime.internal.adaptor.EclipseAppLauncher.start(EclipseAppLauncher.java:79)
at org.eclipse.core.runtime.adaptor.EclipseStarter.run(EclipseStarter.java:368)
at org.eclipse.core.runtime.adaptor.EclipseStarter.run(EclipseStarter.java:179)
at org.eclipse.equinox.launcher.Main.invokeFramework(Main.java:559)
at org.eclipse.equinox.launcher.Main.basicRun(Main.java:514)
at org.eclipse.equinox.launcher.Main.run(Main.java:1311)
at org.eclipse.equinox.launcher.Main.main(Main.java:1287)
at org.eclipse.core.launcher.Main.main(Main.java:34)
FAILED: AllTests
Error Message:
expected:<100> but was:<103>
Stack Trace:
junit.framework.AssertionFailedError: expected:<100> but was:<103>
at org.drools.eclipse.editors.completion.CompletionContextTest.testCheckLHSLocationDetermination_INSIDE_CONDITION_START14(CompletionContextTest.java:593)
at org.eclipse.test.EclipseTestRunner.run(EclipseTestRunner.java:354)
at org.eclipse.test.EclipseTestRunner.run(EclipseTestRunner.java:206)
at org.eclipse.test.UITestApplication$3.run(UITestApplication.java:195)
at org.eclipse.swt.widgets.RunnableLock.run(RunnableLock.java:35)
at org.eclipse.swt.widgets.Synchronizer.runAsyncMessages(Synchronizer.java:134)
at org.eclipse.swt.widgets.Display.runAsyncMessages(Display.java:3468)
at org.eclipse.swt.widgets.Display.readAndDispatch(Display.java:3115)
at org.eclipse.ui.internal.Workbench.runEventLoop(Workbench.java:2405)
at org.eclipse.ui.internal.Workbench.runUI(Workbench.java:2369)
at org.eclipse.ui.internal.Workbench.access$4(Workbench.java:2221)
at org.eclipse.ui.internal.Workbench$5.run(Workbench.java:500)
at org.eclipse.core.databinding.observable.Realm.runWithDefault(Realm.java:332)
at org.eclipse.ui.internal.Workbench.createAndRunWorkbench(Workbench.java:493)
at org.eclipse.ui.PlatformUI.createAndRunWorkbench(PlatformUI.java:149)
at org.eclipse.ui.internal.ide.application.IDEApplication.start(IDEApplication.java:113)
at org.eclipse.test.UITestApplication.runApplication(UITestApplication.java:138)
at org.eclipse.test.UITestApplication.run(UITestApplication.java:60)
at org.eclipse.test.UITestApplication.start(UITestApplication.java:210)
at org.eclipse.equinox.internal.app.EclipseAppHandle.run(EclipseAppHandle.java:194)
at org.eclipse.core.runtime.internal.adaptor.EclipseAppLauncher.runApplication(EclipseAppLauncher.java:110)
at org.eclipse.core.runtime.internal.adaptor.EclipseAppLauncher.start(EclipseAppLauncher.java:79)
at org.eclipse.core.runtime.adaptor.EclipseStarter.run(EclipseStarter.java:368)
at org.eclipse.core.runtime.adaptor.EclipseStarter.run(EclipseStarter.java:179)
at org.eclipse.equinox.launcher.Main.invokeFramework(Main.java:559)
at org.eclipse.equinox.launcher.Main.basicRun(Main.java:514)
at org.eclipse.equinox.launcher.Main.run(Main.java:1311)
at org.eclipse.equinox.launcher.Main.main(Main.java:1287)
at org.eclipse.core.launcher.Main.main(Main.java:34)
FAILED: SeamCoreAllTests
Error Message:
Problem marker was found in varAttributes.xhtml file. Validator did not recognize 'var' attribute. expected:<0> but was:<1>
Stack Trace:
junit.framework.AssertionFailedError: Problem marker was found in varAttributes.xhtml file. Validator did not recognize 'var' attribute. expected:<0> but was:<1>
at org.jboss.tools.seam.core.test.SeamValidatorsTest.testVarAttributes(SeamValidatorsTest.java:103)
at junit.extensions.TestDecorator.basicRun(TestDecorator.java:24)
at junit.extensions.TestSetup$1.protect(TestSetup.java:21)
at junit.extensions.TestSetup.run(TestSetup.java:25)
at org.eclipse.test.EclipseTestRunner.run(EclipseTestRunner.java:354)
at org.eclipse.test.EclipseTestRunner.run(EclipseTestRunner.java:206)
at org.eclipse.test.UITestApplication$3.run(UITestApplication.java:195)
at org.eclipse.swt.widgets.RunnableLock.run(RunnableLock.java:35)
at org.eclipse.swt.widgets.Synchronizer.runAsyncMessages(Synchronizer.java:134)
at org.eclipse.swt.widgets.Display.runAsyncMessages(Display.java:3468)
at org.eclipse.swt.widgets.Display.readAndDispatch(Display.java:3115)
at org.eclipse.ui.internal.Workbench.runEventLoop(Workbench.java:2405)
at org.eclipse.ui.internal.Workbench.runUI(Workbench.java:2369)
at org.eclipse.ui.internal.Workbench.access$4(Workbench.java:2221)
at org.eclipse.ui.internal.Workbench$5.run(Workbench.java:500)
at org.eclipse.core.databinding.observable.Realm.runWithDefault(Realm.java:332)
at org.eclipse.ui.internal.Workbench.createAndRunWorkbench(Workbench.java:493)
at org.eclipse.ui.PlatformUI.createAndRunWorkbench(PlatformUI.java:149)
at org.eclipse.ui.internal.ide.application.IDEApplication.start(IDEApplication.java:113)
at org.eclipse.test.UITestApplication.runApplication(UITestApplication.java:138)
at org.eclipse.test.UITestApplication.run(UITestApplication.java:60)
at org.eclipse.test.UITestApplication.start(UITestApplication.java:210)
at org.eclipse.equinox.internal.app.EclipseAppHandle.run(EclipseAppHandle.java:194)
at org.eclipse.core.runtime.internal.adaptor.EclipseAppLauncher.runApplication(EclipseAppLauncher.java:110)
at org.eclipse.core.runtime.internal.adaptor.EclipseAppLauncher.start(EclipseAppLauncher.java:79)
at org.eclipse.core.runtime.adaptor.EclipseStarter.run(EclipseStarter.java:368)
at org.eclipse.core.runtime.adaptor.EclipseStarter.run(EclipseStarter.java:179)
at org.eclipse.equinox.launcher.Main.invokeFramework(Main.java:559)
at org.eclipse.equinox.launcher.Main.basicRun(Main.java:514)
at org.eclipse.equinox.launcher.Main.run(Main.java:1311)
at org.eclipse.equinox.launcher.Main.main(Main.java:1287)
at org.eclipse.core.launcher.Main.main(Main.java:34)
FAILED: SeamCoreAllTests
Error Message:
Problem marker was found in abcComponent.xhtml expected:<0> but was:<1>
Stack Trace:
junit.framework.AssertionFailedError: Problem marker was found in abcComponent.xhtml expected:<0> but was:<1>
at org.jboss.tools.seam.core.test.SeamValidatorsTest.testExpressionLanguageValidator(SeamValidatorsTest.java:702)
at junit.extensions.TestDecorator.basicRun(TestDecorator.java:24)
at junit.extensions.TestSetup$1.protect(TestSetup.java:21)
at junit.extensions.TestSetup.run(TestSetup.java:25)
at org.eclipse.test.EclipseTestRunner.run(EclipseTestRunner.java:354)
at org.eclipse.test.EclipseTestRunner.run(EclipseTestRunner.java:206)
at org.eclipse.test.UITestApplication$3.run(UITestApplication.java:195)
at org.eclipse.swt.widgets.RunnableLock.run(RunnableLock.java:35)
at org.eclipse.swt.widgets.Synchronizer.runAsyncMessages(Synchronizer.java:134)
at org.eclipse.swt.widgets.Display.runAsyncMessages(Display.java:3468)
at org.eclipse.swt.widgets.Display.readAndDispatch(Display.java:3115)
at org.eclipse.ui.internal.Workbench.runEventLoop(Workbench.java:2405)
at org.eclipse.ui.internal.Workbench.runUI(Workbench.java:2369)
at org.eclipse.ui.internal.Workbench.access$4(Workbench.java:2221)
at org.eclipse.ui.internal.Workbench$5.run(Workbench.java:500)
at org.eclipse.core.databinding.observable.Realm.runWithDefault(Realm.java:332)
at org.eclipse.ui.internal.Workbench.createAndRunWorkbench(Workbench.java:493)
at org.eclipse.ui.PlatformUI.createAndRunWorkbench(PlatformUI.java:149)
at org.eclipse.ui.internal.ide.application.IDEApplication.start(IDEApplication.java:113)
at org.eclipse.test.UITestApplication.runApplication(UITestApplication.java:138)
at org.eclipse.test.UITestApplication.run(UITestApplication.java:60)
at org.eclipse.test.UITestApplication.start(UITestApplication.java:210)
at org.eclipse.equinox.internal.app.EclipseAppHandle.run(EclipseAppHandle.java:194)
at org.eclipse.core.runtime.internal.adaptor.EclipseAppLauncher.runApplication(EclipseAppLauncher.java:110)
at org.eclipse.core.runtime.internal.adaptor.EclipseAppLauncher.start(EclipseAppLauncher.java:79)
at org.eclipse.core.runtime.adaptor.EclipseStarter.run(EclipseStarter.java:368)
at org.eclipse.core.runtime.adaptor.EclipseStarter.run(EclipseStarter.java:179)
at org.eclipse.equinox.launcher.Main.invokeFramework(Main.java:559)
at org.eclipse.equinox.launcher.Main.basicRun(Main.java:514)
at org.eclipse.equinox.launcher.Main.run(Main.java:1311)
at org.eclipse.equinox.launcher.Main.main(Main.java:1287)
at org.eclipse.core.launcher.Main.main(Main.java:34)
FAILED: SeamCoreAllTests
Error Message:
Problem marker has wrong line number expected:<8> but was:<9>
Stack Trace:
junit.framework.AssertionFailedError: Problem marker has wrong line number expected:<8> but was:<9>
at org.jboss.tools.seam.core.test.SeamValidatorsTest.testDuplicateComponents(SeamValidatorsTest.java:850)
at junit.extensions.TestDecorator.basicRun(TestDecorator.java:24)
at junit.extensions.TestSetup$1.protect(TestSetup.java:21)
at junit.extensions.TestSetup.run(TestSetup.java:25)
at org.eclipse.test.EclipseTestRunner.run(EclipseTestRunner.java:354)
at org.eclipse.test.EclipseTestRunner.run(EclipseTestRunner.java:206)
at org.eclipse.test.UITestApplication$3.run(UITestApplication.java:195)
at org.eclipse.swt.widgets.RunnableLock.run(RunnableLock.java:35)
at org.eclipse.swt.widgets.Synchronizer.runAsyncMessages(Synchronizer.java:134)
at org.eclipse.swt.widgets.Display.runAsyncMessages(Display.java:3468)
at org.eclipse.swt.widgets.Display.readAndDispatch(Display.java:3115)
at org.eclipse.ui.internal.Workbench.runEventLoop(Workbench.java:2405)
at org.eclipse.ui.internal.Workbench.runUI(Workbench.java:2369)
at org.eclipse.ui.internal.Workbench.access$4(Workbench.java:2221)
at org.eclipse.ui.internal.Workbench$5.run(Workbench.java:500)
at org.eclipse.core.databinding.observable.Realm.runWithDefault(Realm.java:332)
at org.eclipse.ui.internal.Workbench.createAndRunWorkbench(Workbench.java:493)
at org.eclipse.ui.PlatformUI.createAndRunWorkbench(PlatformUI.java:149)
at org.eclipse.ui.internal.ide.application.IDEApplication.start(IDEApplication.java:113)
at org.eclipse.test.UITestApplication.runApplication(UITestApplication.java:138)
at org.eclipse.test.UITestApplication.run(UITestApplication.java:60)
at org.eclipse.test.UITestApplication.start(UITestApplication.java:210)
at org.eclipse.equinox.internal.app.EclipseAppHandle.run(EclipseAppHandle.java:194)
at org.eclipse.core.runtime.internal.adaptor.EclipseAppLauncher.runApplication(EclipseAppLauncher.java:110)
at org.eclipse.core.runtime.internal.adaptor.EclipseAppLauncher.start(EclipseAppLauncher.java:79)
at org.eclipse.core.runtime.adaptor.EclipseStarter.run(EclipseStarter.java:368)
at org.eclipse.core.runtime.adaptor.EclipseStarter.run(EclipseStarter.java:179)
at org.eclipse.equinox.launcher.Main.invokeFramework(Main.java:559)
at org.eclipse.equinox.launcher.Main.basicRun(Main.java:514)
at org.eclipse.equinox.launcher.Main.run(Main.java:1311)
at org.eclipse.equinox.launcher.Main.main(Main.java:1287)
at org.eclipse.core.launcher.Main.main(Main.java:34)
--------------------------------------------------
Changes:
[nickboldt] [JBDS-729] ensure Mac versions of eclipse.ini are expanded too
--------------------------------------------------
Console log:
[...truncated 43033 lines...]
[jar] Building jar: /home/hudson/hudson_workspace/workspace/devstudio-nightly-3.0.0.M1/jbds-build/site/eclipse/plugins/org.jboss.tools.vpe.docbook_3.1.0.M1-N200906091651-H237.jar
[jar] Building jar: /home/hudson/hudson_workspace/workspace/devstudio-nightly-3.0.0.M1/jbds-build/site/eclipse/plugins/org.jboss.tools.vpe.html_3.1.0.M1-N200906091651-H237.jar
[jar] Building jar: /home/hudson/hudson_workspace/workspace/devstudio-nightly-3.0.0.M1/jbds-build/site/eclipse/plugins/org.jboss.tools.vpe.jsp_3.1.0.M1-N200906091651-H237.jar
[jar] Building jar: /home/hudson/hudson_workspace/workspace/devstudio-nightly-3.0.0.M1/jbds-build/site/eclipse/plugins/org.jboss.tools.vpe.ui.palette_3.1.0.M1-N200906091651-H237.jar
[jar] Building jar: /home/hudson/hudson_workspace/workspace/devstudio-nightly-3.0.0.M1/jbds-build/site/eclipse/plugins/org.jboss.tools.vpe_3.1.0.M1-N200906091651-H237.jar
[jar] Building jar: /home/hudson/hudson_workspace/workspace/devstudio-nightly-3.0.0.M1/jbds-build/site/eclipse/plugins/org.jboss.tools.xulrunner_1.0.0.GA-N200906091651-H237.jar
[jar] Building jar: /home/hudson/hudson_workspace/workspace/devstudio-nightly-3.0.0.M1/jbds-build/site/eclipse/plugins/org.mozilla.xpcom_1.8.1.3-20070904.jar
[jar] Building jar: /home/hudson/hudson_workspace/workspace/devstudio-nightly-3.0.0.M1/jbds-build/site/eclipse/plugins/org.mozilla.xulrunner.carbon.macosx_1.8.1.3-20070904.jar
[jar] Building jar: /home/hudson/hudson_workspace/workspace/devstudio-nightly-3.0.0.M1/jbds-build/site/eclipse/plugins/org.mozilla.xulrunner.gtk.linux.x86_1.8.1.3-20070904.jar
[jar] Building jar: /home/hudson/hudson_workspace/workspace/devstudio-nightly-3.0.0.M1/jbds-build/site/eclipse/plugins/org.mozilla.xulrunner.gtk.linux.x86_64_1.8.1.4-20080112.jar
[jar] Building jar: /home/hudson/hudson_workspace/workspace/devstudio-nightly-3.0.0.M1/jbds-build/site/eclipse/plugins/org.mozilla.xulrunner.win32.win32.x86_1.8.1.3-20070904.jar
load.properties:
[echo] Getting version for 'jmx' builder to property 'jmx.versionTag' from /qa/services/hudson/hudson_workspace/workspace/devstudio-nightly-3.0.0.M1/org.jboss.ide.eclipse.releng/builders/product/versionTags/jbds/3.0.0.M1.tags
[echo]
[echo] jbds-jmx-filename=JMX-1.1.0.M1-N200906091651-H237.zip
[echo] jbds-jmx-nodeps-filename=JMX-nodeps-1.1.0.M1-N200906091651-H237.zip
[echo]
[echo] Getting version for 'drools-ide' builder to property 'drools-ide.versionTag' from /qa/services/hudson/hudson_workspace/workspace/devstudio-nightly-3.0.0.M1/org.jboss.ide.eclipse.releng/builders/product/versionTags/jbds/3.0.0.M1.tags
[echo]
[echo] jbds-drools-ide-filename=DroolsIDE-5.1.0.trunk-N200906091651-H237.zip
[echo] jbds-drools-ide-nodeps-filename=DroolsIDE-nodeps-5.1.0.trunk-N200906091651-H237.zip
[echo]
[echo] Getting version for 'archives' builder to property 'archives.versionTag' from /qa/services/hudson/hudson_workspace/workspace/devstudio-nightly-3.0.0.M1/org.jboss.ide.eclipse.releng/builders/product/versionTags/jbds/3.0.0.M1.tags
[echo]
[echo] jbds-archives-filename=JBossTools-Archives-3.1.0.M1-N200906091651-H237.zip
[echo] jbds-archives-nodeps-filename=JBossTools-Archives-nodeps-3.1.0.M1-N200906091651-H237.zip
[echo]
[echo] Getting version for 'xulrunner' builder to property 'xulrunner.versionTag' from /qa/services/hudson/hudson_workspace/workspace/devstudio-nightly-3.0.0.M1/org.jboss.ide.eclipse.releng/builders/product/versionTags/jbds/3.0.0.M1.tags
[echo]
[echo] jbds-xulrunner-win32-filename=XulRunner-win32-1.0.0.GA-N200906091651-H237.zip
[echo] jbds-xulrunner-win32-nodeps-filename=XulRunner-win32-nodeps-1.0.0.GA-N200906091651-H237.zip
[echo]
[echo] Getting version for 'xulrunner' builder to property 'xulrunner.versionTag' from /qa/services/hudson/hudson_workspace/workspace/devstudio-nightly-3.0.0.M1/org.jboss.ide.eclipse.releng/builders/product/versionTags/jbds/3.0.0.M1.tags
[echo]
[echo] jbds-xulrunner-linux-gtk-filename=XulRunner-linux-gtk-1.0.0.GA-N200906091651-H237.zip
[echo] jbds-xulrunner-linux-gtk-nodeps-filename=XulRunner-linux-gtk-nodeps-1.0.0.GA-N200906091651-H237.zip
[echo]
[echo] Getting version for 'richfaces' builder to property 'richfaces.versionTag' from /qa/services/hudson/hudson_workspace/workspace/devstudio-nightly-3.0.0.M1/org.jboss.ide.eclipse.releng/builders/product/versionTags/jbds/3.0.0.M1.tags
[echo]
[echo] jbds-richfaces-win32-filename=RichFaces-VPE-win32-3.1.0.M1-N200906091651-H237.zip
[echo] jbds-richfaces-win32-nodeps-filename=RichFaces-VPE-win32-nodeps-3.1.0.M1-N200906091651-H237.zip
[echo]
[echo] Getting version for 'richfaces' builder to property 'richfaces.versionTag' from /qa/services/hudson/hudson_workspace/workspace/devstudio-nightly-3.0.0.M1/org.jboss.ide.eclipse.releng/builders/product/versionTags/jbds/3.0.0.M1.tags
[echo]
[echo] jbds-richfaces-linux-gtk-filename=RichFaces-VPE-linux-gtk-3.1.0.M1-N200906091651-H237.zip
[echo] jbds-richfaces-linux-gtk-nodeps-filename=RichFaces-VPE-linux-gtk-nodeps-3.1.0.M1-N200906091651-H237.zip
[echo]
[echo] Getting version for 'jbpm-convert' builder to property 'jbpm-convert.versionTag' from /qa/services/hudson/hudson_workspace/workspace/devstudio-nightly-3.0.0.M1/org.jboss.ide.eclipse.releng/builders/product/versionTags/jbds/3.0.0.M1.tags
[echo]
[echo] jbds-jbpm-convert-filename=jBPM-Convert-1.1.0.M1-N200906091651-H237.zip
[echo] jbds-jbpm-convert-nodeps-filename=jBPM-Convert-nodeps-1.1.0.M1-N200906091651-H237.zip
[echo]
[echo] Getting version for 'freemarker' builder to property 'freemarker.versionTag' from /qa/services/hudson/hudson_workspace/workspace/devstudio-nightly-3.0.0.M1/org.jboss.ide.eclipse.releng/builders/product/versionTags/jbds/3.0.0.M1.tags
[length] /home/hudson/hudson_workspace/workspace/devstudio-nightly-3.0.0.M1/jbds-build/3.0.0.M1/200906091651/freemarker is a directory; length unspecified
[echo]
[echo] jbds-freemarker-filename=FreeMarkerIDE-1.1.0.M1-N200906091651-H237.zip
[echo] jbds-freemarker-nodeps-filename=
[echo]
[echo] Getting version for 'hibernate-tools' builder to property 'hibernate-tools.versionTag' from /qa/services/hudson/hudson_workspace/workspace/devstudio-nightly-3.0.0.M1/org.jboss.ide.eclipse.releng/builders/product/versionTags/jbds/3.0.0.M1.tags
[echo]
[echo] jbds-hibernate-tools-filename=HibernateTools-3.3.0.M1-N200906091651-H237.zip
[echo] jbds-hibernate-tools-nodeps-filename=HibernateTools-nodeps-3.3.0.M1-N200906091651-H237.zip
[echo]
[echo] Getting version for 'struts' builder to property 'struts.versionTag' from /qa/services/hudson/hudson_workspace/workspace/devstudio-nightly-3.0.0.M1/org.jboss.ide.eclipse.releng/builders/product/versionTags/jbds/3.0.0.M1.tags
[echo]
[echo] jbds-struts-filename=StrutsTools-3.1.0.M1-N200906091651-H237.zip
[echo] jbds-struts-nodeps-filename=StrutsTools-nodeps-3.1.0.M1-N200906091651-H237.zip
[echo]
[echo] Getting version for 'jbpm' builder to property 'jbpm.versionTag' from /qa/services/hudson/hudson_workspace/workspace/devstudio-nightly-3.0.0.M1/org.jboss.ide.eclipse.releng/builders/product/versionTags/jbds/3.0.0.M1.tags
[echo]
[echo] jbds-jbpm-filename=jBPM-Designer-3.1.7.GA-N200906091651-H237.zip
[echo] jbds-jbpm-nodeps-filename=jBPM-Designer-nodeps-3.1.7.GA-N200906091651-H237.zip
[echo]
[echo] Getting version for 'as' builder to property 'as.versionTag' from /qa/services/hudson/hudson_workspace/workspace/devstudio-nightly-3.0.0.M1/org.jboss.ide.eclipse.releng/builders/product/versionTags/jbds/3.0.0.M1.tags
[echo]
[echo] jbds-as-filename=JBossAS-Tools-2.1.0.M1-N200906091651-H237.zip
[echo] jbds-as-nodeps-filename=JBossAS-Tools-nodeps-2.1.0.M1-N200906091651-H237.zip
[echo]
[echo] Getting version for 'seam' builder to property 'seam.versionTag' from /qa/services/hudson/hudson_workspace/workspace/devstudio-nightly-3.0.0.M1/org.jboss.ide.eclipse.releng/builders/product/versionTags/jbds/3.0.0.M1.tags
[echo]
[echo] jbds-seam-filename=SeamTools-3.1.0.M1-N200906091651-H237.zip
[echo] jbds-seam-nodeps-filename=SeamTools-nodeps-3.1.0.M1-N200906091651-H237.zip
[echo]
[echo] Getting version for 'examples' builder to property 'examples.versionTag' from /qa/services/hudson/hudson_workspace/workspace/devstudio-nightly-3.0.0.M1/org.jboss.ide.eclipse.releng/builders/product/versionTags/jbds/3.0.0.M1.tags
[echo]
[echo] jbds-examples-filename=JBossTools-Examples-1.1.0.M1-N200906091651-H237.zip
[echo] jbds-examples-nodeps-filename=JBossTools-Examples-nodeps-1.1.0.M1-N200906091651-H237.zip
[echo]
[echo] Getting version for 'esb' builder to property 'esb.versionTag' from /qa/services/hudson/hudson_workspace/workspace/devstudio-nightly-3.0.0.M1/org.jboss.ide.eclipse.releng/builders/product/versionTags/jbds/3.0.0.M1.tags
[echo]
[echo] jbds-esb-filename=JBossTools-ESB-1.3.0.M1-N200906091651-H237.zip
[echo] jbds-esb-nodeps-filename=JBossTools-ESB-nodeps-1.3.0.M1-N200906091651-H237.zip
[echo]
[echo] Getting version for 'ws' builder to property 'ws.versionTag' from /qa/services/hudson/hudson_workspace/workspace/devstudio-nightly-3.0.0.M1/org.jboss.ide.eclipse.releng/builders/product/versionTags/jbds/3.0.0.M1.tags
[echo]
[echo] jbds-ws-filename=JBossWS-Tools-1.1.0.M1-N200906091651-H237.zip
[echo] jbds-ws-nodeps-filename=JBossWS-Tools-nodeps-1.1.0.M1-N200906091651-H237.zip
[echo]
[echo] Getting version for 'birt' builder to property 'birt.versionTag' from /qa/services/hudson/hudson_workspace/workspace/devstudio-nightly-3.0.0.M1/org.jboss.ide.eclipse.releng/builders/product/versionTags/jbds/3.0.0.M1.tags
[echo]
[echo] jbds-birt-filename=JBossTools-BIRT-1.1.0.M1-N200906091651-H237.zip
[echo] jbds-birt-nodeps-filename=JBossTools-BIRT-nodeps-1.1.0.M1-N200906091651-H237.zip
[echo]
[echo] Getting version for 'portlet' builder to property 'portlet.versionTag' from /qa/services/hudson/hudson_workspace/workspace/devstudio-nightly-3.0.0.M1/org.jboss.ide.eclipse.releng/builders/product/versionTags/jbds/3.0.0.M1.tags
[echo]
[echo] jbds-portlet-filename=JBoss-Portlet-Tools-1.1.0.M1-N200906091651-H237.zip
[echo] jbds-portlet-nodeps-filename=JBoss-Portlet-Tools-nodeps-1.1.0.M1-N200906091651-H237.zip
[echo]
[echo] Getting version for 'tptp' builder to property 'tptp.versionTag' from /qa/services/hudson/hudson_workspace/workspace/devstudio-nightly-3.0.0.M1/org.jboss.ide.eclipse.releng/builders/product/versionTags/jbds/3.0.0.M1.tags
[echo]
[echo] jbds-tptp-filename=JBoss-TPTP-Tools-1.1.0.M1-N200906091651-H237.zip
[echo] jbds-tptp-nodeps-filename=JBoss-TPTP-Tools-nodeps-1.1.0.M1-N200906091651-H237.zip
[echo]
[echo] Getting version for 'runtime' builder to property 'runtime.versionTag' from /qa/services/hudson/hudson_workspace/workspace/devstudio-nightly-3.0.0.M1/org.jboss.ide.eclipse.releng/builders/product/versionTags/jbds/3.0.0.M1.tags
[echo]
[echo] jbds-runtime-filename=JBossTools-Runtime-1.1.0.M1-N200906091651-H237.zip
[echo] jbds-runtime-nodeps-filename=JBossTools-Runtime-nodeps-1.1.0.M1-N200906091651-H237.zip
[echo]
pack200:
[echo] Using /qa/tools/opt/jdk1.5.0_15/jre/bin/pack200 to pack update site jars...
[mkdir] Created dir: /qa/services/hudson/hudson_workspace/workspace/devstudio-nightly-3.0.0.M1/org.jboss.ide.eclipse.releng/builders/product/updateSite/updateSitePackTmp/output
[mkdir] Created dir: /qa/services/hudson/hudson_workspace/workspace/devstudio-nightly-3.0.0.M1/org.jboss.ide.eclipse.releng/builders/product/updateSite/updateSitePackTmp/input
[echo] Zip update jars in /home/hudson/hudson_workspace/workspace/devstudio-nightly-3.0.0.M1/jbds-build/site to temporary Master zip (to avoid packing nested jars) ...
[zip] Building zip: /qa/services/hudson/hudson_workspace/workspace/devstudio-nightly-3.0.0.M1/org.jboss.ide.eclipse.releng/builders/product/updateSite/updateSitePackTmp/input/Master.zip
[exec] 6.8M updateSite/updateSitePackTmp/input/Master.zip
[echo] Pack jars ...
[echo] Run jarprocessor.pack200 using launcherjar = /home/hudson/hudson_workspace/workspace/devstudio-nightly-3.0.0.M1/jbds-build/clean-eclipse/eclipse/plugins/org.eclipse.equinox.launcher_1.0.200.v20090520.jar
[exec] 164M updateSite/updateSitePackTmp/output/Master.zip
[unzip] Expanding: /qa/services/hudson/hudson_workspace/workspace/devstudio-nightly-3.0.0.M1/org.jboss.ide.eclipse.releng/builders/product/updateSite/updateSitePackTmp/output/Master.zip into /home/hudson/hudson_workspace/workspace/devstudio-nightly-3.0.0.M1/jbds-build/site
[delete] Deleting directory /qa/services/hudson/hudson_workspace/workspace/devstudio-nightly-3.0.0.M1/org.jboss.ide.eclipse.releng/builders/product/updateSite/updateSitePackTmp
copy.site.rootfiles:
[echo] Build development jbds update site...
[copy] Copying 4 files to /home/hudson/hudson_workspace/workspace/devstudio-nightly-3.0.0.M1/jbds-build/site/eclipse
p2:
[echo] Run p2 metadata generator using launcherjar = /home/hudson/hudson_workspace/workspace/devstudio-nightly-3.0.0.M1/jbds-build/clean-eclipse/eclipse/plugins/org.eclipse.equinox.launcher_1.0.200.v20090520.jar
[p2] Generating metadata for /home/hudson/hudson_workspace/workspace/devstudio-nightly-3.0.0.M1/jbds-build/site/eclipse.
[p2] Generation completed with success [12 seconds].
build.metadata:
publish.site:
post-build:
publish.results:
send.notification.email:
[mail] Failed to initialise MIME mail: javax/mail/MessagingException
publish.log:
init:
clean.all.subfolders:
BUILD SUCCESSFUL
Total time: 234 minutes 11 seconds
+ cd ../configs/jbds
+ zip build.log.zip build.log
updating: build.log (deflated 96%)
+ cd ../..
++ date +%s
+ endtime=1244595135
++ echo 'scale=2; (1244595135 - 1244581019)/60'
++ bc -l
+ elapsed=235.26
+ echo 'Elapsed time: 235.26mins.'
Elapsed time: 235.26mins.
+ [[ '' == \l\o\c\a\l ]]
++ cat /home/hudson/hudson_workspace/workspace/devstudio-nightly-3.0.0.M1/jbds-build/buildData.properties
++ grep product.releaseNumber
++ perl -ne 's/[\s\t]+product.releaseNumber=//g;print;'
+ version=3.0.0.M1
++ cat /home/hudson/hudson_workspace/workspace/devstudio-nightly-3.0.0.M1/jbds-build/buildData.properties
++ grep upload.to
++ perl -ne 's/[\s\t]+upload.to=//g;print;'
+ builddir=nightly/3.0.0.M1/200906091651
++ grep product.buildDesc
++ perl -ne 's/[\s\t]+product.buildDesc=//g; print;'
++ cat /home/hudson/hudson_workspace/workspace/devstudio-nightly-3.0.0.M1/jbds-build/buildData.properties
+ buildtype=nightly
++ cat /home/hudson/hudson_workspace/workspace/devstudio-nightly-3.0.0.M1/jbds-build/buildData.properties
++ grep product.releaseNumber
++ perl -ne 's/[\s\t]+product.releaseNumber=//g; print;'
+ releaseNumber=3.0.0.M1
+ DESTINATION=/qa/services/http/binaries/RHDS
+ scp -r /home/hudson/hudson_workspace/workspace/devstudio-nightly-3.0.0.M1/jbds-build/3.0.0.M1 /qa/services/http/binaries/RHDS/nightly/
+ scp configs/jbds/build.log.zip /qa/services/http/binaries/RHDS/nightly/3.0.0.M1/200906091651/
+ scp /home/hudson/hudson_workspace/workspace/devstudio-nightly-3.0.0.M1/jbds-build/latestBuild.html /qa/services/http/binaries/RHDS/nightly/
++ date +%s
+ endtime=1244595754
++ echo 'scale=2; (1244595754 - 1244581019)/60'
++ bc -l
+ elapsed=245.58
+ echo 'Elapsed time: 245.58mins.'
Elapsed time: 245.58mins.
+ [[ -d /home/hudson/hudson_workspace/workspace/devstudio-nightly-3.0.0.M1/jbds-build/site/eclipse ]]
+ mkdir -p /home/hudson/hudson_workspace/workspace/devstudio-nightly-3.0.0.M1/jbds-build/site/nightly/trunk
+ mv /home/hudson/hudson_workspace/workspace/devstudio-nightly-3.0.0.M1/jbds-build/site/eclipse/artifacts.jar /home/hudson/hudson_workspace/workspace/devstudio-nightly-3.0.0.M1/jbds-build/site/eclipse/associateSites.xml /home/hudson/hudson_workspace/workspace/devstudio-nightly-3.0.0.M1/jbds-build/site/eclipse/content.jar /home/hudson/hudson_workspace/workspace/devstudio-nightly-3.0.0.M1/jbds-build/site/eclipse/features /home/hudson/hudson_workspace/workspace/devstudio-nightly-3.0.0.M1/jbds-build/site/eclipse/index.html /home/hudson/hudson_workspace/workspace/devstudio-nightly-3.0.0.M1/jbds-build/site/eclipse/plugins /home/hudson/hudson_workspace/workspace/devstudio-nightly-3.0.0.M1/jbds-build/site/eclipse/site.xml /home/hudson/hudson_workspace/workspace/devstudio-nightly-3.0.0.M1/jbds-build/site/eclipse/web /home/hudson/hudson_workspace/workspace/devstudio-nightly-3.0.0.M1/jbds-build/site/nightly/trunk
++ find /home/hudson/hudson_workspace/workspace/devstudio-nightly-3.0.0.M1/jbds-build/site/nightly/trunk/features -name '*.jar'
+ [[ -n /home/hudson/hudson_workspace/workspace/devstudio-nightly-3.0.0.M1/jbds-build/site/nightly/trunk/features/org.jboss.tools.richfaces.feature_3.1.0.M1-N200906091651-H237.jar
/home/hudson/hudson_workspace/workspace/devstudio-nightly-3.0.0.M1/jbds-build/site/nightly/trunk/features/org.jboss.tools.seam.feature_3.1.0.M1-N200906091651-H237.jar
/home/hudson/hudson_workspace/workspace/devstudio-nightly-3.0.0.M1/jbds-build/site/nightly/trunk/features/org.jboss.tools.ws.feature_1.1.0.M1-N200906091651-H237.jar
/home/hudson/hudson_workspace/workspace/devstudio-nightly-3.0.0.M1/jbds-build/site/nightly/trunk/features/org.hibernate.eclipse.feature_3.3.0.M1-N200906091651-H237.jar
/home/hudson/hudson_workspace/workspace/devstudio-nightly-3.0.0.M1/jbds-build/site/nightly/trunk/features/org.jboss.tools.runtime.feature_1.1.0.M1-N200906091651-H237.jar
/home/hudson/hudson_workspace/workspace/devstudio-nightly-3.0.0.M1/jbds-build/site/nightly/trunk/features/org.jboss.tools.struts_feature_3.1.0.M1-N200906091651-H237.jar
/home/hudson/hudson_workspace/workspace/devstudio-nightly-3.0.0.M1/jbds-build/site/nightly/trunk/features/org.drools.eclipse.feature_5.1.0.trunk-N200906091651-H237.jar
/home/hudson/hudson_workspace/workspace/devstudio-nightly-3.0.0.M1/jbds-build/site/nightly/trunk/features/org.jbpm.gd.jpdl.feature_3.1.7.GA-N200906091651-H237.jar
/home/hudson/hudson_workspace/workspace/devstudio-nightly-3.0.0.M1/jbds-build/site/nightly/trunk/features/org.jboss.ide.eclipse.as.feature_2.1.0.M1-N200906091651-H237.jar
/home/hudson/hudson_workspace/workspace/devstudio-nightly-3.0.0.M1/jbds-build/site/nightly/trunk/features/org.jboss.tools.birt.feature_1.1.0.M1-N200906091651-H237.jar
/home/hudson/hudson_workspace/workspace/devstudio-nightly-3.0.0.M1/jbds-build/site/nightly/trunk/features/org.jboss.tools.jmx.feature_1.1.0.M1-N200906091651-H237.jar
/home/hudson/hudson_workspace/workspace/devstudio-nightly-3.0.0.M1/jbds-build/site/nightly/trunk/features/org.jboss.tools.portlet.feature_1.1.0.M1-N200906091651-H237.jar
/home/hudson/hudson_workspace/workspace/devstudio-nightly-3.0.0.M1/jbds-build/site/nightly/trunk/features/org.jboss.tools.tptp.feature_1.1.0.M1-N200906091651-H237.jar
/home/hudson/hudson_workspace/workspace/devstudio-nightly-3.0.0.M1/jbds-build/site/nightly/trunk/features/org.jboss.tools.esb.feature_1.3.0.M1-N200906091651-H237.jar
/home/hudson/hudson_workspace/workspace/devstudio-nightly-3.0.0.M1/jbds-build/site/nightly/trunk/features/org.jboss.tools.xulrunner.feature_1.8.1.3-20070904.jar
/home/hudson/hudson_workspace/workspace/devstudio-nightly-3.0.0.M1/jbds-build/site/nightly/trunk/features/org.jboss.tools.jbpm.convert.feature_1.1.0.M1-N200906091651-H237.jar
/home/hudson/hudson_workspace/workspace/devstudio-nightly-3.0.0.M1/jbds-build/site/nightly/trunk/features/org.guvnor.tools.feature_5.1.0.trunk-N200906091651-H237.jar
/home/hudson/hudson_workspace/workspace/devstudio-nightly-3.0.0.M1/jbds-build/site/nightly/trunk/features/com.jboss.jbds.product.feature_3.1.0.M1-N200906091651-H237.jar
/home/hudson/hudson_workspace/workspace/devstudio-nightly-3.0.0.M1/jbds-build/site/nightly/trunk/features/org.drools.eclipse.task.feature_5.1.0.trunk-N200906091651-H237.jar
/home/hudson/hudson_workspace/workspace/devstudio-nightly-3.0.0.M1/jbds-build/site/nightly/trunk/features/org.jboss.ide.eclipse.archives.feature_3.1.0.M1-N200906091651-H237.jar
/home/hudson/hudson_workspace/workspace/devstudio-nightly-3.0.0.M1/jbds-build/site/nightly/trunk/features/org.jboss.ide.eclipse.freemarker.feature_1.1.0.M1-N200906091651-H237.jar
/home/hudson/hudson_workspace/workspace/devstudio-nightly-3.0.0.M1/jbds-build/site/nightly/trunk/features/org.jboss.tools.project.examples.feature_1.1.0.M1-N200906091651-H237.jar ]]
+ mkdir -p /qa/services/http/binaries/RHDS/updates/nightly/
+ rsync -arz --delete /home/hudson/hudson_workspace/workspace/devstudio-nightly-3.0.0.M1/jbds-build/site/nightly/trunk /qa/services/http/binaries/RHDS/updates/nightly/
++ date +%s
+ endtime=1244595787
++ echo 'scale=2; (1244595787 - 1244581019)/60'
++ bc -l
+ elapsed=246.13
+ echo 'Elapsed time: 246.13mins.'
Elapsed time: 246.13mins.
Terminating xvnc
[devstudio-nightly-3.0.0.M1] $ vncserver -kill :11
Killing Xvnc process ID 12707
[devstudio-nightly-3.0.0.M1] $ bash -xe /tmp/hudson3198951128582896640.sh
+ kill 12688
Recording test results
Recording Emma reports jbds-build/coverage.xml
[PMD] Collecting PMD analysis files...
[PMD] Found 4738 annotations (16 new, 766 high, 3970 normal, 2 low)
[PMD] Don't changing build status, no threshold has been exceeded
Build was marked for publishing on https://hudson.jboss.org/hudson/
Email was triggered for: Unstable
There are 1 triggered emails.
Sending email for trigger: Unstable
--------------------------------------------------
15 years, 8 months
JBoss-AS-5.1.x-compatibilityMatrix - Build # 130 - Still Failing!
by jboss-qa-internal@redhat.com
JBoss-AS-5.1.x-compatibilityMatrix - Build # 130 - Still Failing:
Check console output at https://hudson.jboss.org/hudson//job/JBoss-AS-5.1.x-compatibilityMatrix/130 to view the results.
Modifications since last build:
[smarlow(a)redhat.com] JBAS-7005: limit logging of classes used during startup. Comment out new category limits.
[smarlow(a)redhat.com] JBAS-7005: limit logging of classes used during startup. Note this also reduces the debug/trace output (category limits can then be commented out to enable trace for a subset of functionality).
[jaikiran] JBAS-7004 Fixed the usage of a MC API which was resulting in picking irrelevant deployments
-------------------------------------------------------------------------
[...truncated 56469 lines...]
[jar] adding entry org/jboss/test/testbyvalue/interfaces/ByReferenceStatelessSessionHome.class
[jar] adding entry org/jboss/test/testbyvalue/interfaces/ByValueEntity.class
[jar] adding entry org/jboss/test/testbyvalue/interfaces/ByValueEntityHome.class
[jar] adding entry org/jboss/test/testbyvalue/interfaces/ByValueStatelessSession.class
[jar] adding entry org/jboss/test/testbyvalue/interfaces/ByValueStatelessSessionHome.class
[jar] adding entry org/jboss/test/testbyvalue/interfaces/RootStatelessSession.class
[jar] adding entry org/jboss/test/testbyvalue/interfaces/RootStatelessSessionHome.class
[jar] No Implementation-Title set.No Implementation-Version set.No Implementation-Vendor set.
[jar] Location: /qa/hudson_ws/workspace/JBoss-AS-5.1.x-compatibilityMatrix/JBossAS_5_x/testsuite/imports/sections/byvalue.xml:5:
jars:
[antcall] Exiting /qa/hudson_ws/workspace/JBoss-AS-5.1.x-compatibilityMatrix/JBossAS_5_x/testsuite/build.xml.
tests-matrix:
[echo] Will start the jboss instance localhost with default, dist=/qa/hudson_ws/workspace/JBoss-AS-5.1.x-compatibilityMatrix/JBossAS_5_x/build/output/jboss-5.2.0.Beta
[java] Executing '/qa/tools/opt/jdk1.5.0_15/bin/java' with arguments:
[java] '-Xms128m'
[java] '-Xmx512m'
[java] '-XX:MaxPermSize=512m'
[java] '-Dnone'
[java] '-Dxb.builder.useUnorderedSequence=true'
[java] '-classpath'
[java] '/qa/hudson_ws/workspace/JBoss-AS-5.1.x-compatibilityMatrix/JBossAS_5_x/build/output/jboss-5.2.0.Beta/bin/run.jar:/qa/tools/opt/amd64/jdk1.5.0_15/lib/tools.jar'
[java] 'org.jboss.Main'
[java] '-c'
[java] 'default'
[java] '-b'
[java] 'localhost'
[java]
[java] The ' characters around the executable and arguments are
[java] not part of the command.
spawned process java.lang.UNIXProcess@51f090da
[echo] Waiting for localhost to start...
Checking for http://localhost:8080/
Checking for http://localhost:8080/
Checking for http://localhost:8080/
Checking for http://localhost:8080/
Checking for http://localhost:8080/
Checking for http://localhost:8080/
Checking for http://localhost:8080/
Checking for http://localhost:8080/
Checking for http://localhost:8080/
Checking for http://localhost:8080/
Checking for http://localhost:8080/
Checking for http://localhost:8080/
Checking for http://localhost:8080/
Checking for http://localhost:8080/
Checking for http://localhost:8080/
Checking for http://localhost:8080/
Checking for http://localhost:8080/
Checking for http://localhost:8080/
Checking for http://localhost:8080/
Checking for http://localhost:8080/
Checking for http://localhost:8080/
Checking for http://localhost:8080/
Checking for http://localhost:8080/
Checking for http://localhost:8080/
Checking for http://localhost:8080/
Checking for http://localhost:8080/
Checking for http://localhost:8080/
Checking for http://localhost:8080/
Checking for http://localhost:8080/
Checking for http://localhost:8080/
Checking for http://localhost:8080/
Checking for http://localhost:8080/
Checking for http://localhost:8080/
Checking for http://localhost:8080/
Checking for http://localhost:8080/
Checking for http://localhost:8080/
Checking for http://localhost:8080/
Checking for http://localhost:8080/
Checking for http://localhost:8080/
Checking for http://localhost:8080/
Checking for http://localhost:8080/
Checking for http://localhost:8080/
Checking for http://localhost:8080/
Checking for http://localhost:8080/
Checking for http://localhost:8080/
Checking for http://localhost:8080/
Checking for http://localhost:8080/
Checking for http://localhost:8080/
waitfor: timeout
BUILD FAILED
/qa/hudson_ws/workspace/JBoss-AS-5.1.x-compatibilityMatrix/JBossAS_5_x/testsuite/build.xml:3649: The following error occurred while executing this line:
/qa/hudson_ws/workspace/JBoss-AS-5.1.x-compatibilityMatrix/JBossAS_5_x/testsuite/build.xml:3718: The following error occurred while executing this line:
/qa/hudson_ws/workspace/JBoss-AS-5.1.x-compatibilityMatrix/JBossAS_5_x/testsuite/build.xml:636: Timeout waiting for nodes to start
at org.apache.tools.ant.ProjectHelper.addLocationToBuildException(ProjectHelper.java:508)
at org.apache.tools.ant.taskdefs.MacroInstance.execute(MacroInstance.java:397)
at org.apache.tools.ant.UnknownElement.execute(UnknownElement.java:288)
at sun.reflect.GeneratedMethodAccessor1.invoke(Unknown Source)
at sun.reflect.DelegatingMethodAccessorImpl.invoke(DelegatingMethodAccessorImpl.java:25)
at java.lang.reflect.Method.invoke(Method.java:585)
at org.apache.tools.ant.dispatch.DispatchUtils.execute(DispatchUtils.java:106)
at org.apache.tools.ant.Task.perform(Task.java:348)
at org.apache.tools.ant.Target.execute(Target.java:357)
at org.apache.tools.ant.Target.performTasks(Target.java:385)
at org.apache.tools.ant.Project.executeSortedTargets(Project.java:1337)
at org.apache.tools.ant.Project.executeTarget(Project.java:1306)
at org.apache.tools.ant.helper.DefaultExecutor.executeTargets(DefaultExecutor.java:41)
at org.apache.tools.ant.Project.executeTargets(Project.java:1189)
at org.apache.tools.ant.Main.runBuild(Main.java:758)
at org.apache.tools.ant.Main.startAnt(Main.java:217)
at org.apache.tools.ant.launch.Launcher.run(Launcher.java:257)
at org.apache.tools.ant.launch.Launcher.main(Launcher.java:104)
Caused by: /qa/hudson_ws/workspace/JBoss-AS-5.1.x-compatibilityMatrix/JBossAS_5_x/testsuite/build.xml:3718: The following error occurred while executing this line:
/qa/hudson_ws/workspace/JBoss-AS-5.1.x-compatibilityMatrix/JBossAS_5_x/testsuite/build.xml:636: Timeout waiting for nodes to start
at org.apache.tools.ant.ProjectHelper.addLocationToBuildException(ProjectHelper.java:508)
at org.apache.tools.ant.taskdefs.MacroInstance.execute(MacroInstance.java:397)
at org.apache.tools.ant.UnknownElement.execute(UnknownElement.java:288)
at sun.reflect.GeneratedMethodAccessor1.invoke(Unknown Source)
at sun.reflect.DelegatingMethodAccessorImpl.invoke(DelegatingMethodAccessorImpl.java:25)
at java.lang.reflect.Method.invoke(Method.java:585)
at org.apache.tools.ant.dispatch.DispatchUtils.execute(DispatchUtils.java:106)
at org.apache.tools.ant.Task.perform(Task.java:348)
at org.apache.tools.ant.taskdefs.Sequential.execute(Sequential.java:62)
at org.apache.tools.ant.UnknownElement.execute(UnknownElement.java:288)
at sun.reflect.GeneratedMethodAccessor1.invoke(Unknown Source)
at sun.reflect.DelegatingMethodAccessorImpl.invoke(DelegatingMethodAccessorImpl.java:25)
at java.lang.reflect.Method.invoke(Method.java:585)
at org.apache.tools.ant.dispatch.DispatchUtils.execute(DispatchUtils.java:106)
at org.apache.tools.ant.Task.perform(Task.java:348)
at org.apache.tools.ant.taskdefs.MacroInstance.execute(MacroInstance.java:394)
... 16 more
Caused by: /qa/hudson_ws/workspace/JBoss-AS-5.1.x-compatibilityMatrix/JBossAS_5_x/testsuite/build.xml:636: Timeout waiting for nodes to start
at org.apache.tools.ant.taskdefs.Exit.execute(Exit.java:142)
at org.apache.tools.ant.UnknownElement.execute(UnknownElement.java:288)
at sun.reflect.GeneratedMethodAccessor1.invoke(Unknown Source)
at sun.reflect.DelegatingMethodAccessorImpl.invoke(DelegatingMethodAccessorImpl.java:25)
at java.lang.reflect.Method.invoke(Method.java:585)
at org.apache.tools.ant.dispatch.DispatchUtils.execute(DispatchUtils.java:106)
at org.apache.tools.ant.Task.perform(Task.java:348)
at org.apache.tools.ant.taskdefs.Sequential.execute(Sequential.java:62)
at org.apache.tools.ant.UnknownElement.execute(UnknownElement.java:288)
at sun.reflect.GeneratedMethodAccessor1.invoke(Unknown Source)
at sun.reflect.DelegatingMethodAccessorImpl.invoke(DelegatingMethodAccessorImpl.java:25)
at java.lang.reflect.Method.invoke(Method.java:585)
at org.apache.tools.ant.dispatch.DispatchUtils.execute(DispatchUtils.java:106)
at org.apache.tools.ant.Task.perform(Task.java:348)
at org.apache.tools.ant.taskdefs.MacroInstance.execute(MacroInstance.java:394)
... 30 more
--- Nested Exception ---
/qa/hudson_ws/workspace/JBoss-AS-5.1.x-compatibilityMatrix/JBossAS_5_x/testsuite/build.xml:3718: The following error occurred while executing this line:
/qa/hudson_ws/workspace/JBoss-AS-5.1.x-compatibilityMatrix/JBossAS_5_x/testsuite/build.xml:636: Timeout waiting for nodes to start
at org.apache.tools.ant.ProjectHelper.addLocationToBuildException(ProjectHelper.java:508)
at org.apache.tools.ant.taskdefs.MacroInstance.execute(MacroInstance.java:397)
at org.apache.tools.ant.UnknownElement.execute(UnknownElement.java:288)
at sun.reflect.GeneratedMethodAccessor1.invoke(Unknown Source)
at sun.reflect.DelegatingMethodAccessorImpl.invoke(DelegatingMethodAccessorImpl.java:25)
at java.lang.reflect.Method.invoke(Method.java:585)
at org.apache.tools.ant.dispatch.DispatchUtils.execute(DispatchUtils.java:106)
at org.apache.tools.ant.Task.perform(Task.java:348)
at org.apache.tools.ant.taskdefs.Sequential.execute(Sequential.java:62)
at org.apache.tools.ant.UnknownElement.execute(UnknownElement.java:288)
at sun.reflect.GeneratedMethodAccessor1.invoke(Unknown Source)
at sun.reflect.DelegatingMethodAccessorImpl.invoke(DelegatingMethodAccessorImpl.java:25)
at java.lang.reflect.Method.invoke(Method.java:585)
at org.apache.tools.ant.dispatch.DispatchUtils.execute(DispatchUtils.java:106)
at org.apache.tools.ant.Task.perform(Task.java:348)
at org.apache.tools.ant.taskdefs.MacroInstance.execute(MacroInstance.java:394)
at org.apache.tools.ant.UnknownElement.execute(UnknownElement.java:288)
at sun.reflect.GeneratedMethodAccessor1.invoke(Unknown Source)
at sun.reflect.DelegatingMethodAccessorImpl.invoke(DelegatingMethodAccessorImpl.java:25)
at java.lang.reflect.Method.invoke(Method.java:585)
at org.apache.tools.ant.dispatch.DispatchUtils.execute(DispatchUtils.java:106)
at org.apache.tools.ant.Task.perform(Task.java:348)
at org.apache.tools.ant.Target.execute(Target.java:357)
at org.apache.tools.ant.Target.performTasks(Target.java:385)
at org.apache.tools.ant.Project.executeSortedTargets(Project.java:1337)
at org.apache.tools.ant.Project.executeTarget(Project.java:1306)
at org.apache.tools.ant.helper.DefaultExecutor.executeTargets(DefaultExecutor.java:41)
at org.apache.tools.ant.Project.executeTargets(Project.java:1189)
at org.apache.tools.ant.Main.runBuild(Main.java:758)
at org.apache.tools.ant.Main.startAnt(Main.java:217)
at org.apache.tools.ant.launch.Launcher.run(Launcher.java:257)
at org.apache.tools.ant.launch.Launcher.main(Launcher.java:104)
Caused by: /qa/hudson_ws/workspace/JBoss-AS-5.1.x-compatibilityMatrix/JBossAS_5_x/testsuite/build.xml:636: Timeout waiting for nodes to start
at org.apache.tools.ant.taskdefs.Exit.execute(Exit.java:142)
at org.apache.tools.ant.UnknownElement.execute(UnknownElement.java:288)
at sun.reflect.GeneratedMethodAccessor1.invoke(Unknown Source)
at sun.reflect.DelegatingMethodAccessorImpl.invoke(DelegatingMethodAccessorImpl.java:25)
at java.lang.reflect.Method.invoke(Method.java:585)
at org.apache.tools.ant.dispatch.DispatchUtils.execute(DispatchUtils.java:106)
at org.apache.tools.ant.Task.perform(Task.java:348)
at org.apache.tools.ant.taskdefs.Sequential.execute(Sequential.java:62)
at org.apache.tools.ant.UnknownElement.execute(UnknownElement.java:288)
at sun.reflect.GeneratedMethodAccessor1.invoke(Unknown Source)
at sun.reflect.DelegatingMethodAccessorImpl.invoke(DelegatingMethodAccessorImpl.java:25)
at java.lang.reflect.Method.invoke(Method.java:585)
at org.apache.tools.ant.dispatch.DispatchUtils.execute(DispatchUtils.java:106)
at org.apache.tools.ant.Task.perform(Task.java:348)
at org.apache.tools.ant.taskdefs.MacroInstance.execute(MacroInstance.java:394)
... 30 more
--- Nested Exception ---
/qa/hudson_ws/workspace/JBoss-AS-5.1.x-compatibilityMatrix/JBossAS_5_x/testsuite/build.xml:636: Timeout waiting for nodes to start
at org.apache.tools.ant.taskdefs.Exit.execute(Exit.java:142)
at org.apache.tools.ant.UnknownElement.execute(UnknownElement.java:288)
at sun.reflect.GeneratedMethodAccessor1.invoke(Unknown Source)
at sun.reflect.DelegatingMethodAccessorImpl.invoke(DelegatingMethodAccessorImpl.java:25)
at java.lang.reflect.Method.invoke(Method.java:585)
at org.apache.tools.ant.dispatch.DispatchUtils.execute(DispatchUtils.java:106)
at org.apache.tools.ant.Task.perform(Task.java:348)
at org.apache.tools.ant.taskdefs.Sequential.execute(Sequential.java:62)
at org.apache.tools.ant.UnknownElement.execute(UnknownElement.java:288)
at sun.reflect.GeneratedMethodAccessor1.invoke(Unknown Source)
at sun.reflect.DelegatingMethodAccessorImpl.invoke(DelegatingMethodAccessorImpl.java:25)
at java.lang.reflect.Method.invoke(Method.java:585)
at org.apache.tools.ant.dispatch.DispatchUtils.execute(DispatchUtils.java:106)
at org.apache.tools.ant.Task.perform(Task.java:348)
at org.apache.tools.ant.taskdefs.MacroInstance.execute(MacroInstance.java:394)
at org.apache.tools.ant.UnknownElement.execute(UnknownElement.java:288)
at sun.reflect.GeneratedMethodAccessor1.invoke(Unknown Source)
at sun.reflect.DelegatingMethodAccessorImpl.invoke(DelegatingMethodAccessorImpl.java:25)
at java.lang.reflect.Method.invoke(Method.java:585)
at org.apache.tools.ant.dispatch.DispatchUtils.execute(DispatchUtils.java:106)
at org.apache.tools.ant.Task.perform(Task.java:348)
at org.apache.tools.ant.taskdefs.Sequential.execute(Sequential.java:62)
at org.apache.tools.ant.UnknownElement.execute(UnknownElement.java:288)
at sun.reflect.GeneratedMethodAccessor1.invoke(Unknown Source)
at sun.reflect.DelegatingMethodAccessorImpl.invoke(DelegatingMethodAccessorImpl.java:25)
at java.lang.reflect.Method.invoke(Method.java:585)
at org.apache.tools.ant.dispatch.DispatchUtils.execute(DispatchUtils.java:106)
at org.apache.tools.ant.Task.perform(Task.java:348)
at org.apache.tools.ant.taskdefs.MacroInstance.execute(MacroInstance.java:394)
at org.apache.tools.ant.UnknownElement.execute(UnknownElement.java:288)
at sun.reflect.GeneratedMethodAccessor1.invoke(Unknown Source)
at sun.reflect.DelegatingMethodAccessorImpl.invoke(DelegatingMethodAccessorImpl.java:25)
at java.lang.reflect.Method.invoke(Method.java:585)
at org.apache.tools.ant.dispatch.DispatchUtils.execute(DispatchUtils.java:106)
at org.apache.tools.ant.Task.perform(Task.java:348)
at org.apache.tools.ant.Target.execute(Target.java:357)
at org.apache.tools.ant.Target.performTasks(Target.java:385)
at org.apache.tools.ant.Project.executeSortedTargets(Project.java:1337)
at org.apache.tools.ant.Project.executeTarget(Project.java:1306)
at org.apache.tools.ant.helper.DefaultExecutor.executeTargets(DefaultExecutor.java:41)
at org.apache.tools.ant.Project.executeTargets(Project.java:1189)
at org.apache.tools.ant.Main.runBuild(Main.java:758)
at org.apache.tools.ant.Main.startAnt(Main.java:217)
at org.apache.tools.ant.launch.Launcher.run(Launcher.java:257)
at org.apache.tools.ant.launch.Launcher.main(Launcher.java:104)
Total time: 5 minutes 15 seconds
[JBoss-AS-5.1.x-compatibilityMatrix] $ bash -xe /tmp/hudson1905078913538421292.sh
+ kill 5063
Recording test results
Build was marked for publishing on https://hudson.jboss.org/hudson/
Email was triggered for: Failure
There are 1 triggered emails.
Sending email for trigger: Failure
15 years, 8 months