[Still Failing] jbosstools-nightly-3.2.next #222
by jboss-qa-internal@redhat.com
Public:
https://hudson.jboss.org/hudson//job/jbosstools-nightly-3.2.next/222
https://hudson.jboss.org/hudson//job/jbosstools-nightly-3.2.next/222/test...
https://hudson.jboss.org/hudson//job/jbosstools-nightly-3.2.next/222/changes
https://hudson.jboss.org/hudson//job/jbosstools-nightly-3.2.next/222/console
Internal:
http://hudson.qa.jboss.com/hudson/job/jbosstools-nightly-3.2.next/222/
http://hudson.qa.jboss.com/hudson/job/jbosstools-nightly-3.2.next/222//te...
http://hudson.qa.jboss.com/hudson/job/jbosstools-nightly-3.2.next/222//ch...
http://hudson.qa.jboss.com/hudson/job/jbosstools-nightly-3.2.next/222//co...
--------------------------------------------------
Failed Tests:
No tests ran.
--------------------------------------------------
Changes:
[dgolovin] testEntytyExtensions method is useless in tycho tests because it runs only model plugin without clients and thus there is n extensions found
[nickboldt] mark plugins to be unpacked (help resolving test projects within plugins)
[nickboldt] porkchop -> download.devel.redhat.com
--------------------------------------------------
Console log:
[...truncated 68346 lines...]
[java] checkCompilationResults:
[java]
[java] postProcess:
[java]
[java] assemble:
[java]
[java] preAssemble:
[java]
[java] allElements:
[java]
[java] init:
[java]
[java] assembleElement:
[java]
[java] main:
[java]
[java] assemble.org.jboss.tools.tptp.feature:
[java]
[java] main:
[java] [mkdir] Created dir: /qa/hudson_ws/workspace/jbosstools-nightly-3.2.next/jbds-build/eclipse/tmp
[java]
[java] gather.bin.parts:
[java]
[java] properties:
[java]
[java] init:
[java]
[java] gather.bin.parts:
[java] [mkdir] Created dir: /qa/hudson_ws/workspace/jbosstools-nightly-3.2.next/jbds-build/eclipse/tmp/plugins/org.jboss.tools.eclipse.as.tptp_1.1.0.v201005180332N-H222-GA
[java] [copy] Copying 1 file to /qa/hudson_ws/workspace/jbosstools-nightly-3.2.next/jbds-build/eclipse/tmp/plugins/org.jboss.tools.eclipse.as.tptp_1.1.0.v201005180332N-H222-GA
[java] [copy] Copying 8 files to /qa/hudson_ws/workspace/jbosstools-nightly-3.2.next/jbds-build/eclipse/tmp/plugins/org.jboss.tools.eclipse.as.tptp_1.1.0.v201005180332N-H222-GA
[java]
[java] apitools.generation:
[java]
[java] customAssembly:
[java]
[java] init:
[java]
[java] gather.bin.parts:
[java] [mkdir] Created dir: /qa/hudson_ws/workspace/jbosstools-nightly-3.2.next/jbds-build/eclipse/tmp/features/org.jboss.tools.tptp.feature_1.1.0.v201005180332N-H222-GA
[java]
[java] children:
[java] [copy] Copying 3 files to /qa/hudson_ws/workspace/jbosstools-nightly-3.2.next/jbds-build/eclipse/tmp/features/org.jboss.tools.tptp.feature_1.1.0.v201005180332N-H222-GA
[java]
[java] rootFiles:
[java]
[java] rootFiles*_*_*:
[java]
[java] customAssembly:
[java]
[java] customAssembly:
[java]
[java] jar.processing:
[java]
[java] jarUp:
[java]
[java] jarIng:
[java] [jar] Building jar: /qa/hudson_ws/workspace/jbosstools-nightly-3.2.next/jbds-build/eclipse/tmp/plugins/org.jboss.tools.eclipse.as.tptp_1.1.0.v201005180332N-H222-GA.jar
[java] [delete] Deleting directory /qa/hudson_ws/workspace/jbosstools-nightly-3.2.next/jbds-build/eclipse/tmp/plugins/org.jboss.tools.eclipse.as.tptp_1.1.0.v201005180332N-H222-GA
[java]
[java] customAssembly:
[java]
[java] generate.p2.metadata:
[java]
[java] assemble.archive:
[java]
[java] customAssembly:
[java]
[java] cleanup.assembly:
[java] [delete] Deleting directory /qa/hudson_ws/workspace/jbosstools-nightly-3.2.next/jbds-build/eclipse/tmp
[java]
[java] generate.p2.metadata:
[java]
[java] postAssemble:
[java]
[java] package:
[java]
[java] postBuild:
[java]
[java] postBuild:
[java] [echo] /qa/hudson_ws/workspace/jbosstools-nightly-3.2.next/jbds-build/3.2.0.beta1/201005180332/tptp
[java] [echo] /qa/hudson_ws/workspace/jbosstools-nightly-3.2.next/org.jboss.ide.eclipse.releng/builders/tests/builder.built wasn't available for tests
[java] [echo] tests disable flag ${skiptests}
[java] [mkdir] Created dir: /qa/hudson_ws/workspace/jbosstools-nightly-3.2.next/jbds-build/3.2.0.beta1/201005180332/tests
[java]
[java] nightly:
[java]
[java] build-required-builders:
[java]
[java] build-builder:
[java] [echo] Requirements: eclipse,birt,dtp,emf,gef,m2eclipse,swtbot,testframework,tptp,webtools,xsd
[java] [echo] load properties from /qa/hudson_ws/workspace/jbosstools-nightly-3.2.next/org.jboss.ide.eclipse.releng/requirements/eclipse/return.properties
[java] [echo] load properties from /qa/hudson_ws/workspace/jbosstools-nightly-3.2.next/org.jboss.ide.eclipse.releng/requirements/birt/return.properties
[java] [echo] load properties from /qa/hudson_ws/workspace/jbosstools-nightly-3.2.next/org.jboss.ide.eclipse.releng/requirements/dtp/return.properties
[java] [echo] load properties from /qa/hudson_ws/workspace/jbosstools-nightly-3.2.next/org.jboss.ide.eclipse.releng/requirements/emf/return.properties
[java] [echo] load properties from /qa/hudson_ws/workspace/jbosstools-nightly-3.2.next/org.jboss.ide.eclipse.releng/requirements/gef/return.properties
[java] [echo] load properties from /qa/hudson_ws/workspace/jbosstools-nightly-3.2.next/org.jboss.ide.eclipse.releng/requirements/m2eclipse/return.properties
[java] [echo] /qa/hudson_ws/workspace/jbosstools-nightly-3.2.next/org.jboss.ide.eclipse.releng/requirements/swtbot/return.properties is not available
[java]
[java] build.requirement:
[java]
[java] init:
[java]
[java] check.archive:
[java] [echo] Checking the requirement's archive org.eclipse.swtbot.eclipse.test.junit4-2.0.0.536-dev-e35.zip
[java] [echo] Archive is downloaded and MD5 checksum is provided
[java] [echo] Downloaded archive is correct, download is not required
[java]
[java] download.archive:
[java]
[java] unzip.archive:
[java]
[java] unpack-zip:
[java] [unzip] Expanding: /qa/hudson_ws/workspace/jbosstools-nightly-3.2.next/jbds-build/requirements/swtbot/org.eclipse.swtbot.eclipse.test.junit4-2.0.0.536-dev-e35.zip into /qa/hudson_ws/workspace/jbosstools-nightly-3.2.next/jbds-build/clean-eclipse
[java]
[java] post.unpack.requirement:
[java]
[java] build.driver:
[java]
[java] init:
[java]
[java] check.archive:
[java] [echo] Checking the requirement's archive org.eclipse.swtbot.eclipse.gef-2.0.0.536-dev-e35.zip
[java] [echo] Archive is downloaded and MD5 checksum is provided
[java] [echo] Downloaded archive is correct, download is not required
[java]
[java] download.archive:
[java]
[java] unzip.archive:
[java]
[java] unpack-zip:
[java] [unzip] Expanding: /qa/hudson_ws/workspace/jbosstools-nightly-3.2.next/jbds-build/requirements/swtbot/org.eclipse.swtbot.eclipse.gef-2.0.0.536-dev-e35.zip into /qa/hudson_ws/workspace/jbosstools-nightly-3.2.next/jbds-build/clean-eclipse
[java]
[java] post.unpack.requirement:
[java]
[java] build.driver:
[java]
[java] init:
[java]
[java] check.archive:
[java] [echo] Checking the requirement's archive org.eclipse.swtbot.eclipse-2.0.0.536-dev-e35.zip
[java] [echo] Archive is downloaded and MD5 checksum is provided
[java] [echo] Downloaded archive is correct, download is not required
[java]
[java] download.archive:
[java]
[java] unzip.archive:
[java]
[java] unpack-zip:
[java] [unzip] Expanding: /qa/hudson_ws/workspace/jbosstools-nightly-3.2.next/jbds-build/requirements/swtbot/org.eclipse.swtbot.eclipse-2.0.0.536-dev-e35.zip into /qa/hudson_ws/workspace/jbosstools-nightly-3.2.next/jbds-build/clean-eclipse
[java]
[java] post.unpack.requirement:
[java]
[java] build.driver:
[java]
[java] init:
[java]
[java] check.archive:
[java] [echo] Checking the requirement's archive swtbot-update-site-2.0.0.536-dev-e35.zip
[java] [echo] Archive has not downloaded yet, download required
[java]
[java] download.archive:
[java] [download swtbot] Getting: http://download.eclipse.org/technology/swtbot/galileo/dev-build/swtbot-up...
[java] [download swtbot] To: /qa/hudson_ws/workspace/jbosstools-nightly-3.2.next/jbds-build/requirements/swtbot/swtbot-update-site-2.0.0.536-dev-e35.zip
[java]
[java] post.download.requirement:
[java] [unzip] Expanding: /qa/hudson_ws/workspace/jbosstools-nightly-3.2.next/jbds-build/requirements/swtbot/${build.archive} into /qa/hudson_ws/workspace/jbosstools-nightly-3.2.next/jbds-build/clean-eclipse/eclipse
[java] Java Result: 13
BUILD FAILED
/qa/hudson_ws/workspace/jbosstools-nightly-3.2.next/org.jboss.ide.eclipse.releng/builders/buildNightly.xml:18: The following error occurred while executing this line:
/qa/hudson_ws/workspace/jbosstools-nightly-3.2.next/org.jboss.ide.eclipse.releng/builders/build.xml:68: The following error occurred while executing this line:
/qa/hudson_ws/workspace/jbosstools-nightly-3.2.next/org.jboss.ide.eclipse.releng/builders/build.xml:27: The following error occurred while executing this line:
/qa/hudson_ws/workspace/jbosstools-nightly-3.2.next/org.jboss.ide.eclipse.releng/builders/build.xml:39: The following error occurred while executing this line:
/qa/hudson_ws/workspace/jbosstools-nightly-3.2.next/org.jboss.ide.eclipse.releng/builders/product/productBuild.xml:106: The following error occurred while executing this line:
/qa/hudson_ws/workspace/jbosstools-nightly-3.2.next/org.jboss.ide.eclipse.releng/builders/product/productBuild.xml:120: The following error occurred while executing this line:
/qa/hudson_ws/workspace/jbosstools-nightly-3.2.next/org.jboss.ide.eclipse.releng/builders/builder-wrap.xml:336: [exec] Result: 127
[eclipse.fetch] Missing directory entry: plugin(a)org.mozilla.xpcom.
[eclipse.fetch] Missing directory entry: bundle(a)org.mozilla.xpcom.
[eclipse.fetch] Missing directory entry: plugin(a)org.mozilla.xulrunner.carbon.macosx.
[eclipse.fetch] Missing directory entry: bundle(a)org.mozilla.xulrunner.carbon.macosx.
[eclipse.fetch] Missing directory entry: plugin(a)org.mozilla.xulrunner.cocoa.macosx.
[eclipse.fetch] Missing directory entry: bundle(a)org.mozilla.xulrunner.cocoa.macosx.
[eclipse.fetch] Missing directory entry: plugin(a)org.mozilla.xulrunner.gtk.linux.x86.
[eclipse.fetch] Missing directory entry: bundle(a)org.mozilla.xulrunner.gtk.linux.x86.
[eclipse.fetch] Missing directory entry: plugin(a)org.mozilla.xulrunner.gtk.linux.x86_64.
[eclipse.fetch] Missing directory entry: bundle(a)org.mozilla.xulrunner.gtk.linux.x86_64.
[eclipse.fetch] Missing directory entry: plugin(a)org.mozilla.xulrunner.win32.win32.x86.
[eclipse.fetch] Missing directory entry: bundle(a)org.mozilla.xulrunner.win32.win32.x86.
BUILD FAILED
/qa/hudson_ws/workspace/jbosstools-nightly-3.2.next/org.jboss.ide.eclipse.releng/builders/product/productBuild.xml:493: The following error occurred while executing this line:
/qa/hudson_ws/workspace/jbosstools-nightly-3.2.next/org.jboss.ide.eclipse.releng/builders/product/productBuild.xml:495: The following error occurred while executing this line:
/qa/hudson_ws/workspace/jbosstools-nightly-3.2.next/org.jboss.ide.eclipse.releng/builders/product/productBuild.xml:429: The following error occurred while executing this line:
/qa/hudson_ws/workspace/jbosstools-nightly-3.2.next/org.jboss.ide.eclipse.releng/builders/builder-wrap.xml:68: The following error occurred while executing this line:
/qa/hudson_ws/workspace/jbosstools-nightly-3.2.next/org.jboss.ide.eclipse.releng/builders/builder-wrap.xml:122: The following error occurred while executing this line:
/qa/hudson_ws/workspace/jbosstools-nightly-3.2.next/org.jboss.ide.eclipse.releng/builders/common/buildRequirements.xml:13: The following error occurred while executing this line:
/qa/hudson_ws/workspace/jbosstools-nightly-3.2.next/org.jboss.ide.eclipse.releng/builders/common/buildRequirements.xml:21: The following error occurred while executing this line:
/qa/hudson_ws/workspace/jbosstools-nightly-3.2.next/org.jboss.ide.eclipse.releng/builders/common/buildRequirements.xml:111: The following error occurred while executing this line:
/qa/hudson_ws/workspace/jbosstools-nightly-3.2.next/org.jboss.ide.eclipse.releng/requirements/swtbot/buildRequirement.xml:30: Error while expanding /qa/hudson_ws/workspace/jbosstools-nightly-3.2.next/jbds-build/requirements/swtbot/${build.archive}
java.io.FileNotFoundException: /qa/hudson_ws/workspace/jbosstools-nightly-3.2.next/jbds-build/requirements/swtbot/${build.archive} (No such file or directory)
Total time: 8 minutes 2 seconds
Total time: 8 minutes 26 seconds
Terminating xvnc.
[jbosstools-nightly-3.2.next] $ vncserver -kill :19
Killing Xvnc process ID 6352
Recording test results
Description not found.
Recording Emma reports jbds-build/coverage.xml
Recording plot data
No plot data file found: jbds-build/*/*/tests/test-results/emma-coverage/archives/lines.properties
No plot data file found: jbds-build/*/*/tests/test-results/emma-coverage/as/lines.properties
No plot data file found: jbds-build/*/*/tests/test-results/emma-coverage/hibernate-tools/lines.properties
No plot data file found: jbds-build/*/*/tests/test-results/emma-coverage/jbpm-convert/lines.properties
No plot data file found: jbds-build/*/*/tests/test-results/emma-coverage/jmx/lines.properties
No plot data file found: jbds-build/*/*/tests/test-results/emma-coverage/bpel/lines.properties
No plot data file found: jbds-build/*/*/tests/test-results/emma-coverage/common/lines.properties
No plot data file found: jbds-build/*/*/tests/test-results/emma-coverage/struts/lines.properties
No plot data file found: jbds-build/*/*/tests/test-results/emma-coverage/jsf/lines.properties
No plot data file found: jbds-build/*/*/tests/test-results/emma-coverage/jst/lines.properties
No plot data file found: jbds-build/*/*/tests/test-results/emma-coverage/seam/lines.properties
No plot data file found: jbds-build/*/*/tests/test-results/emma-coverage/drools-ide/lines.properties
No plot data file found: jbds-build/*/*/tests/test-results/emma-coverage/vpe/lines.properties
No plot data file found: jbds-build/*/*/tests/test-results/emma-coverage/esb/lines.properties
No plot data file found: jbds-build/*/*/tests/test-results/emma-coverage/freemarker/lines.properties
No plot data file found: jbds-build/*/*/tests/test-results/emma-coverage/birt/lines.properties
No plot data file found: jbds-build/*/*/tests/test-results/emma-coverage/smooks/lines.properties
No plot data file found: jbds-build/*/*/tests/test-results/emma-coverage/archives/classes.properties
No plot data file found: jbds-build/*/*/tests/test-results/emma-coverage/as/classes.properties
No plot data file found: jbds-build/*/*/tests/test-results/emma-coverage/hibernate-tools/classes.properties
No plot data file found: jbds-build/*/*/tests/test-results/emma-coverage/jbpm-convert/classes.properties
No plot data file found: jbds-build/*/*/tests/test-results/emma-coverage/jmx/classes.properties
No plot data file found: jbds-build/*/*/tests/test-results/emma-coverage/bpel/classes.properties
No plot data file found: jbds-build/*/*/tests/test-results/emma-coverage/common/classes.properties
No plot data file found: jbds-build/*/*/tests/test-results/emma-coverage/struts/classes.properties
No plot data file found: jbds-build/*/*/tests/test-results/emma-coverage/jsf/classes.properties
No plot data file found: jbds-build/*/*/tests/test-results/emma-coverage/jst/classes.properties
No plot data file found: jbds-build/*/*/tests/test-results/emma-coverage/seam/classes.properties
No plot data file found: jbds-build/*/*/tests/test-results/emma-coverage/drools-ide/classes.properties
No plot data file found: jbds-build/*/*/tests/test-results/emma-coverage/vpe/classes.properties
No plot data file found: jbds-build/*/*/tests/test-results/emma-coverage/esb/classes.properties
No plot data file found: jbds-build/*/*/tests/test-results/emma-coverage/freemarker/classes.properties
No plot data file found: jbds-build/*/*/tests/test-results/emma-coverage/birt/classes.properties
No plot data file found: jbds-build/*/*/tests/test-results/emma-coverage/smooks/classes.properties
Email was triggered for: Failure
There are 1 triggered emails.
Sending email for trigger: Failure
--------------------------------------------------
14 years, 9 months
[Still Failing] devstudio-nightly-3.1.0.beta1 #299
by jboss-qa-internal@redhat.com
Public:
https://hudson.jboss.org/hudson//job/devstudio-nightly-3.1.0.beta1/299
https://hudson.jboss.org/hudson//job/devstudio-nightly-3.1.0.beta1/299/te...
https://hudson.jboss.org/hudson//job/devstudio-nightly-3.1.0.beta1/299/ch...
https://hudson.jboss.org/hudson//job/devstudio-nightly-3.1.0.beta1/299/co...
Internal:
http://hudson.qa.jboss.com/hudson/job/devstudio-nightly-3.1.0.beta1/299/
http://hudson.qa.jboss.com/hudson/job/devstudio-nightly-3.1.0.beta1/299//...
http://hudson.qa.jboss.com/hudson/job/devstudio-nightly-3.1.0.beta1/299//...
http://hudson.qa.jboss.com/hudson/job/devstudio-nightly-3.1.0.beta1/299//...
--------------------------------------------------
Failed Tests:
No tests ran.
--------------------------------------------------
Changes:
[nickboldt] special case - repo does not have root eclipse/ folder; move excludes into special case unzip
[nickboldt] special case - repo does not have root eclipse/ folder; move excludes into special case unzip
[nickboldt] special case - repo does not have root eclipse/ folder
[nickboldt] special case - repo does not have root eclipse/ folder
--------------------------------------------------
Console log:
[...truncated 67474 lines...]
[java]
[java] main:
[java] [mkdir] Created dir: /home/hudson/hudson_workspace/workspace/devstudio-nightly-3.1.0.beta1/jbds-build/eclipse/tmp
[java]
[java] gather.bin.parts:
[java]
[java] properties:
[java]
[java] init:
[java]
[java] gather.bin.parts:
[java] [mkdir] Created dir: /home/hudson/hudson_workspace/workspace/devstudio-nightly-3.1.0.beta1/jbds-build/eclipse/tmp/plugins/org.jboss.tools.birt.oda_1.1.0.v201005180157N-H299-GA
[java] [copy] Copying 19 files to /home/hudson/hudson_workspace/workspace/devstudio-nightly-3.1.0.beta1/jbds-build/eclipse/tmp/plugins/org.jboss.tools.birt.oda_1.1.0.v201005180157N-H299-GA
[java] [copy] Copying 3 files to /home/hudson/hudson_workspace/workspace/devstudio-nightly-3.1.0.beta1/jbds-build/eclipse/tmp/plugins/org.jboss.tools.birt.oda_1.1.0.v201005180157N-H299-GA
[java]
[java] apitools.generation:
[java]
[java] customAssembly:
[java]
[java] properties:
[java]
[java] init:
[java]
[java] gather.bin.parts:
[java] [mkdir] Created dir: /home/hudson/hudson_workspace/workspace/devstudio-nightly-3.1.0.beta1/jbds-build/eclipse/tmp/plugins/org.jboss.tools.birt.oda.ui_1.1.0.v201005180157N-H299-GA
[java] [copy] Copying 21 files to /home/hudson/hudson_workspace/workspace/devstudio-nightly-3.1.0.beta1/jbds-build/eclipse/tmp/plugins/org.jboss.tools.birt.oda.ui_1.1.0.v201005180157N-H299-GA
[java] [copy] Copying 11 files to /home/hudson/hudson_workspace/workspace/devstudio-nightly-3.1.0.beta1/jbds-build/eclipse/tmp/plugins/org.jboss.tools.birt.oda.ui_1.1.0.v201005180157N-H299-GA
[java]
[java] apitools.generation:
[java]
[java] customAssembly:
[java]
[java] properties:
[java]
[java] init:
[java]
[java] gather.bin.parts:
[java] [mkdir] Created dir: /home/hudson/hudson_workspace/workspace/devstudio-nightly-3.1.0.beta1/jbds-build/eclipse/tmp/plugins/org.jboss.tools.birt.core_1.1.0.v201005180157N-H299-GA
[java] [copy] Copying 13 files to /home/hudson/hudson_workspace/workspace/devstudio-nightly-3.1.0.beta1/jbds-build/eclipse/tmp/plugins/org.jboss.tools.birt.core_1.1.0.v201005180157N-H299-GA
[java] [copy] Copying 5 files to /home/hudson/hudson_workspace/workspace/devstudio-nightly-3.1.0.beta1/jbds-build/eclipse/tmp/plugins/org.jboss.tools.birt.core_1.1.0.v201005180157N-H299-GA
[java]
[java] apitools.generation:
[java]
[java] customAssembly:
[java]
[java] init:
[java]
[java] gather.bin.parts:
[java] [mkdir] Created dir: /home/hudson/hudson_workspace/workspace/devstudio-nightly-3.1.0.beta1/jbds-build/eclipse/tmp/features/org.jboss.tools.birt.feature_1.1.0.v201005180157N-H299-GA
[java]
[java] children:
[java] [copy] Copying 4 files to /home/hudson/hudson_workspace/workspace/devstudio-nightly-3.1.0.beta1/jbds-build/eclipse/tmp/features/org.jboss.tools.birt.feature_1.1.0.v201005180157N-H299-GA
[java]
[java] rootFiles:
[java]
[java] rootFiles*_*_*:
[java]
[java] customAssembly:
[java]
[java] customAssembly:
[java]
[java] jar.processing:
[java]
[java] jarUp:
[java]
[java] jarIng:
[java] [jar] Building jar: /home/hudson/hudson_workspace/workspace/devstudio-nightly-3.1.0.beta1/jbds-build/eclipse/tmp/plugins/org.jboss.tools.birt.oda_1.1.0.v201005180157N-H299-GA.jar
[java] [delete] Deleting directory /home/hudson/hudson_workspace/workspace/devstudio-nightly-3.1.0.beta1/jbds-build/eclipse/tmp/plugins/org.jboss.tools.birt.oda_1.1.0.v201005180157N-H299-GA
[java]
[java] jarUp:
[java]
[java] jarIng:
[java] [jar] Building jar: /home/hudson/hudson_workspace/workspace/devstudio-nightly-3.1.0.beta1/jbds-build/eclipse/tmp/plugins/org.jboss.tools.birt.oda.ui_1.1.0.v201005180157N-H299-GA.jar
[java] [delete] Deleting directory /home/hudson/hudson_workspace/workspace/devstudio-nightly-3.1.0.beta1/jbds-build/eclipse/tmp/plugins/org.jboss.tools.birt.oda.ui_1.1.0.v201005180157N-H299-GA
[java]
[java] jarUp:
[java]
[java] jarIng:
[java] [jar] Building jar: /home/hudson/hudson_workspace/workspace/devstudio-nightly-3.1.0.beta1/jbds-build/eclipse/tmp/plugins/org.jboss.tools.birt.core_1.1.0.v201005180157N-H299-GA.jar
[java] [delete] Deleting directory /home/hudson/hudson_workspace/workspace/devstudio-nightly-3.1.0.beta1/jbds-build/eclipse/tmp/plugins/org.jboss.tools.birt.core_1.1.0.v201005180157N-H299-GA
[java]
[java] customAssembly:
[java]
[java] generate.p2.metadata:
[java]
[java] assemble.archive:
[java]
[java] customAssembly:
[java]
[java] cleanup.assembly:
[java] [delete] Deleting directory /home/hudson/hudson_workspace/workspace/devstudio-nightly-3.1.0.beta1/jbds-build/eclipse/tmp
[java]
[java] generate.p2.metadata:
[java]
[java] postAssemble:
[java]
[java] package:
[java]
[java] postBuild:
[java]
[java] postBuild:
[java] [echo] /home/hudson/hudson_workspace/workspace/devstudio-nightly-3.1.0.beta1/jbds-build/3.1.0.beta1/201005180157/birt
[java]
[java] build-builder:
[java] [echo] Requirements: eclipse,birt,dtp,emf,gef,m2eclipse,swtbot,testframework,tptp,webtools,xsd
[java] [echo] load properties from /home/hudson/hudson_workspace/workspace/devstudio-nightly-3.1.0.beta1/org.jboss.ide.eclipse.releng/requirements/eclipse/return.properties
[java] [echo] load properties from /home/hudson/hudson_workspace/workspace/devstudio-nightly-3.1.0.beta1/org.jboss.ide.eclipse.releng/requirements/birt/return.properties
[java] [echo] load properties from /home/hudson/hudson_workspace/workspace/devstudio-nightly-3.1.0.beta1/org.jboss.ide.eclipse.releng/requirements/dtp/return.properties
[java] [echo] load properties from /home/hudson/hudson_workspace/workspace/devstudio-nightly-3.1.0.beta1/org.jboss.ide.eclipse.releng/requirements/emf/return.properties
[java] [echo] load properties from /home/hudson/hudson_workspace/workspace/devstudio-nightly-3.1.0.beta1/org.jboss.ide.eclipse.releng/requirements/gef/return.properties
[java] [echo] /home/hudson/hudson_workspace/workspace/devstudio-nightly-3.1.0.beta1/org.jboss.ide.eclipse.releng/requirements/m2eclipse/return.properties is not available
[java]
[java] init:
[java]
[java] check.archive:
[java] [echo] Checking the requirement's archive m2eclipse-0.10.0.20100209-0800.zip
[java] [echo] Archive is downloaded and MD5 checksum is provided
[java] [echo] Downloaded archive is correct, download is not required
[java]
[java] download.archive:
[java]
[java] unzip.archive:
[java]
[java] unpack-zip:
[java] [unzip] Expanding: /home/hudson/hudson_workspace/workspace/devstudio-nightly-3.1.0.beta1/jbds-build/requirements/m2eclipse/m2eclipse-0.10.0.20100209-0800.zip into /home/hudson/hudson_workspace/workspace/devstudio-nightly-3.1.0.beta1/jbds-build/clean-eclipse
[java]
[java] post.unpack.requirement:
[java]
[java] build.driver:
[java]
[java] build.requirement:
[java] [echo] load properties from /home/hudson/hudson_workspace/workspace/devstudio-nightly-3.1.0.beta1/org.jboss.ide.eclipse.releng/requirements/m2eclipse/return.properties
[java] [echo] /home/hudson/hudson_workspace/workspace/devstudio-nightly-3.1.0.beta1/org.jboss.ide.eclipse.releng/requirements/swtbot/return.properties is not available
[java]
[java] build.requirement:
[java]
[java] init:
[java]
[java] check.archive:
[java] [echo] Checking the requirement's archive org.eclipse.swtbot.eclipse.test.junit4-2.0.0.536-dev-e35.zip
[java] [echo] Archive is downloaded and MD5 checksum is provided
[java] [echo] Downloaded archive is correct, download is not required
[java]
[java] download.archive:
[java]
[java] unzip.archive:
[java]
[java] unpack-zip:
[java] [unzip] Expanding: /home/hudson/hudson_workspace/workspace/devstudio-nightly-3.1.0.beta1/jbds-build/requirements/swtbot/org.eclipse.swtbot.eclipse.test.junit4-2.0.0.536-dev-e35.zip into /home/hudson/hudson_workspace/workspace/devstudio-nightly-3.1.0.beta1/jbds-build/clean-eclipse
[java]
[java] post.unpack.requirement:
[java]
[java] build.driver:
[java]
[java] init:
[java]
[java] check.archive:
[java] [echo] Checking the requirement's archive org.eclipse.swtbot.eclipse.gef-2.0.0.536-dev-e35.zip
[java] [echo] Archive is downloaded and MD5 checksum is provided
[java] [echo] Downloaded archive is correct, download is not required
[java]
[java] download.archive:
[java]
[java] unzip.archive:
[java]
[java] unpack-zip:
[java] [unzip] Expanding: /home/hudson/hudson_workspace/workspace/devstudio-nightly-3.1.0.beta1/jbds-build/requirements/swtbot/org.eclipse.swtbot.eclipse.gef-2.0.0.536-dev-e35.zip into /home/hudson/hudson_workspace/workspace/devstudio-nightly-3.1.0.beta1/jbds-build/clean-eclipse
[java]
[java] post.unpack.requirement:
[java]
[java] build.driver:
[java]
[java] init:
[java]
[java] check.archive:
[java] [echo] Checking the requirement's archive org.eclipse.swtbot.eclipse-2.0.0.536-dev-e35.zip
[java] [echo] Archive is downloaded and MD5 checksum is provided
[java] [echo] Downloaded archive is correct, download is not required
[java]
[java] download.archive:
[java]
[java] unzip.archive:
[java]
[java] unpack-zip:
[java] [unzip] Expanding: /home/hudson/hudson_workspace/workspace/devstudio-nightly-3.1.0.beta1/jbds-build/requirements/swtbot/org.eclipse.swtbot.eclipse-2.0.0.536-dev-e35.zip into /home/hudson/hudson_workspace/workspace/devstudio-nightly-3.1.0.beta1/jbds-build/clean-eclipse
[java]
[java] post.unpack.requirement:
[java]
[java] build.driver:
[java]
[java] init:
[java]
[java] check.archive:
[java] [echo] Checking the requirement's archive swtbot-update-site-2.0.0.536-dev-e35.zip
[java] [echo] Archive has not downloaded yet, download required
[java]
[java] download.archive:
[java] [download swtbot] Getting: http://download.eclipse.org/technology/swtbot/galileo/dev-build/swtbot-up...
[java] [download swtbot] To: /home/hudson/hudson_workspace/workspace/devstudio-nightly-3.1.0.beta1/jbds-build/requirements/swtbot/swtbot-update-site-2.0.0.536-dev-e35.zip
[java]
[java] post.download.requirement:
[java] [unzip] Expanding: /home/hudson/hudson_workspace/workspace/devstudio-nightly-3.1.0.beta1/jbds-build/requirements/swtbot/${build.archive} into /home/hudson/hudson_workspace/workspace/devstudio-nightly-3.1.0.beta1/jbds-build/clean-eclipse/eclipse
[java] Java Result: 13
BUILD FAILED
/qa/services/hudson/hudson_workspace/workspace/devstudio-nightly-3.1.0.beta1/org.jboss.ide.eclipse.releng/builders/buildNightly.xml:18: The following error occurred while executing this line:
/qa/services/hudson/hudson_workspace/workspace/devstudio-nightly-3.1.0.beta1/org.jboss.ide.eclipse.releng/builders/build.xml:68: The following error occurred while executing this line:
/qa/services/hudson/hudson_workspace/workspace/devstudio-nightly-3.1.0.beta1/org.jboss.ide.eclipse.releng/builders/build.xml:27: The following error occurred while executing this line:
/qa/services/hudson/hudson_workspace/workspace/devstudio-nightly-3.1.0.beta1/org.jboss.ide.eclipse.releng/builders/build.xml:39: The following error occurred while executing this line:
/qa/services/hudson/hudson_workspace/workspace/devstudio-nightly-3.1.0.beta1/org.jboss.ide.eclipse.releng/builders/product/productBuild.xml:106: The following error occurred while executing this line:
/qa/services/hudson/hudson_workspace/workspace/devstudio-nightly-3.1.0.beta1/org.jboss.ide.eclipse.releng/builders/product/productBuild.xml:120: The following error occurred while executing this line:
/qa/services/hudson/hudson_workspace/workspace/devstudio-nightly-3.1.0.beta1/org.jboss.ide.eclipse.releng/builders/builder-wrap.xml:336: [eclipse.fetch] Missing directory entry: plugin(a)org.mozilla.xpcom.
[eclipse.fetch] Missing directory entry: bundle(a)org.mozilla.xpcom.
[eclipse.fetch] Missing directory entry: plugin(a)org.mozilla.xulrunner.carbon.macosx.
[eclipse.fetch] Missing directory entry: bundle(a)org.mozilla.xulrunner.carbon.macosx.
[eclipse.fetch] Missing directory entry: plugin(a)org.mozilla.xulrunner.cocoa.macosx.
[eclipse.fetch] Missing directory entry: bundle(a)org.mozilla.xulrunner.cocoa.macosx.
[eclipse.fetch] Missing directory entry: plugin(a)org.mozilla.xulrunner.gtk.linux.x86.
[eclipse.fetch] Missing directory entry: bundle(a)org.mozilla.xulrunner.gtk.linux.x86.
[eclipse.fetch] Missing directory entry: plugin(a)org.mozilla.xulrunner.gtk.linux.x86_64.
[eclipse.fetch] Missing directory entry: bundle(a)org.mozilla.xulrunner.gtk.linux.x86_64.
[eclipse.fetch] Missing directory entry: plugin(a)org.mozilla.xulrunner.win32.win32.x86.
[eclipse.fetch] Missing directory entry: bundle(a)org.mozilla.xulrunner.win32.win32.x86.
[exec] Result: 127
BUILD FAILED
/qa/services/hudson/hudson_workspace/workspace/devstudio-nightly-3.1.0.beta1/org.jboss.ide.eclipse.releng/builders/product/productBuild.xml:493: The following error occurred while executing this line:
/qa/services/hudson/hudson_workspace/workspace/devstudio-nightly-3.1.0.beta1/org.jboss.ide.eclipse.releng/builders/product/productBuild.xml:495: The following error occurred while executing this line:
/qa/services/hudson/hudson_workspace/workspace/devstudio-nightly-3.1.0.beta1/org.jboss.ide.eclipse.releng/builders/product/productBuild.xml:429: The following error occurred while executing this line:
/home/hudson/hudson_workspace/workspace/devstudio-nightly-3.1.0.beta1/org.jboss.ide.eclipse.releng/builders/builder-wrap.xml:68: The following error occurred while executing this line:
/home/hudson/hudson_workspace/workspace/devstudio-nightly-3.1.0.beta1/org.jboss.ide.eclipse.releng/builders/builder-wrap.xml:122: The following error occurred while executing this line:
/qa/services/hudson/hudson_workspace/workspace/devstudio-nightly-3.1.0.beta1/org.jboss.ide.eclipse.releng/builders/common/buildRequirements.xml:13: The following error occurred while executing this line:
/qa/services/hudson/hudson_workspace/workspace/devstudio-nightly-3.1.0.beta1/org.jboss.ide.eclipse.releng/builders/common/buildRequirements.xml:21: The following error occurred while executing this line:
/qa/services/hudson/hudson_workspace/workspace/devstudio-nightly-3.1.0.beta1/org.jboss.ide.eclipse.releng/builders/common/buildRequirements.xml:111: The following error occurred while executing this line:
/home/hudson/hudson_workspace/workspace/devstudio-nightly-3.1.0.beta1/org.jboss.ide.eclipse.releng/requirements/swtbot/buildRequirement.xml:30: Error while expanding /home/hudson/hudson_workspace/workspace/devstudio-nightly-3.1.0.beta1/jbds-build/requirements/swtbot/${build.archive}
java.io.FileNotFoundException: /home/hudson/hudson_workspace/workspace/devstudio-nightly-3.1.0.beta1/jbds-build/requirements/swtbot/${build.archive} (No such file or directory)
Total time: 17 minutes 22 seconds
Total time: 18 minutes 4 seconds
Terminating xvnc.
[devstudio-nightly-3.1.0.beta1] $ vncserver -kill :22
Killing Xvnc process ID 26958
Recording test results
Description not found.
Recording Emma reports jbds-build/coverage.xml
Email was triggered for: Failure
There are 1 triggered emails.
Sending email for trigger: Failure
--------------------------------------------------
14 years, 9 months
[Still Failing] jbosstools-nightly-3.2.next #221
by jboss-qa-internal@redhat.com
Public:
https://hudson.jboss.org/hudson//job/jbosstools-nightly-3.2.next/221
https://hudson.jboss.org/hudson//job/jbosstools-nightly-3.2.next/221/test...
https://hudson.jboss.org/hudson//job/jbosstools-nightly-3.2.next/221/changes
https://hudson.jboss.org/hudson//job/jbosstools-nightly-3.2.next/221/console
Internal:
http://hudson.qa.jboss.com/hudson/job/jbosstools-nightly-3.2.next/221/
http://hudson.qa.jboss.com/hudson/job/jbosstools-nightly-3.2.next/221//te...
http://hudson.qa.jboss.com/hudson/job/jbosstools-nightly-3.2.next/221//ch...
http://hudson.qa.jboss.com/hudson/job/jbosstools-nightly-3.2.next/221//co...
--------------------------------------------------
Failed Tests:
No tests ran.
--------------------------------------------------
Changes:
--------------------------------------------------
Console log:
[...truncated 68060 lines...]
[java] [mkdir] Created dir: /qa/hudson_ws/workspace/jbosstools-nightly-3.2.next/jbds-build/eclipse/plugins/org.jboss.tools.eclipse.as.tptp/@dot
[java] [javac] Compiling 1 source file to /qa/hudson_ws/workspace/jbosstools-nightly-3.2.next/jbds-build/eclipse/plugins/org.jboss.tools.eclipse.as.tptp/@dot
[java]
[java] checkCompilationResults:
[java]
[java] postProcess:
[java]
[java] assemble:
[java]
[java] preAssemble:
[java]
[java] allElements:
[java]
[java] init:
[java]
[java] assembleElement:
[java]
[java] main:
[java]
[java] assemble.org.jboss.tools.tptp.feature:
[java]
[java] main:
[java] [mkdir] Created dir: /qa/hudson_ws/workspace/jbosstools-nightly-3.2.next/jbds-build/eclipse/tmp
[java]
[java] gather.bin.parts:
[java]
[java] properties:
[java]
[java] init:
[java]
[java] gather.bin.parts:
[java] [mkdir] Created dir: /qa/hudson_ws/workspace/jbosstools-nightly-3.2.next/jbds-build/eclipse/tmp/plugins/org.jboss.tools.eclipse.as.tptp_1.1.0.v201005180157N-H221-GA
[java] [copy] Copying 1 file to /qa/hudson_ws/workspace/jbosstools-nightly-3.2.next/jbds-build/eclipse/tmp/plugins/org.jboss.tools.eclipse.as.tptp_1.1.0.v201005180157N-H221-GA
[java] [copy] Copying 8 files to /qa/hudson_ws/workspace/jbosstools-nightly-3.2.next/jbds-build/eclipse/tmp/plugins/org.jboss.tools.eclipse.as.tptp_1.1.0.v201005180157N-H221-GA
[java]
[java] apitools.generation:
[java]
[java] customAssembly:
[java]
[java] init:
[java]
[java] gather.bin.parts:
[java] [mkdir] Created dir: /qa/hudson_ws/workspace/jbosstools-nightly-3.2.next/jbds-build/eclipse/tmp/features/org.jboss.tools.tptp.feature_1.1.0.v201005180157N-H221-GA
[java]
[java] children:
[java] [copy] Copying 3 files to /qa/hudson_ws/workspace/jbosstools-nightly-3.2.next/jbds-build/eclipse/tmp/features/org.jboss.tools.tptp.feature_1.1.0.v201005180157N-H221-GA
[java]
[java] rootFiles:
[java]
[java] rootFiles*_*_*:
[java]
[java] customAssembly:
[java]
[java] customAssembly:
[java]
[java] jar.processing:
[java]
[java] jarUp:
[java]
[java] jarIng:
[java] [jar] Building jar: /qa/hudson_ws/workspace/jbosstools-nightly-3.2.next/jbds-build/eclipse/tmp/plugins/org.jboss.tools.eclipse.as.tptp_1.1.0.v201005180157N-H221-GA.jar
[java] [delete] Deleting directory /qa/hudson_ws/workspace/jbosstools-nightly-3.2.next/jbds-build/eclipse/tmp/plugins/org.jboss.tools.eclipse.as.tptp_1.1.0.v201005180157N-H221-GA
[java]
[java] customAssembly:
[java]
[java] generate.p2.metadata:
[java]
[java] assemble.archive:
[java]
[java] customAssembly:
[java]
[java] cleanup.assembly:
[java] [delete] Deleting directory /qa/hudson_ws/workspace/jbosstools-nightly-3.2.next/jbds-build/eclipse/tmp
[java]
[java] generate.p2.metadata:
[java]
[java] postAssemble:
[java]
[java] package:
[java]
[java] postBuild:
[java]
[java] postBuild:
[java] [echo] /qa/hudson_ws/workspace/jbosstools-nightly-3.2.next/jbds-build/3.2.0.beta1/201005180157/tptp
[java] [echo] /qa/hudson_ws/workspace/jbosstools-nightly-3.2.next/org.jboss.ide.eclipse.releng/builders/tests/builder.built wasn't available for tests
[java] [echo] tests disable flag ${skiptests}
[java] [mkdir] Created dir: /qa/hudson_ws/workspace/jbosstools-nightly-3.2.next/jbds-build/3.2.0.beta1/201005180157/tests
[java]
[java] nightly:
[java]
[java] build-required-builders:
[java]
[java] build-builder:
[java] [echo] Requirements: eclipse,birt,dtp,emf,gef,m2eclipse,swtbot,testframework,tptp,webtools,xsd
[java] [echo] load properties from /qa/hudson_ws/workspace/jbosstools-nightly-3.2.next/org.jboss.ide.eclipse.releng/requirements/eclipse/return.properties
[java] [echo] load properties from /qa/hudson_ws/workspace/jbosstools-nightly-3.2.next/org.jboss.ide.eclipse.releng/requirements/birt/return.properties
[java] [echo] load properties from /qa/hudson_ws/workspace/jbosstools-nightly-3.2.next/org.jboss.ide.eclipse.releng/requirements/dtp/return.properties
[java] [echo] load properties from /qa/hudson_ws/workspace/jbosstools-nightly-3.2.next/org.jboss.ide.eclipse.releng/requirements/emf/return.properties
[java] [echo] load properties from /qa/hudson_ws/workspace/jbosstools-nightly-3.2.next/org.jboss.ide.eclipse.releng/requirements/gef/return.properties
[java] [echo] load properties from /qa/hudson_ws/workspace/jbosstools-nightly-3.2.next/org.jboss.ide.eclipse.releng/requirements/m2eclipse/return.properties
[java] [echo] /qa/hudson_ws/workspace/jbosstools-nightly-3.2.next/org.jboss.ide.eclipse.releng/requirements/swtbot/return.properties is not available
[java]
[java] build.requirement:
[java]
[java] init:
[java]
[java] check.archive:
[java] [echo] Checking the requirement's archive org.eclipse.swtbot.eclipse.test.junit4-2.0.0.536-dev-e35.zip
[java] [echo] Archive is downloaded and MD5 checksum is provided
[java] [echo] Downloaded archive is correct, download is not required
[java]
[java] download.archive:
[java]
[java] unzip.archive:
[java]
[java] unpack-zip:
[java] [unzip] Expanding: /qa/hudson_ws/workspace/jbosstools-nightly-3.2.next/jbds-build/requirements/swtbot/org.eclipse.swtbot.eclipse.test.junit4-2.0.0.536-dev-e35.zip into /qa/hudson_ws/workspace/jbosstools-nightly-3.2.next/jbds-build/clean-eclipse
[java]
[java] post.unpack.requirement:
[java]
[java] build.driver:
[java]
[java] init:
[java]
[java] check.archive:
[java] [echo] Checking the requirement's archive org.eclipse.swtbot.eclipse.gef-2.0.0.536-dev-e35.zip
[java] [echo] Archive is downloaded and MD5 checksum is provided
[java] [echo] Downloaded archive is correct, download is not required
[java]
[java] download.archive:
[java]
[java] unzip.archive:
[java]
[java] unpack-zip:
[java] [unzip] Expanding: /qa/hudson_ws/workspace/jbosstools-nightly-3.2.next/jbds-build/requirements/swtbot/org.eclipse.swtbot.eclipse.gef-2.0.0.536-dev-e35.zip into /qa/hudson_ws/workspace/jbosstools-nightly-3.2.next/jbds-build/clean-eclipse
[java]
[java] post.unpack.requirement:
[java]
[java] build.driver:
[java]
[java] init:
[java]
[java] check.archive:
[java] [echo] Checking the requirement's archive org.eclipse.swtbot.eclipse-2.0.0.536-dev-e35.zip
[java] [echo] Archive is downloaded and MD5 checksum is provided
[java] [echo] Downloaded archive is correct, download is not required
[java]
[java] download.archive:
[java]
[java] unzip.archive:
[java]
[java] unpack-zip:
[java] [unzip] Expanding: /qa/hudson_ws/workspace/jbosstools-nightly-3.2.next/jbds-build/requirements/swtbot/org.eclipse.swtbot.eclipse-2.0.0.536-dev-e35.zip into /qa/hudson_ws/workspace/jbosstools-nightly-3.2.next/jbds-build/clean-eclipse
[java]
[java] post.unpack.requirement:
[java]
[java] build.driver:
[java]
[java] init:
[java]
[java] check.archive:
[java] [echo] Checking the requirement's archive swtbot-update-site-2.0.0.536-dev-e35.zip
[java] [echo] Archive is downloaded and MD5 checksum is provided
[java] [echo] Downloaded archive is correct, download is not required
[java]
[java] download.archive:
[java] [unzip] Expanding: /qa/hudson_ws/workspace/jbosstools-nightly-3.2.next/jbds-build/requirements/swtbot/${build.archive} into /qa/hudson_ws/workspace/jbosstools-nightly-3.2.next/jbds-build/clean-eclipse/eclipse
[java] Java Result: 13
BUILD FAILED
/qa/hudson_ws/workspace/jbosstools-nightly-3.2.next/org.jboss.ide.eclipse.releng/builders/buildNightly.xml:18: The following error occurred while executing this line:
/qa/hudson_ws/workspace/jbosstools-nightly-3.2.next/org.jboss.ide.eclipse.releng/builders/build.xml:68: The following error occurred while executing this line:
/qa/hudson_ws/workspace/jbosstools-nightly-3.2.next/org.jboss.ide.eclipse.releng/builders/build.xml:27: The following error occurred while executing this line:
/qa/hudson_ws/workspace/jbosstools-nightly-3.2.next/org.jboss.ide.eclipse.releng/builders/build.xml:39: The following error occurred while executing this line:
/qa/hudson_ws/workspace/jbosstools-nightly-3.2.next/org.jboss.ide.eclipse.releng/builders/product/productBuild.xml:106: The following error occurred while executing this line:
/qa/hudson_ws/workspace/jbosstools-nightly-3.2.next/org.jboss.ide.eclipse.releng/builders/product/productBuild.xml:120: The following error occurred while executing this line:
/qa/hudson_ws/workspace/jbosstools-nightly-3.2.next/org.jboss.ide.eclipse.releng/builders/builder-wrap.xml:336: [exec] Result: 127
[eclipse.fetch] Missing directory entry: plugin(a)org.mozilla.xpcom.
[eclipse.fetch] Missing directory entry: bundle(a)org.mozilla.xpcom.
[eclipse.fetch] Missing directory entry: plugin(a)org.mozilla.xulrunner.carbon.macosx.
[eclipse.fetch] Missing directory entry: bundle(a)org.mozilla.xulrunner.carbon.macosx.
[eclipse.fetch] Missing directory entry: plugin(a)org.mozilla.xulrunner.cocoa.macosx.
[eclipse.fetch] Missing directory entry: bundle(a)org.mozilla.xulrunner.cocoa.macosx.
[eclipse.fetch] Missing directory entry: plugin(a)org.mozilla.xulrunner.gtk.linux.x86.
[eclipse.fetch] Missing directory entry: bundle(a)org.mozilla.xulrunner.gtk.linux.x86.
[eclipse.fetch] Missing directory entry: plugin(a)org.mozilla.xulrunner.gtk.linux.x86_64.
[eclipse.fetch] Missing directory entry: bundle(a)org.mozilla.xulrunner.gtk.linux.x86_64.
[eclipse.fetch] Missing directory entry: plugin(a)org.mozilla.xulrunner.win32.win32.x86.
[eclipse.fetch] Missing directory entry: bundle(a)org.mozilla.xulrunner.win32.win32.x86.
BUILD FAILED
/qa/hudson_ws/workspace/jbosstools-nightly-3.2.next/org.jboss.ide.eclipse.releng/builders/product/productBuild.xml:493: The following error occurred while executing this line:
/qa/hudson_ws/workspace/jbosstools-nightly-3.2.next/org.jboss.ide.eclipse.releng/builders/product/productBuild.xml:495: The following error occurred while executing this line:
/qa/hudson_ws/workspace/jbosstools-nightly-3.2.next/org.jboss.ide.eclipse.releng/builders/product/productBuild.xml:429: The following error occurred while executing this line:
/qa/hudson_ws/workspace/jbosstools-nightly-3.2.next/org.jboss.ide.eclipse.releng/builders/builder-wrap.xml:68: The following error occurred while executing this line:
/qa/hudson_ws/workspace/jbosstools-nightly-3.2.next/org.jboss.ide.eclipse.releng/builders/builder-wrap.xml:122: The following error occurred while executing this line:
/qa/hudson_ws/workspace/jbosstools-nightly-3.2.next/org.jboss.ide.eclipse.releng/builders/common/buildRequirements.xml:13: The following error occurred while executing this line:
/qa/hudson_ws/workspace/jbosstools-nightly-3.2.next/org.jboss.ide.eclipse.releng/builders/common/buildRequirements.xml:21: The following error occurred while executing this line:
/qa/hudson_ws/workspace/jbosstools-nightly-3.2.next/org.jboss.ide.eclipse.releng/builders/common/buildRequirements.xml:111: The following error occurred while executing this line:
/qa/hudson_ws/workspace/jbosstools-nightly-3.2.next/org.jboss.ide.eclipse.releng/requirements/swtbot/buildRequirement.xml:30: Error while expanding /qa/hudson_ws/workspace/jbosstools-nightly-3.2.next/jbds-build/requirements/swtbot/${build.archive}
java.io.FileNotFoundException: /qa/hudson_ws/workspace/jbosstools-nightly-3.2.next/jbds-build/requirements/swtbot/${build.archive} (No such file or directory)
Total time: 8 minutes 53 seconds
Total time: 9 minutes 20 seconds
Terminating xvnc.
[jbosstools-nightly-3.2.next] $ vncserver -kill :19
Killing Xvnc process ID 9346
Recording test results
Description not found.
Recording Emma reports jbds-build/coverage.xml
Recording plot data
No plot data file found: jbds-build/*/*/tests/test-results/emma-coverage/archives/lines.properties
No plot data file found: jbds-build/*/*/tests/test-results/emma-coverage/as/lines.properties
No plot data file found: jbds-build/*/*/tests/test-results/emma-coverage/hibernate-tools/lines.properties
No plot data file found: jbds-build/*/*/tests/test-results/emma-coverage/jbpm-convert/lines.properties
No plot data file found: jbds-build/*/*/tests/test-results/emma-coverage/jmx/lines.properties
No plot data file found: jbds-build/*/*/tests/test-results/emma-coverage/bpel/lines.properties
No plot data file found: jbds-build/*/*/tests/test-results/emma-coverage/common/lines.properties
No plot data file found: jbds-build/*/*/tests/test-results/emma-coverage/struts/lines.properties
No plot data file found: jbds-build/*/*/tests/test-results/emma-coverage/jsf/lines.properties
No plot data file found: jbds-build/*/*/tests/test-results/emma-coverage/jst/lines.properties
No plot data file found: jbds-build/*/*/tests/test-results/emma-coverage/seam/lines.properties
No plot data file found: jbds-build/*/*/tests/test-results/emma-coverage/drools-ide/lines.properties
No plot data file found: jbds-build/*/*/tests/test-results/emma-coverage/vpe/lines.properties
No plot data file found: jbds-build/*/*/tests/test-results/emma-coverage/esb/lines.properties
No plot data file found: jbds-build/*/*/tests/test-results/emma-coverage/freemarker/lines.properties
No plot data file found: jbds-build/*/*/tests/test-results/emma-coverage/birt/lines.properties
No plot data file found: jbds-build/*/*/tests/test-results/emma-coverage/smooks/lines.properties
No plot data file found: jbds-build/*/*/tests/test-results/emma-coverage/archives/classes.properties
No plot data file found: jbds-build/*/*/tests/test-results/emma-coverage/as/classes.properties
No plot data file found: jbds-build/*/*/tests/test-results/emma-coverage/hibernate-tools/classes.properties
No plot data file found: jbds-build/*/*/tests/test-results/emma-coverage/jbpm-convert/classes.properties
No plot data file found: jbds-build/*/*/tests/test-results/emma-coverage/jmx/classes.properties
No plot data file found: jbds-build/*/*/tests/test-results/emma-coverage/bpel/classes.properties
No plot data file found: jbds-build/*/*/tests/test-results/emma-coverage/common/classes.properties
No plot data file found: jbds-build/*/*/tests/test-results/emma-coverage/struts/classes.properties
No plot data file found: jbds-build/*/*/tests/test-results/emma-coverage/jsf/classes.properties
No plot data file found: jbds-build/*/*/tests/test-results/emma-coverage/jst/classes.properties
No plot data file found: jbds-build/*/*/tests/test-results/emma-coverage/seam/classes.properties
No plot data file found: jbds-build/*/*/tests/test-results/emma-coverage/drools-ide/classes.properties
No plot data file found: jbds-build/*/*/tests/test-results/emma-coverage/vpe/classes.properties
No plot data file found: jbds-build/*/*/tests/test-results/emma-coverage/esb/classes.properties
No plot data file found: jbds-build/*/*/tests/test-results/emma-coverage/freemarker/classes.properties
No plot data file found: jbds-build/*/*/tests/test-results/emma-coverage/birt/classes.properties
No plot data file found: jbds-build/*/*/tests/test-results/emma-coverage/smooks/classes.properties
Email was triggered for: Failure
There are 1 triggered emails.
Sending email for trigger: Failure
--------------------------------------------------
14 years, 9 months
[Still Failing] jbosstools-nightly-3.2.next #220
by jboss-qa-internal@redhat.com
Public:
https://hudson.jboss.org/hudson//job/jbosstools-nightly-3.2.next/220
https://hudson.jboss.org/hudson//job/jbosstools-nightly-3.2.next/220/test...
https://hudson.jboss.org/hudson//job/jbosstools-nightly-3.2.next/220/changes
https://hudson.jboss.org/hudson//job/jbosstools-nightly-3.2.next/220/console
Internal:
http://hudson.qa.jboss.com/hudson/job/jbosstools-nightly-3.2.next/220/
http://hudson.qa.jboss.com/hudson/job/jbosstools-nightly-3.2.next/220//te...
http://hudson.qa.jboss.com/hudson/job/jbosstools-nightly-3.2.next/220//ch...
http://hudson.qa.jboss.com/hudson/job/jbosstools-nightly-3.2.next/220//co...
--------------------------------------------------
Failed Tests:
No tests ran.
--------------------------------------------------
Changes:
--------------------------------------------------
Console log:
[...truncated 14288 lines...]
A jsf/tests/org.jboss.tools.jsf.vpe.jbpm.test/resources/jBPMTestProject/WebContent/pages
A jsf/tests/org.jboss.tools.jsf.vpe.jbpm.test/resources/jBPMTestProject/WebContent/pages/components
A jsf/tests/org.jboss.tools.jsf.vpe.jbpm.test/resources/jBPMTestProject/WebContent/pages/components/taskForm.xhtml.xml
A jsf/tests/org.jboss.tools.jsf.vpe.jbpm.test/resources/jBPMTestProject/WebContent/pages/components/transitionButton.xhtml.xml
A jsf/tests/org.jboss.tools.jsf.vpe.jbpm.test/resources/jBPMTestProject/WebContent/pages/components/taskForm.xhtml
A jsf/tests/org.jboss.tools.jsf.vpe.jbpm.test/resources/jBPMTestProject/WebContent/pages/components/transitionButton.xhtml
A jsf/tests/org.jboss.tools.jsf.vpe.jbpm.test/resources/jBPMTestProject/WebContent/pages/components/saveButton.xhtml.xml
A jsf/tests/org.jboss.tools.jsf.vpe.jbpm.test/resources/jBPMTestProject/WebContent/pages/components/saveButton.xhtml
A jsf/tests/org.jboss.tools.jsf.vpe.jbpm.test/resources/jBPMTestProject/WebContent/pages/components/cancelButton.xhtml.xml
A jsf/tests/org.jboss.tools.jsf.vpe.jbpm.test/resources/jBPMTestProject/WebContent/pages/components/cancelButton.xhtml
A jsf/tests/org.jboss.tools.jsf.vpe.jbpm.test/resources/jBPMTestProject/WebContent/META-INF
A jsf/tests/org.jboss.tools.jsf.vpe.jbpm.test/resources/jBPMTestProject/WebContent/META-INF/MANIFEST.MF
A jsf/tests/org.jboss.tools.jsf.vpe.jbpm.test/resources/jBPMTestProject/WebContent/WEB-INF
A jsf/tests/org.jboss.tools.jsf.vpe.jbpm.test/resources/jBPMTestProject/WebContent/WEB-INF/lib
A jsf/tests/org.jboss.tools.jsf.vpe.jbpm.test/resources/jBPMTestProject/WebContent/WEB-INF/classes
A jsf/tests/org.jboss.tools.jsf.vpe.jbpm.test/resources/jBPMTestProject/.settings
A jsf/tests/org.jboss.tools.jsf.vpe.jbpm.test/resources/jBPMTestProject/.settings/org.eclipse.jdt.core.prefs
A jsf/tests/org.jboss.tools.jsf.vpe.jbpm.test/resources/jBPMTestProject/.settings/org.eclipse.wst.jsdt.ui.superType.name
A jsf/tests/org.jboss.tools.jsf.vpe.jbpm.test/resources/jBPMTestProject/.settings/org.eclipse.wst.jsdt.ui.superType.container
A jsf/tests/org.jboss.tools.jsf.vpe.jbpm.test/resources/jBPMTestProject/.settings/org.eclipse.wst.common.project.facet.core.xml
A jsf/tests/org.jboss.tools.jsf.vpe.jbpm.test/resources/jBPMTestProject/.settings/.jsdtscope
A jsf/tests/org.jboss.tools.jsf.vpe.jbpm.test/resources/jBPMTestProject/.settings/org.eclipse.wst.common.component
A jsf/tests/org.jboss.tools.jsf.vpe.jbpm.test/about.html
A jsf/tests/org.jboss.tools.jsf.vpe.jbpm.test/plugin.xml
A jsf/tests/org.jboss.tools.jsf.vpe.jbpm.test/.settings
A jsf/tests/org.jboss.tools.jsf.vpe.jbpm.test/.settings/org.eclipse.jdt.core.prefs
A jsf/tests/org.jboss.tools.jsf.verification.test
A jsf/tests/org.jboss.tools.jsf.verification.test/.classpath
A jsf/tests/org.jboss.tools.jsf.verification.test/META-INF
A jsf/tests/org.jboss.tools.jsf.verification.test/META-INF/MANIFEST.MF
A jsf/tests/org.jboss.tools.jsf.verification.test/.project
A jsf/tests/org.jboss.tools.jsf.verification.test/src
A jsf/tests/org.jboss.tools.jsf.verification.test/src/org
A jsf/tests/org.jboss.tools.jsf.verification.test/src/org/jboss
A jsf/tests/org.jboss.tools.jsf.verification.test/src/org/jboss/tools
A jsf/tests/org.jboss.tools.jsf.verification.test/src/org/jboss/tools/jsf
A jsf/tests/org.jboss.tools.jsf.verification.test/src/org/jboss/tools/jsf/verification
A jsf/tests/org.jboss.tools.jsf.verification.test/src/org/jboss/tools/jsf/verification/test
A jsf/tests/org.jboss.tools.jsf.verification.test/src/org/jboss/tools/jsf/verification/test/JsfVerificationAllTests.java
A jsf/tests/org.jboss.tools.jsf.verification.test/src/org/jboss/tools/jsf/verification/test/JSFVerificationTest.java
A jsf/tests/org.jboss.tools.jsf.verification.test/plugin.properties
A jsf/tests/org.jboss.tools.jsf.verification.test/projects
A jsf/tests/org.jboss.tools.jsf.verification.test/projects/TestJSFVerification
A jsf/tests/org.jboss.tools.jsf.verification.test/projects/TestJSFVerification/.classpath
A jsf/tests/org.jboss.tools.jsf.verification.test/projects/TestJSFVerification/JavaSource
A jsf/tests/org.jboss.tools.jsf.verification.test/projects/TestJSFVerification/JavaSource/demo
A jsf/tests/org.jboss.tools.jsf.verification.test/projects/TestJSFVerification/JavaSource/demo/ConverterExample.java
A jsf/tests/org.jboss.tools.jsf.verification.test/projects/TestJSFVerification/JavaSource/demo/ActionListenerImpl.java
A jsf/tests/org.jboss.tools.jsf.verification.test/projects/TestJSFVerification/JavaSource/demo/NameBean.java
A jsf/tests/org.jboss.tools.jsf.verification.test/projects/TestJSFVerification/JavaSource/demo/PhaseListenerImpl.java
A jsf/tests/org.jboss.tools.jsf.verification.test/projects/TestJSFVerification/JavaSource/demo/bundle
A jsf/tests/org.jboss.tools.jsf.verification.test/projects/TestJSFVerification/JavaSource/demo/bundle/Messages.properties
A jsf/tests/org.jboss.tools.jsf.verification.test/projects/TestJSFVerification/ant
A jsf/tests/org.jboss.tools.jsf.verification.test/projects/TestJSFVerification/.project
A jsf/tests/org.jboss.tools.jsf.verification.test/projects/TestJSFVerification/WebContent
A jsf/tests/org.jboss.tools.jsf.verification.test/projects/TestJSFVerification/WebContent/pages
A jsf/tests/org.jboss.tools.jsf.verification.test/projects/TestJSFVerification/WebContent/pages/greeting.jsp
A jsf/tests/org.jboss.tools.jsf.verification.test/projects/TestJSFVerification/WebContent/pages/inputname.jsp
A jsf/tests/org.jboss.tools.jsf.verification.test/projects/TestJSFVerification/WebContent/META-INF
A jsf/tests/org.jboss.tools.jsf.verification.test/projects/TestJSFVerification/WebContent/META-INF/MANIFEST.MF
A jsf/tests/org.jboss.tools.jsf.verification.test/projects/TestJSFVerification/WebContent/index.jsp
A jsf/tests/org.jboss.tools.jsf.verification.test/projects/TestJSFVerification/WebContent/WEB-INF
A jsf/tests/org.jboss.tools.jsf.verification.test/projects/TestJSFVerification/WebContent/WEB-INF/.faces-config.xml.jsfdia
A jsf/tests/org.jboss.tools.jsf.verification.test/projects/TestJSFVerification/WebContent/WEB-INF/faces-config.xml
A jsf/tests/org.jboss.tools.jsf.verification.test/projects/TestJSFVerification/WebContent/WEB-INF/lib
A jsf/tests/org.jboss.tools.jsf.verification.test/projects/TestJSFVerification/WebContent/WEB-INF/lib/tmp
AU jsf/tests/org.jboss.tools.jsf.verification.test/projects/TestJSFVerification/WebContent/WEB-INF/lib/commons-collections.jar
AU jsf/tests/org.jboss.tools.jsf.verification.test/projects/TestJSFVerification/WebContent/WEB-INF/lib/jsf-api.jar
AU jsf/tests/org.jboss.tools.jsf.verification.test/projects/TestJSFVerification/WebContent/WEB-INF/lib/jstl.jar
AU jsf/tests/org.jboss.tools.jsf.verification.test/projects/TestJSFVerification/WebContent/WEB-INF/lib/commons-beanutils.jar
AU jsf/tests/org.jboss.tools.jsf.verification.test/projects/TestJSFVerification/WebContent/WEB-INF/lib/commons-digester.jar
AU jsf/tests/org.jboss.tools.jsf.verification.test/projects/TestJSFVerification/WebContent/WEB-INF/lib/commons-logging.jar
AU jsf/tests/org.jboss.tools.jsf.verification.test/projects/TestJSFVerification/WebContent/WEB-INF/lib/standard.jar
AU jsf/tests/org.jboss.tools.jsf.verification.test/projects/TestJSFVerification/WebContent/WEB-INF/lib/jsf-impl.jar
AU jsf/tests/org.jboss.tools.jsf.verification.test/projects/TestJSFVerification/WebContent/WEB-INF/lib/common-annotations.jar
A jsf/tests/org.jboss.tools.jsf.verification.test/projects/TestJSFVerification/WebContent/WEB-INF/web.xml
A jsf/tests/org.jboss.tools.jsf.verification.test/projects/TestJSFVerification/WebContent/WEB-INF/classes
A jsf/tests/org.jboss.tools.jsf.verification.test/projects/TestJSFVerification/testCases.xml
A jsf/tests/org.jboss.tools.jsf.verification.test/projects/TestJSFVerification/.settings
A jsf/tests/org.jboss.tools.jsf.verification.test/projects/TestJSFVerification/.settings/org.eclipse.jdt.core.prefs
A jsf/tests/org.jboss.tools.jsf.verification.test/projects/TestJSFVerification/.settings/org.jboss.tools.jst.web.xml
A jsf/tests/org.jboss.tools.jsf.verification.test/projects/TestJSFVerification/.settings/org.eclipse.wst.common.project.facet.core.xml
A jsf/tests/org.jboss.tools.jsf.verification.test/projects/TestJSFVerification/.settings/org.eclipse.jst.common.project.facet.core.prefs
A jsf/tests/org.jboss.tools.jsf.verification.test/projects/TestJSFVerification/.settings/org.eclipse.wst.common.component
A jsf/tests/org.jboss.tools.jsf.verification.test/build.properties
A jsf/tests/org.jboss.tools.jsf.verification.test/pom.xml
A jsf/tests/org.jboss.tools.jsf.verification.test/.cvsignore
A jsf/tests/org.jboss.tools.jsf.verification.test/about.html
A jsf/tests/org.jboss.tools.jsf.text.ext.test
A jsf/tests/org.jboss.tools.jsf.text.ext.test/.classpath
A jsf/tests/org.jboss.tools.jsf.text.ext.test/META-INF
A jsf/tests/org.jboss.tools.jsf.text.ext.test/META-INF/MANIFEST.MF
A jsf/tests/org.jboss.tools.jsf.text.ext.test/.project
A jsf/tests/org.jboss.tools.jsf.text.ext.test/src
A jsf/tests/org.jboss.tools.jsf.text.ext.test/src/org
A jsf/tests/org.jboss.tools.jsf.text.ext.test/src/org/jboss
A jsf/tests/org.jboss.tools.jsf.text.ext.test/src/org/jboss/tools
A jsf/tests/org.jboss.tools.jsf.text.ext.test/src/org/jboss/tools/jsf
A jsf/tests/org.jboss.tools.jsf.text.ext.test/src/org/jboss/tools/jsf/text
A jsf/tests/org.jboss.tools.jsf.text.ext.test/src/org/jboss/tools/jsf/text/ext
A jsf/tests/org.jboss.tools.jsf.text.ext.test/src/org/jboss/tools/jsf/text/ext/test
A jsf/tests/org.jboss.tools.jsf.text.ext.test/src/org/jboss/tools/jsf/text/ext/test/ELExprPartitionerTest.java
A jsf/tests/org.jboss.tools.jsf.text.ext.test/src/org/jboss/tools/jsf/text/ext/test/JsfTextExtAllTests.java
A jsf/tests/org.jboss.tools.jsf.text.ext.test/plugin.properties
A jsf/tests/org.jboss.tools.jsf.text.ext.test/projects
A jsf/tests/org.jboss.tools.jsf.text.ext.test/projects/numberguess
A jsf/tests/org.jboss.tools.jsf.text.ext.test/projects/numberguess/.classpath
A jsf/tests/org.jboss.tools.jsf.text.ext.test/projects/numberguess/.project
A jsf/tests/org.jboss.tools.jsf.text.ext.test/projects/numberguess/src
A jsf/tests/org.jboss.tools.jsf.text.ext.test/projects/numberguess/src/demo
A jsf/tests/org.jboss.tools.jsf.text.ext.test/projects/numberguess/src/demo/Name.java
A jsf/tests/org.jboss.tools.jsf.text.ext.test/projects/numberguess/src/demo/bundle
A jsf/tests/org.jboss.tools.jsf.text.ext.test/projects/numberguess/src/demo/bundle/Messages.properties
A jsf/tests/org.jboss.tools.jsf.text.ext.test/projects/numberguess/src/org
A jsf/tests/org.jboss.tools.jsf.text.ext.test/projects/numberguess/src/org/jboss
A jsf/tests/org.jboss.tools.jsf.text.ext.test/projects/numberguess/src/org/jboss/seam
A jsf/tests/org.jboss.tools.jsf.text.ext.test/projects/numberguess/src/org/jboss/seam/example
A jsf/tests/org.jboss.tools.jsf.text.ext.test/projects/numberguess/src/org/jboss/seam/example/numberguess
A jsf/tests/org.jboss.tools.jsf.text.ext.test/projects/numberguess/src/org/jboss/seam/example/numberguess/NumberGuess.java
A jsf/tests/org.jboss.tools.jsf.text.ext.test/projects/numberguess/web
A jsf/tests/org.jboss.tools.jsf.text.ext.test/projects/numberguess/web/META-INF
A jsf/tests/org.jboss.tools.jsf.text.ext.test/projects/numberguess/web/META-INF/MANIFEST.MF
A jsf/tests/org.jboss.tools.jsf.text.ext.test/projects/numberguess/web/giveup.jspx
A jsf/tests/org.jboss.tools.jsf.text.ext.test/projects/numberguess/web/WEB-INF
A jsf/tests/org.jboss.tools.jsf.text.ext.test/projects/numberguess/web/WEB-INF/.faces-config.xml.jsfdia
A jsf/tests/org.jboss.tools.jsf.text.ext.test/projects/numberguess/web/WEB-INF/faces-config.xml
A jsf/tests/org.jboss.tools.jsf.text.ext.test/projects/numberguess/web/WEB-INF/components.xml
A jsf/tests/org.jboss.tools.jsf.text.ext.test/projects/numberguess/web/WEB-INF/lib
AU jsf/tests/org.jboss.tools.jsf.text.ext.test/projects/numberguess/web/WEB-INF/lib/jboss-seam.jar
A jsf/tests/org.jboss.tools.jsf.text.ext.test/projects/numberguess/web/WEB-INF/web.xml
A jsf/tests/org.jboss.tools.jsf.text.ext.test/projects/numberguess/web/WEB-INF/pages.xml
A jsf/tests/org.jboss.tools.jsf.text.ext.test/projects/numberguess/.settings
A jsf/tests/org.jboss.tools.jsf.text.ext.test/projects/numberguess/.settings/org.eclipse.jdt.core.prefs
A jsf/tests/org.jboss.tools.jsf.text.ext.test/projects/numberguess/.settings/org.jboss.tools.jst.web.xml
A jsf/tests/org.jboss.tools.jsf.text.ext.test/projects/numberguess/.settings/org.eclipse.wst.common.project.facet.core.xml
A jsf/tests/org.jboss.tools.jsf.text.ext.test/projects/numberguess/.settings/org.eclipse.jst.common.project.facet.core.prefs
A jsf/tests/org.jboss.tools.jsf.text.ext.test/projects/numberguess/.settings/org.eclipse.wst.common.component
A jsf/tests/org.jboss.tools.jsf.text.ext.test/projects/jsfHyperlinkTests
AU jsf/tests/org.jboss.tools.jsf.text.ext.test/projects/jsfHyperlinkTests/.classpath
A jsf/tests/org.jboss.tools.jsf.text.ext.test/projects/jsfHyperlinkTests/JavaSource
A jsf/tests/org.jboss.tools.jsf.text.ext.test/projects/jsfHyperlinkTests/JavaSource/org
A jsf/tests/org.jboss.tools.jsf.text.ext.test/projects/jsfHyperlinkTests/JavaSource/org/jboss
A jsf/tests/org.jboss.tools.jsf.text.ext.test/projects/jsfHyperlinkTests/JavaSource/org/jboss/jsf
A jsf/tests/org.jboss.tools.jsf.text.ext.test/projects/jsfHyperlinkTests/JavaSource/org/jboss/jsf/tests
AU jsf/tests/org.jboss.tools.jsf.text.ext.test/projects/jsfHyperlinkTests/JavaSource/org/jboss/jsf/tests/Bean1.java
AU jsf/tests/org.jboss.tools.jsf.text.ext.test/projects/jsfHyperlinkTests/JavaSource/org/jboss/jsf/tests/Bean2.java
AU jsf/tests/org.jboss.tools.jsf.text.ext.test/projects/jsfHyperlinkTests/JavaSource/org/jboss/jsf/tests/Bean3.java
AU jsf/tests/org.jboss.tools.jsf.text.ext.test/projects/jsfHyperlinkTests/JavaSource/org/jboss/jsf/tests/Bean4.java
AU jsf/tests/org.jboss.tools.jsf.text.ext.test/projects/jsfHyperlinkTests/JavaSource/org/jboss/jsf/tests/Bean5.java
AU jsf/tests/org.jboss.tools.jsf.text.ext.test/projects/jsfHyperlinkTests/JavaSource/org/jboss/jsf/tests/Bean6.java
AU jsf/tests/org.jboss.tools.jsf.text.ext.test/projects/jsfHyperlinkTests/JavaSource/org/jboss/jsf/tests/Bean7.java
A jsf/tests/org.jboss.tools.jsf.text.ext.test/projects/jsfHyperlinkTests/ant
AU jsf/tests/org.jboss.tools.jsf.text.ext.test/projects/jsfHyperlinkTests/ant/build.properties
AU jsf/tests/org.jboss.tools.jsf.text.ext.test/projects/jsfHyperlinkTests/ant/build.xml
AU jsf/tests/org.jboss.tools.jsf.text.ext.test/projects/jsfHyperlinkTests/.project
A jsf/tests/org.jboss.tools.jsf.text.ext.test/projects/jsfHyperlinkTests/WebContent
A jsf/tests/org.jboss.tools.jsf.text.ext.test/projects/jsfHyperlinkTSCM check out aborted
Recording test results
ests/WebContent/META-INF
AU jsf/tests/org.jboss.tools.jsf.text.ext.test/projects/jsfHyperlinkTests/WebContent/META-INF/MANIFEST.MF
A jsf/tests/org.jboss.tools.jsf.text.ext.test/projects/jsfHyperlinkTests/WebContent/WEB-INF
AU jsf/tests/org.jboss.tools.jsf.text.ext.test/projects/jsfHyperlinkTests/WebContent/WEB-INF/faces-config.xml
AU jsf/tests/org.jboss.tools.jsf.text.ext.test/projects/jsfHyperlinkTests/WebContent/WEB-INF/faces-config1.xml
AU jsf/tests/org.jboss.tools.jsf.text.ext.test/projects/jsfHyperlinkTests/WebContent/WEB-INF/faces-config2.xml
A jsf/tests/org.jboss.tools.jsf.text.ext.test/projects/jsfHyperlinkTests/WebContent/WEB-INF/lib
AU jsf/tests/org.jboss.tools.jsf.text.ext.test/projects/jsfHyperlinkTests/WebContent/WEB-INF/lib/jsf-tlds.jar
ERROR: Failed to check out http://anonsvn.jboss.org/repos/jbosstools/trunk
org.tmatesoft.svn.core.SVNCancelException: svn: Operation cancelled
at org.tmatesoft.svn.core.internal.wc.SVNErrorManager.error(SVNErrorManager.java:60)
at org.tmatesoft.svn.core.internal.wc.SVNErrorManager.error(SVNErrorManager.java:51)
at org.tmatesoft.svn.core.internal.io.dav.http.HTTPConnection.request(HTTPConnection.java:610)
at org.tmatesoft.svn.core.internal.io.dav.http.HTTPConnection.request(HTTPConnection.java:273)
at org.tmatesoft.svn.core.internal.io.dav.http.HTTPConnection.request(HTTPConnection.java:261)
at org.tmatesoft.svn.core.internal.io.dav.DAVConnection.doReport(DAVConnection.java:266)
at org.tmatesoft.svn.core.internal.io.dav.DAVRepository.runReport(DAVRepository.java:1263)
at org.tmatesoft.svn.core.internal.io.dav.DAVRepository.update(DAVRepository.java:820)
at org.tmatesoft.svn.core.wc.SVNUpdateClient.update(SVNUpdateClient.java:558)
at org.tmatesoft.svn.core.wc.SVNUpdateClient.doCheckout(SVNUpdateClient.java:914)
at hudson.scm.SubversionSCM$CheckOutTask.invoke(SubversionSCM.java:675)
at hudson.scm.SubversionSCM$CheckOutTask.invoke(SubversionSCM.java:595)
at hudson.FilePath$FileCallableWrapper.call(FilePath.java:1962)
at hudson.remoting.UserRequest.perform(UserRequest.java:104)
at hudson.remoting.UserRequest.perform(UserRequest.java:48)
at hudson.remoting.Request$2.run(Request.java:270)
at java.util.concurrent.Executors$RunnableAdapter.call(Executors.java:441)
at java.util.concurrent.FutureTask$Sync.innerRun(FutureTask.java:303)
at java.util.concurrent.FutureTask.run(FutureTask.java:138)
at java.util.concurrent.ThreadPoolExecutor$Worker.runTask(ThreadPoolExecutor.java:886)
at java.util.concurrent.ThreadPoolExecutor$Worker.run(ThreadPoolExecutor.java:908)
at java.lang.Thread.run(Thread.java:619)
Description not found.
Recording Emma reports jbds-build/coverage.xml
ERROR: Publisher hudson.plugins.emma.EmmaPublisher aborted due to exception
java.lang.InterruptedException
at java.lang.Object.wait(Native Method)
at hudson.remoting.Request.call(Request.java:122)
at hudson.remoting.Channel.call(Channel.java:551)
at hudson.FilePath.act(FilePath.java:683)
at hudson.FilePath.act(FilePath.java:676)
at hudson.FilePath.exists(FilePath.java:944)
at hudson.plugins.emma.EmmaPublisher.perform(EmmaPublisher.java:54)
at hudson.tasks.BuildStepMonitor$3.perform(BuildStepMonitor.java:36)
at hudson.model.AbstractBuild$AbstractRunner.perform(AbstractBuild.java:582)
at hudson.model.AbstractBuild$AbstractRunner.performAllBuildStep(AbstractBuild.java:563)
at hudson.model.AbstractBuild$AbstractRunner.performAllBuildStep(AbstractBuild.java:550)
at hudson.model.Build$RunnerImpl.post2(Build.java:152)
at hudson.model.AbstractBuild$AbstractRunner.post(AbstractBuild.java:528)
at hudson.model.Run.run(Run.java:1221)
at hudson.model.FreeStyleBuild.run(FreeStyleBuild.java:46)
at hudson.model.ResourceController.execute(ResourceController.java:88)
at hudson.model.Executor.run(Executor.java:122)
Recording plot data
No plot data file found: jbds-build/*/*/tests/test-results/emma-coverage/archives/lines.properties
No plot data file found: jbds-build/*/*/tests/test-results/emma-coverage/as/lines.properties
No plot data file found: jbds-build/*/*/tests/test-results/emma-coverage/hibernate-tools/lines.properties
No plot data file found: jbds-build/*/*/tests/test-results/emma-coverage/jbpm-convert/lines.properties
No plot data file found: jbds-build/*/*/tests/test-results/emma-coverage/jmx/lines.properties
No plot data file found: jbds-build/*/*/tests/test-results/emma-coverage/bpel/lines.properties
No plot data file found: jbds-build/*/*/tests/test-results/emma-coverage/common/lines.properties
No plot data file found: jbds-build/*/*/tests/test-results/emma-coverage/struts/lines.properties
No plot data file found: jbds-build/*/*/tests/test-results/emma-coverage/jsf/lines.properties
No plot data file found: jbds-build/*/*/tests/test-results/emma-coverage/jst/lines.properties
No plot data file found: jbds-build/*/*/tests/test-results/emma-coverage/seam/lines.properties
No plot data file found: jbds-build/*/*/tests/test-results/emma-coverage/drools-ide/lines.properties
No plot data file found: jbds-build/*/*/tests/test-results/emma-coverage/vpe/lines.properties
No plot data file found: jbds-build/*/*/tests/test-results/emma-coverage/esb/lines.properties
No plot data file found: jbds-build/*/*/tests/test-results/emma-coverage/freemarker/lines.properties
No plot data file found: jbds-build/*/*/tests/test-results/emma-coverage/birt/lines.properties
No plot data file found: jbds-build/*/*/tests/test-results/emma-coverage/smooks/lines.properties
No plot data file found: jbds-build/*/*/tests/test-results/emma-coverage/archives/classes.properties
No plot data file found: jbds-build/*/*/tests/test-results/emma-coverage/as/classes.properties
No plot data file found: jbds-build/*/*/tests/test-results/emma-coverage/hibernate-tools/classes.properties
No plot data file found: jbds-build/*/*/tests/test-results/emma-coverage/jbpm-convert/classes.properties
No plot data file found: jbds-build/*/*/tests/test-results/emma-coverage/jmx/classes.properties
No plot data file found: jbds-build/*/*/tests/test-results/emma-coverage/bpel/classes.properties
No plot data file found: jbds-build/*/*/tests/test-results/emma-coverage/common/classes.properties
No plot data file found: jbds-build/*/*/tests/test-results/emma-coverage/struts/classes.properties
No plot data file found: jbds-build/*/*/tests/test-results/emma-coverage/jsf/classes.properties
No plot data file found: jbds-build/*/*/tests/test-results/emma-coverage/jst/classes.properties
No plot data file found: jbds-build/*/*/tests/test-results/emma-coverage/seam/classes.properties
No plot data file found: jbds-build/*/*/tests/test-results/emma-coverage/drools-ide/classes.properties
No plot data file found: jbds-build/*/*/tests/test-results/emma-coverage/vpe/classes.properties
No plot data file found: jbds-build/*/*/tests/test-results/emma-coverage/esb/classes.properties
No plot data file found: jbds-build/*/*/tests/test-results/emma-coverage/freemarker/classes.properties
No plot data file found: jbds-build/*/*/tests/test-results/emma-coverage/birt/classes.properties
No plot data file found: jbds-build/*/*/tests/test-results/emma-coverage/smooks/classes.properties
Email was triggered for: Failure
There are 1 triggered emails.
Sending email for trigger: Failure
--------------------------------------------------
14 years, 9 months
[Still Failing] devstudio-nightly-3.1.0.beta1 #298
by jboss-qa-internal@redhat.com
Public:
https://hudson.jboss.org/hudson//job/devstudio-nightly-3.1.0.beta1/298
https://hudson.jboss.org/hudson//job/devstudio-nightly-3.1.0.beta1/298/te...
https://hudson.jboss.org/hudson//job/devstudio-nightly-3.1.0.beta1/298/ch...
https://hudson.jboss.org/hudson//job/devstudio-nightly-3.1.0.beta1/298/co...
Internal:
http://hudson.qa.jboss.com/hudson/job/devstudio-nightly-3.1.0.beta1/298/
http://hudson.qa.jboss.com/hudson/job/devstudio-nightly-3.1.0.beta1/298//...
http://hudson.qa.jboss.com/hudson/job/devstudio-nightly-3.1.0.beta1/298//...
http://hudson.qa.jboss.com/hudson/job/devstudio-nightly-3.1.0.beta1/298//...
--------------------------------------------------
Failed Tests:
No tests ran.
--------------------------------------------------
Changes:
[nickboldt] merge from branch
[nickboldt] fix pom version
[nickboldt] special case - repo does not have root eclipse/ folder
[nickboldt] special case - repo does not have root eclipse/ folder
--------------------------------------------------
Console log:
[...truncated 67713 lines...]
[java]
[java] assemble:
[java]
[java] preAssemble:
[java]
[java] allElements:
[java]
[java] init:
[java]
[java] assembleElement:
[java]
[java] main:
[java]
[java] assemble.org.jboss.tools.birt.feature:
[java]
[java] main:
[java] [mkdir] Created dir: /home/hudson/hudson_workspace/workspace/devstudio-nightly-3.1.0.beta1/jbds-build/eclipse/tmp
[java]
[java] gather.bin.parts:
[java]
[java] properties:
[java]
[java] init:
[java]
[java] gather.bin.parts:
[java] [mkdir] Created dir: /home/hudson/hudson_workspace/workspace/devstudio-nightly-3.1.0.beta1/jbds-build/eclipse/tmp/plugins/org.jboss.tools.birt.oda_1.1.0.v201005180112N-H298-GA
[java] [copy] Copying 19 files to /home/hudson/hudson_workspace/workspace/devstudio-nightly-3.1.0.beta1/jbds-build/eclipse/tmp/plugins/org.jboss.tools.birt.oda_1.1.0.v201005180112N-H298-GA
[java] [copy] Copying 3 files to /home/hudson/hudson_workspace/workspace/devstudio-nightly-3.1.0.beta1/jbds-build/eclipse/tmp/plugins/org.jboss.tools.birt.oda_1.1.0.v201005180112N-H298-GA
[java]
[java] apitools.generation:
[java]
[java] customAssembly:
[java]
[java] properties:
[java]
[java] init:
[java]
[java] gather.bin.parts:
[java] [mkdir] Created dir: /home/hudson/hudson_workspace/workspace/devstudio-nightly-3.1.0.beta1/jbds-build/eclipse/tmp/plugins/org.jboss.tools.birt.oda.ui_1.1.0.v201005180112N-H298-GA
[java] [copy] Copying 21 files to /home/hudson/hudson_workspace/workspace/devstudio-nightly-3.1.0.beta1/jbds-build/eclipse/tmp/plugins/org.jboss.tools.birt.oda.ui_1.1.0.v201005180112N-H298-GA
[java] [copy] Copying 11 files to /home/hudson/hudson_workspace/workspace/devstudio-nightly-3.1.0.beta1/jbds-build/eclipse/tmp/plugins/org.jboss.tools.birt.oda.ui_1.1.0.v201005180112N-H298-GA
[java]
[java] apitools.generation:
[java]
[java] customAssembly:
[java]
[java] properties:
[java]
[java] init:
[java]
[java] gather.bin.parts:
[java] [mkdir] Created dir: /home/hudson/hudson_workspace/workspace/devstudio-nightly-3.1.0.beta1/jbds-build/eclipse/tmp/plugins/org.jboss.tools.birt.core_1.1.0.v201005180112N-H298-GA
[java] [copy] Copying 13 files to /home/hudson/hudson_workspace/workspace/devstudio-nightly-3.1.0.beta1/jbds-build/eclipse/tmp/plugins/org.jboss.tools.birt.core_1.1.0.v201005180112N-H298-GA
[java] [copy] Copying 5 files to /home/hudson/hudson_workspace/workspace/devstudio-nightly-3.1.0.beta1/jbds-build/eclipse/tmp/plugins/org.jboss.tools.birt.core_1.1.0.v201005180112N-H298-GA
[java]
[java] apitools.generation:
[java]
[java] customAssembly:
[java]
[java] init:
[java]
[java] gather.bin.parts:
[java] [mkdir] Created dir: /home/hudson/hudson_workspace/workspace/devstudio-nightly-3.1.0.beta1/jbds-build/eclipse/tmp/features/org.jboss.tools.birt.feature_1.1.0.v201005180112N-H298-GA
[java]
[java] children:
[java] [copy] Copying 4 files to /home/hudson/hudson_workspace/workspace/devstudio-nightly-3.1.0.beta1/jbds-build/eclipse/tmp/features/org.jboss.tools.birt.feature_1.1.0.v201005180112N-H298-GA
[java]
[java] rootFiles:
[java]
[java] rootFiles*_*_*:
[java]
[java] customAssembly:
[java]
[java] customAssembly:
[java]
[java] jar.processing:
[java]
[java] jarUp:
[java]
[java] jarIng:
[java] [jar] Building jar: /home/hudson/hudson_workspace/workspace/devstudio-nightly-3.1.0.beta1/jbds-build/eclipse/tmp/plugins/org.jboss.tools.birt.oda_1.1.0.v201005180112N-H298-GA.jar
[java] [delete] Deleting directory /home/hudson/hudson_workspace/workspace/devstudio-nightly-3.1.0.beta1/jbds-build/eclipse/tmp/plugins/org.jboss.tools.birt.oda_1.1.0.v201005180112N-H298-GA
[java]
[java] jarUp:
[java]
[java] jarIng:
[java] [jar] Building jar: /home/hudson/hudson_workspace/workspace/devstudio-nightly-3.1.0.beta1/jbds-build/eclipse/tmp/plugins/org.jboss.tools.birt.oda.ui_1.1.0.v201005180112N-H298-GA.jar
[java] [delete] Deleting directory /home/hudson/hudson_workspace/workspace/devstudio-nightly-3.1.0.beta1/jbds-build/eclipse/tmp/plugins/org.jboss.tools.birt.oda.ui_1.1.0.v201005180112N-H298-GA
[java]
[java] jarUp:
[java]
[java] jarIng:
[java] [jar] Building jar: /home/hudson/hudson_workspace/workspace/devstudio-nightly-3.1.0.beta1/jbds-build/eclipse/tmp/plugins/org.jboss.tools.birt.core_1.1.0.v201005180112N-H298-GA.jar
[java] [delete] Deleting directory /home/hudson/hudson_workspace/workspace/devstudio-nightly-3.1.0.beta1/jbds-build/eclipse/tmp/plugins/org.jboss.tools.birt.core_1.1.0.v201005180112N-H298-GA
[java]
[java] customAssembly:
[java]
[java] generate.p2.metadata:
[java]
[java] assemble.archive:
[java]
[java] customAssembly:
[java]
[java] cleanup.assembly:
[java] [delete] Deleting directory /home/hudson/hudson_workspace/workspace/devstudio-nightly-3.1.0.beta1/jbds-build/eclipse/tmp
[java]
[java] generate.p2.metadata:
[java]
[java] postAssemble:
[java]
[java] package:
[java]
[java] postBuild:
[java]
[java] postBuild:
[java] [echo] /home/hudson/hudson_workspace/workspace/devstudio-nightly-3.1.0.beta1/jbds-build/3.1.0.beta1/201005180112/birt
[java]
[java] build-builder:
[java] [echo] Requirements: eclipse,birt,dtp,emf,gef,m2eclipse,swtbot,testframework,tptp,webtools,xsd
[java] [echo] load properties from /home/hudson/hudson_workspace/workspace/devstudio-nightly-3.1.0.beta1/org.jboss.ide.eclipse.releng/requirements/eclipse/return.properties
[java] [echo] load properties from /home/hudson/hudson_workspace/workspace/devstudio-nightly-3.1.0.beta1/org.jboss.ide.eclipse.releng/requirements/birt/return.properties
[java] [echo] load properties from /home/hudson/hudson_workspace/workspace/devstudio-nightly-3.1.0.beta1/org.jboss.ide.eclipse.releng/requirements/dtp/return.properties
[java] [echo] load properties from /home/hudson/hudson_workspace/workspace/devstudio-nightly-3.1.0.beta1/org.jboss.ide.eclipse.releng/requirements/emf/return.properties
[java] [echo] load properties from /home/hudson/hudson_workspace/workspace/devstudio-nightly-3.1.0.beta1/org.jboss.ide.eclipse.releng/requirements/gef/return.properties
[java] [echo] /home/hudson/hudson_workspace/workspace/devstudio-nightly-3.1.0.beta1/org.jboss.ide.eclipse.releng/requirements/m2eclipse/return.properties is not available
[java]
[java] init:
[java]
[java] check.archive:
[java] [echo] Checking the requirement's archive m2eclipse-0.10.0.20100209-0800.zip
[java] [echo] Archive is downloaded and MD5 checksum is provided
[java] [echo] Downloaded archive is correct, download is not required
[java]
[java] download.archive:
[java]
[java] unzip.archive:
[java]
[java] unpack-zip:
[java] [unzip] Expanding: /home/hudson/hudson_workspace/workspace/devstudio-nightly-3.1.0.beta1/jbds-build/requirements/m2eclipse/m2eclipse-0.10.0.20100209-0800.zip into /home/hudson/hudson_workspace/workspace/devstudio-nightly-3.1.0.beta1/jbds-build/clean-eclipse
[java]
[java] post.unpack.requirement:
[java]
[java] build.driver:
[java]
[java] build.requirement:
[java] [echo] load properties from /home/hudson/hudson_workspace/workspace/devstudio-nightly-3.1.0.beta1/org.jboss.ide.eclipse.releng/requirements/m2eclipse/return.properties
[java] [echo] /home/hudson/hudson_workspace/workspace/devstudio-nightly-3.1.0.beta1/org.jboss.ide.eclipse.releng/requirements/swtbot/return.properties is not available
[java]
[java] build.requirement:
[java]
[java] init:
[java]
[java] check.archive:
[java] [echo] Checking the requirement's archive org.eclipse.swtbot.eclipse.test.junit4-2.0.0.536-dev-e35.zip
[java] [echo] Archive is downloaded and MD5 checksum is provided
[java] [echo] Downloaded archive is correct, download is not required
[java]
[java] download.archive:
[java]
[java] unzip.archive:
[java]
[java] unpack-zip:
[java] [unzip] Expanding: /home/hudson/hudson_workspace/workspace/devstudio-nightly-3.1.0.beta1/jbds-build/requirements/swtbot/org.eclipse.swtbot.eclipse.test.junit4-2.0.0.536-dev-e35.zip into /home/hudson/hudson_workspace/workspace/devstudio-nightly-3.1.0.beta1/jbds-build/clean-eclipse
[java]
[java] post.unpack.requirement:
[java]
[java] build.driver:
[java]
[java] init:
[java]
[java] check.archive:
[java] [echo] Checking the requirement's archive org.eclipse.swtbot.eclipse.gef-2.0.0.536-dev-e35.zip
[java] [echo] Archive is downloaded and MD5 checksum is provided
[java] [echo] Downloaded archive is correct, download is not required
[java]
[java] download.archive:
[java]
[java] unzip.archive:
[java]
[java] unpack-zip:
[java] [unzip] Expanding: /home/hudson/hudson_workspace/workspace/devstudio-nightly-3.1.0.beta1/jbds-build/requirements/swtbot/org.eclipse.swtbot.eclipse.gef-2.0.0.536-dev-e35.zip into /home/hudson/hudson_workspace/workspace/devstudio-nightly-3.1.0.beta1/jbds-build/clean-eclipse
[java]
[java] post.unpack.requirement:
[java]
[java] build.driver:
[java]
[java] init:
[java]
[java] check.archive:
[java] [echo] Checking the requirement's archive org.eclipse.swtbot.eclipse-2.0.0.536-dev-e35.zip
[java] [echo] Archive is downloaded and MD5 checksum is provided
[java] [echo] Downloaded archive is correct, download is not required
[java]
[java] download.archive:
[java]
[java] unzip.archive:
[java]
[java] unpack-zip:
[java] [unzip] Expanding: /home/hudson/hudson_workspace/workspace/devstudio-nightly-3.1.0.beta1/jbds-build/requirements/swtbot/org.eclipse.swtbot.eclipse-2.0.0.536-dev-e35.zip into /home/hudson/hudson_workspace/workspace/devstudio-nightly-3.1.0.beta1/jbds-build/clean-eclipse
[java]
[java] post.unpack.requirement:
[java]
[java] build.driver:
[java] Java Result: 13
BUILD FAILED
/qa/services/hudson/hudson_workspace/workspace/devstudio-nightly-3.1.0.beta1/org.jboss.ide.eclipse.releng/builders/buildNightly.xml:18: The following error occurred while executing this line:
/qa/services/hudson/hudson_workspace/workspace/devstudio-nightly-3.1.0.beta1/org.jboss.ide.eclipse.releng/builders/build.xml:68: The following error occurred while executing this line:
/qa/services/hudson/hudson_workspace/workspace/devstudio-nightly-3.1.0.beta1/org.jboss.ide.eclipse.releng/builders/build.xml:27: The following error occurred while executing this line:
/qa/services/hudson/hudson_workspace/workspace/devstudio-nightly-3.1.0.beta1/org.jboss.ide.eclipse.releng/builders/build.xml:39: The following error occurred while executing this line:
/qa/services/hudson/hudson_workspace/workspace/devstudio-nightly-3.1.0.beta1/org.jboss.ide.eclipse.releng/builders/product/productBuild.xml:106: The following error occurred while executing this line:
/qa/services/hudson/hudson_workspace/workspace/devstudio-nightly-3.1.0.beta1/org.jboss.ide.eclipse.releng/builders/product/productBuild.xml:120: The following error occurred while executing this line:
/qa/services/hudson/hudson_workspace/workspace/devstudio-nightly-3.1.0.beta1/org.jboss.ide.eclipse.releng/builders/builder-wrap.xml:336: [eclipse.fetch] Missing directory entry: plugin(a)org.mozilla.xpcom.
[eclipse.fetch] Missing directory entry: bundle(a)org.mozilla.xpcom.
[eclipse.fetch] Missing directory entry: plugin(a)org.mozilla.xulrunner.carbon.macosx.
[eclipse.fetch] Missing directory entry: bundle(a)org.mozilla.xulrunner.carbon.macosx.
[eclipse.fetch] Missing directory entry: plugin(a)org.mozilla.xulrunner.cocoa.macosx.
[eclipse.fetch] Missing directory entry: bundle(a)org.mozilla.xulrunner.cocoa.macosx.
[eclipse.fetch] Missing directory entry: plugin(a)org.mozilla.xulrunner.gtk.linux.x86.
[eclipse.fetch] Missing directory entry: bundle(a)org.mozilla.xulrunner.gtk.linux.x86.
[eclipse.fetch] Missing directory entry: plugin(a)org.mozilla.xulrunner.gtk.linux.x86_64.
[eclipse.fetch] Missing directory entry: bundle(a)org.mozilla.xulrunner.gtk.linux.x86_64.
[eclipse.fetch] Missing directory entry: plugin(a)org.mozilla.xulrunner.win32.win32.x86.
[eclipse.fetch] Missing directory entry: bundle(a)org.mozilla.xulrunner.win32.win32.x86.
[exec] Result: 127
BUILD FAILED
/qa/services/hudson/hudson_workspace/workspace/devstudio-nightly-3.1.0.beta1/org.jboss.ide.eclipse.releng/builders/product/productBuild.xml:493: The following error occurred while executing this line:
/qa/services/hudson/hudson_workspace/workspace/devstudio-nightly-3.1.0.beta1/org.jboss.ide.eclipse.releng/builders/product/productBuild.xml:495: The following error occurred while executing this line:
/qa/services/hudson/hudson_workspace/workspace/devstudio-nightly-3.1.0.beta1/org.jboss.ide.eclipse.releng/builders/product/productBuild.xml:429: The following error occurred while executing this line:
/home/hudson/hudson_workspace/workspace/devstudio-nightly-3.1.0.beta1/org.jboss.ide.eclipse.releng/builders/builder-wrap.xml:68: The following error occurred while executing this line:
/home/hudson/hudson_workspace/workspace/devstudio-nightly-3.1.0.beta1/org.jboss.ide.eclipse.releng/builders/builder-wrap.xml:122: The following error occurred while executing this line:
/qa/services/hudson/hudson_workspace/workspace/devstudio-nightly-3.1.0.beta1/org.jboss.ide.eclipse.releng/builders/common/buildRequirements.xml:13: The following error occurred while executing this line:
/qa/services/hudson/hudson_workspace/workspace/devstudio-nightly-3.1.0.beta1/org.jboss.ide.eclipse.releng/builders/common/buildRequirements.xml:21: The following error occurred while executing this line:
/qa/services/hudson/hudson_workspace/workspace/devstudio-nightly-3.1.0.beta1/org.jboss.ide.eclipse.releng/builders/common/buildRequirements.xml:111: The following error occurred while executing this line:
/home/hudson/hudson_workspace/workspace/devstudio-nightly-3.1.0.beta1/org.jboss.ide.eclipse.releng/requirements/swtbot/buildRequirement.xml:23: antcall doesn't support the nested "property" element.
Total time: 16 minutes 38 seconds
Total time: 17 minutes 22 seconds
Terminating xvnc.
[devstudio-nightly-3.1.0.beta1] $ vncserver -kill :19
Killing Xvnc process ID 23827
Recording test results
Description not found.
Recording Emma reports jbds-build/coverage.xml
Email was triggered for: Failure
There are 1 triggered emails.
Sending email for trigger: Failure
--------------------------------------------------
14 years, 9 months
[Still Failing] devstudio-nightly-3.1.0.beta1 #297
by jboss-qa-internal@redhat.com
Public:
https://hudson.jboss.org/hudson//job/devstudio-nightly-3.1.0.beta1/297
https://hudson.jboss.org/hudson//job/devstudio-nightly-3.1.0.beta1/297/te...
https://hudson.jboss.org/hudson//job/devstudio-nightly-3.1.0.beta1/297/ch...
https://hudson.jboss.org/hudson//job/devstudio-nightly-3.1.0.beta1/297/co...
Internal:
http://hudson.qa.jboss.com/hudson/job/devstudio-nightly-3.1.0.beta1/297/
http://hudson.qa.jboss.com/hudson/job/devstudio-nightly-3.1.0.beta1/297//...
http://hudson.qa.jboss.com/hudson/job/devstudio-nightly-3.1.0.beta1/297//...
http://hudson.qa.jboss.com/hudson/job/devstudio-nightly-3.1.0.beta1/297//...
--------------------------------------------------
Failed Tests:
No tests ran.
--------------------------------------------------
Changes:
[nickboldt] remove sourcetemplateplugin dir
[nickboldt] fix pom version
[nickboldt] update pom and manifest files from branch
--------------------------------------------------
Console log:
[...truncated 68200 lines...]
[java] [copy] Copied 14 empty directories to 1 empty directory under /qa/hudson_ws/workspace/devstudio-nightly-3.1.0.beta1/jbds-build/eclipse/plugins/org.jboss.tools.common.verification.ui.test
[java] [copy] Copying 105 files to /qa/hudson_ws/workspace/devstudio-nightly-3.1.0.beta1/jbds-build/eclipse/plugins/org.jboss.tools.jsf.vpe.jstl.test
[java] [copy] Copying 9 files to /qa/hudson_ws/workspace/devstudio-nightly-3.1.0.beta1/jbds-build/eclipse/plugins/org.jboss.tools.jmx.ui.test
[java] [copy] Copying 43 files to /qa/hudson_ws/workspace/devstudio-nightly-3.1.0.beta1/jbds-build/eclipse/plugins/org.jboss.tools.jst.web.kb.test
[java] [copy] Copying 55 files to /qa/hudson_ws/workspace/devstudio-nightly-3.1.0.beta1/jbds-build/eclipse/plugins/org.jboss.tools.jst.css.test
[java] [copy] Copying 34 files to /qa/hudson_ws/workspace/devstudio-nightly-3.1.0.beta1/jbds-build/eclipse/plugins/org.jboss.tools.jsf.ui.bot.test
[java] [copy] Copying 15 files to /qa/hudson_ws/workspace/devstudio-nightly-3.1.0.beta1/jbds-build/eclipse/plugins/org.jboss.tools.jst.ui.bot.test
[java] [copy] Copying 23 files to /qa/hudson_ws/workspace/devstudio-nightly-3.1.0.beta1/jbds-build/eclipse/plugins/org.jboss.tools.seam.ui.bot.test
[java] [copy] Copying 58 files to /qa/hudson_ws/workspace/devstudio-nightly-3.1.0.beta1/jbds-build/eclipse/plugins/org.jboss.tools.vpe.ui.bot.test
[java] [copy] Copying 14 files to /qa/hudson_ws/workspace/devstudio-nightly-3.1.0.beta1/jbds-build/eclipse/plugins/org.jboss.tools.jst.ui.firstrun.bot.test
[java] [copy] Copying 87 files to /qa/hudson_ws/workspace/devstudio-nightly-3.1.0.beta1/jbds-build/eclipse/plugins/org.jboss.tools.ui.bot.ext
[java] [copy] Copying 13 files to /qa/hudson_ws/workspace/devstudio-nightly-3.1.0.beta1/jbds-build/eclipse/plugins/org.jboss.tools.struts.ui.bot.test
[java] [copy] Copying 1960 files to /qa/hudson_ws/workspace/devstudio-nightly-3.1.0.beta1/jbds-build/eclipse/plugins/org.jboss.tools.cdi.core.test
[java] [copy] Copied 387 empty directories to 8 empty directories under /qa/hudson_ws/workspace/devstudio-nightly-3.1.0.beta1/jbds-build/eclipse/plugins/org.jboss.tools.cdi.core.test
[java] [copy] Copying 10 files to /qa/hudson_ws/workspace/devstudio-nightly-3.1.0.beta1/jbds-build/eclipse/plugins/org.jboss.tools.cdi.text.ext.test
[java] [copy] Copying 8 files to /qa/hudson_ws/workspace/devstudio-nightly-3.1.0.beta1/jbds-build/eclipse/plugins/org.jboss.tools.cdi.ui.test
[java] [copy] Copying 31 files to /qa/hudson_ws/workspace/devstudio-nightly-3.1.0.beta1/jbds-build/eclipse/plugins/org.jboss.tools.jsf.vpe.jbpm.test
[java] [copy] Copied 23 empty directories to 3 empty directories under /qa/hudson_ws/workspace/devstudio-nightly-3.1.0.beta1/jbds-build/eclipse/plugins/org.jboss.tools.jsf.vpe.jbpm.test
[java] [copy] Copying 19 files to /qa/hudson_ws/workspace/devstudio-nightly-3.1.0.beta1/jbds-build/eclipse/plugins/org.jboss.tools.drools.ui.bot.test
[java]
[java] fetch.recursively:
[java]
[java] init:
[java]
[java] fetchElement:
[java]
[java] fetch:
[java]
[java] fetch.element:
[java] [copy] Copying 3 files to /qa/hudson_ws/workspace/devstudio-nightly-3.1.0.beta1/jbds-build/eclipse/features/org.hibernate.eclipse.test.feature
[java]
[java] fetch.plugins:
[java] [copy] Copying 562 files to /qa/hudson_ws/workspace/devstudio-nightly-3.1.0.beta1/jbds-build/eclipse/plugins/org.hibernate.eclipse.console.test
[java] [copy] Copied 172 empty directories to 1 empty directory under /qa/hudson_ws/workspace/devstudio-nightly-3.1.0.beta1/jbds-build/eclipse/plugins/org.hibernate.eclipse.console.test
[java] [copy] Copying 67 files to /qa/hudson_ws/workspace/devstudio-nightly-3.1.0.beta1/jbds-build/eclipse/plugins/org.hibernate.eclipse.jdt.ui.test
[java] [copy] Copying 9 files to /qa/hudson_ws/workspace/devstudio-nightly-3.1.0.beta1/jbds-build/eclipse/plugins/org.jboss.tools.hibernate.ui.test
[java] [copy] Copied 16 empty directories to 1 empty directory under /qa/hudson_ws/workspace/devstudio-nightly-3.1.0.beta1/jbds-build/eclipse/plugins/org.jboss.tools.hibernate.ui.test
[java]
[java] fetch.recursively:
[java]
[java] init:
[java]
[java] fetchElement:
[java]
[java] fetch:
[java]
[java] fetch.element:
[java] [copy] Copying 4 files to /qa/hudson_ws/workspace/devstudio-nightly-3.1.0.beta1/jbds-build/eclipse/features/org.jboss.ide.eclipse.as.test.feature
[java]
[java] fetch.plugins:
[java] [copy] Copying 81 files to /qa/hudson_ws/workspace/devstudio-nightly-3.1.0.beta1/jbds-build/eclipse/plugins/org.jboss.ide.eclipse.as.test
[java] [copy] Copied 48 empty directories to 5 empty directories under /qa/hudson_ws/workspace/devstudio-nightly-3.1.0.beta1/jbds-build/eclipse/plugins/org.jboss.ide.eclipse.as.test
[java] [copy] Copying 21 files to /qa/hudson_ws/workspace/devstudio-nightly-3.1.0.beta1/jbds-build/eclipse/plugins/org.jboss.tools.jmx.core.test
[java] [copy] Copying 8 files to /qa/hudson_ws/workspace/devstudio-nightly-3.1.0.beta1/jbds-build/eclipse/plugins/org.jboss.ide.eclipse.as.ui.test
[java] [copy] Copied 13 empty directories to 1 empty directory under /qa/hudson_ws/workspace/devstudio-nightly-3.1.0.beta1/jbds-build/eclipse/plugins/org.jboss.ide.eclipse.as.ui.test
[java] [copy] Copying 9 files to /qa/hudson_ws/workspace/devstudio-nightly-3.1.0.beta1/jbds-build/eclipse/plugins/org.jboss.ide.eclipse.as.archives.integration.test
[java]
[java] fetch.recursively:
[java]
[java] init:
[java]
[java] fetchElement:
[java]
[java] fetch:
[java]
[java] fetch.element:
[java] [copy] Copying 5 files to /qa/hudson_ws/workspace/devstudio-nightly-3.1.0.beta1/jbds-build/eclipse/features/org.jboss.ide.eclipse.archives.test.feature
[java]
[java] fetch.plugins:
[java] [copy] Copying 160 files to /qa/hudson_ws/workspace/devstudio-nightly-3.1.0.beta1/jbds-build/eclipse/plugins/org.jboss.ide.eclipse.archives.test
[java] [copy] Copied 100 empty directories to 10 empty directories under /qa/hudson_ws/workspace/devstudio-nightly-3.1.0.beta1/jbds-build/eclipse/plugins/org.jboss.ide.eclipse.archives.test
[java] [copy] Copying 13 files to /qa/hudson_ws/workspace/devstudio-nightly-3.1.0.beta1/jbds-build/eclipse/plugins/org.jboss.ide.eclipse.archives.ui.test
[java] [copy] Copied 17 empty directories to 1 empty directory under /qa/hudson_ws/workspace/devstudio-nightly-3.1.0.beta1/jbds-build/eclipse/plugins/org.jboss.ide.eclipse.archives.ui.test
[java]
[java] fetch.recursively:
[java]
[java] init:
[java]
[java] fetchElement:
[java]
[java] fetch:
[java]
[java] fetch.element:
[java] [copy] Copying 3 files to /qa/hudson_ws/workspace/devstudio-nightly-3.1.0.beta1/jbds-build/eclipse/features/org.jboss.tools.birt.test.feature
[java]
[java] fetch.plugins:
[java] [copy] Copying 6 files to /qa/hudson_ws/workspace/devstudio-nightly-3.1.0.beta1/jbds-build/eclipse/plugins/org.jboss.tools.birt.core.test
[java]
[java] fetch.recursively:
[java]
[java] init:
[java]
[java] fetchElement:
[java]
[java] fetch:
[java]
[java] fetch.element:
[java] [copy] Copying 3 files to /qa/hudson_ws/workspace/devstudio-nightly-3.1.0.beta1/jbds-build/eclipse/features/org.jboss.tools.esb.test.feature
[java]
[java] fetch.plugins:
[java] [copy] Copying 19 files to /qa/hudson_ws/workspace/devstudio-nightly-3.1.0.beta1/jbds-build/eclipse/plugins/org.jboss.tools.esb.core.test
[java] [copy] Copying 33 files to /qa/hudson_ws/workspace/devstudio-nightly-3.1.0.beta1/jbds-build/eclipse/plugins/org.jboss.tools.esb.project.core.test
[java] [copy] Copied 45 empty directories to 5 empty directories under /qa/hudson_ws/workspace/devstudio-nightly-3.1.0.beta1/jbds-build/eclipse/plugins/org.jboss.tools.esb.project.core.test
[java]
[java] fetch.recursively:
[java]
[java] init:
[java]
[java] fetchElement:
[java]
[java] fetch:
[java]
[java] fetch.element:
[java] [copy] Copying 4 files to /qa/hudson_ws/workspace/devstudio-nightly-3.1.0.beta1/jbds-build/eclipse/features/org.jboss.ide.eclipse.freemarker.test.feature
[java]
[java] fetch.plugins:
[java] [copy] Copying 15 files to /qa/hudson_ws/workspace/devstudio-nightly-3.1.0.beta1/jbds-build/eclipse/plugins/org.jboss.ide.eclipse.freemarker.test
[java]
[java] fetch.recursively:
[java]
[java] init:
[java]
[java] fetchElement:
[java]
[java] fetch:
[java]
[java] fetch.element:
[java] [copy] Copying 4 files to /qa/hudson_ws/workspace/devstudio-nightly-3.1.0.beta1/jbds-build/eclipse/features/org.jboss.tools.smooks.test.feature
[java]
[java] fetch.plugins:
[java] [copy] Copying 125 files to /qa/hudson_ws/workspace/devstudio-nightly-3.1.0.beta1/jbds-build/eclipse/plugins/org.jboss.tools.smooks.core.test
[java] [copy] Copied 39 empty directories to 6 empty directories under /qa/hudson_ws/workspace/devstudio-nightly-3.1.0.beta1/jbds-build/eclipse/plugins/org.jboss.tools.smooks.core.test
[java]
[java] fetch.recursively:
[java]
[java] init:
[java]
[java] fetchElement:
[java]
[java] fetch:
[java]
[java] fetch.element:
[java] [copy] Copying 4 files to /qa/hudson_ws/workspace/devstudio-nightly-3.1.0.beta1/jbds-build/eclipse/features/org.jboss.tools.portlet.test.feature
[java]
[java] fetch.plugins:
[java] [copy] Copying 8 files to /qa/hudson_ws/workspace/devstudio-nightly-3.1.0.beta1/jbds-build/eclipse/plugins/org.jboss.tools.portlet.core.test
[java]
[java] fetch.recursively:
[java]
[java] init:
[java]
[java] fetchElement:
[java]
[java] fetch:
[java]
[java] fetch.element:
[java] [copy] Copying 3 files to /qa/hudson_ws/workspace/devstudio-nightly-3.1.0.beta1/jbds-build/eclipse/features/org.jboss.tools.project.examples.test.feature
[java]
[java] fetch.plugins:
[java] [copy] Copying 7 files to /qa/hudson_ws/workspace/devstudio-nightly-3.1.0.beta1/jbds-build/eclipse/plugins/org.jboss.tools.project.examples.test
[java]
[java] fetch.recursively:
[java]
[java] postFetch:
[java]
[java] generate:
[java]
[java] preGenerate:
[java]
[java] allElements:
[java]
[java] init:
[java]
[java] generateScript:
[java] [eclipse.buildScript] Some inter-plug-in dependencies have not been satisfied.
[java] [eclipse.buildScript] Bundle org.jboss.tools.ws.ui.bot.test:
[java] [eclipse.buildScript] Missing required plug-in org.eclipse.swtbot.eclipse.ui_2.0.0.
[java] [eclipse.buildScript] Bundle org.maven.ide.eclipse.subclipse:
[java] [eclipse.buildScript] Missing required plug-in org.tigris.subversion.subclipse.core_0.0.0.
[java] [eclipse.buildScript] Missing required plug-in org.tigris.subversion.subclipse.ui_0.0.0.
[java] [eclipse.buildScript] Bundle org.maven.ide.eclipse.mylyn3:
[java] [eclipse.buildScript] Missing required plug-in org.eclipse.mylyn.tasks.ui_3.0.0.
[java] [eclipse.buildScript] Missing required plug-in org.eclipse.mylyn.tasks.core_3.0.0.
[java]
[java] init:
[java]
[java] generateScript:
[java] [eclipse.buildScript] Some inter-plug-in dependencies have not been satisfied.
[java] [eclipse.buildScript] Bundle org.jboss.tools.ws.ui.bot.test:
[java] [eclipse.buildScript] Missing required plug-in org.eclipse.swtbot.eclipse.ui_2.0.0.
[java] [eclipse.buildScript] Bundle org.maven.ide.eclipse.subclipse:
[java] [eclipse.buildScript] Missing required plug-in org.tigris.subversion.subclipse.core_0.0.0.
[java] [eclipse.buildScript] Missing required plug-in org.tigris.subversion.subclipse.ui_0.0.0.
[java] [eclipse.buildScript] Bundle org.maven.ide.eclipse.mylyn3:
[java] [eclipse.buildScript] Missing required plug-in org.eclipse.mylyn.tasks.ui_3.0.0.
[java] [eclipse.buildScript] Missing required plug-in org.eclipse.mylyn.tasks.core_3.0.0.
[java] Java Result: 13
BUILD FAILED
/qa/hudson_ws/workspace/devstudio-nightly-3.1.0.beta1/org.jboss.ide.eclipse.releng/builders/buildNightly.xml:18: The following error occurred while executing this line:
/qa/hudson_ws/workspace/devstudio-nightly-3.1.0.beta1/org.jboss.ide.eclipse.releng/builders/build.xml:68: The following error occurred while executing this line:
/qa/hudson_ws/workspace/devstudio-nightly-3.1.0.beta1/org.jboss.ide.eclipse.releng/builders/build.xml:27: The following error occurred while executing this line:
/qa/hudson_ws/workspace/devstudio-nightly-3.1.0.beta1/org.jboss.ide.eclipse.releng/builders/build.xml:39: The following error occurred while executing this line:
/qa/hudson_ws/workspace/devstudio-nightly-3.1.0.beta1/org.jboss.ide.eclipse.releng/builders/product/productBuild.xml:106: The following error occurred while executing this line:
/qa/hudson_ws/workspace/devstudio-nightly-3.1.0.beta1/org.jboss.ide.eclipse.releng/builders/product/productBuild.xml:120: The following error occurred while executing this line:
/qa/hudson_ws/workspace/devstudio-nightly-3.1.0.beta1/org.jboss.ide.eclipse.releng/builders/builder-wrap.xml:336: [eclipse.fetch] Missing directory entry: plugin(a)org.mozilla.xpcom.
[eclipse.fetch] Missing directory entry: bundle(a)org.mozilla.xpcom.
[eclipse.fetch] Missing directory entry: plugin(a)org.mozilla.xulrunner.carbon.macosx.
[eclipse.fetch] Missing directory entry: bundle(a)org.mozilla.xulrunner.carbon.macosx.
[eclipse.fetch] Missing directory entry: plugin(a)org.mozilla.xulrunner.cocoa.macosx.
[eclipse.fetch] Missing directory entry: bundle(a)org.mozilla.xulrunner.cocoa.macosx.
[eclipse.fetch] Missing directory entry: plugin(a)org.mozilla.xulrunner.gtk.linux.x86.
[eclipse.fetch] Missing directory entry: bundle(a)org.mozilla.xulrunner.gtk.linux.x86.
[eclipse.fetch] Missing directory entry: plugin(a)org.mozilla.xulrunner.gtk.linux.x86_64.
[eclipse.fetch] Missing directory entry: bundle(a)org.mozilla.xulrunner.gtk.linux.x86_64.
[eclipse.fetch] Missing directory entry: plugin(a)org.mozilla.xulrunner.win32.win32.x86.
[eclipse.fetch] Missing directory entry: bundle(a)org.mozilla.xulrunner.win32.win32.x86.
[exec] Result: 127
[eclipse.fetch] Missing directory entry: fragment(a)org.eclipse.ant.optional.junit.
[eclipse.fetch] Missing directory entry: bundle(a)org.eclipse.ant.optional.junit.
[eclipse.fetch] Missing directory entry: plugin(a)org.eclipse.test.
[eclipse.fetch] Missing directory entry: bundle(a)org.eclipse.test.
BUILD FAILED
/qa/hudson_ws/workspace/devstudio-nightly-3.1.0.beta1/org.jboss.ide.eclipse.releng/builders/product/productBuild.xml:493: The following error occurred while executing this line:
/qa/hudson_ws/workspace/devstudio-nightly-3.1.0.beta1/org.jboss.ide.eclipse.releng/builders/product/productBuild.xml:495: The following error occurred while executing this line:
/qa/hudson_ws/workspace/devstudio-nightly-3.1.0.beta1/org.jboss.ide.eclipse.releng/builders/product/productBuild.xml:429: The following error occurred while executing this line:
/qa/hudson_ws/workspace/devstudio-nightly-3.1.0.beta1/org.jboss.ide.eclipse.releng/builders/builder-wrap.xml:68: The following error occurred while executing this line:
/qa/hudson_ws/workspace/devstudio-nightly-3.1.0.beta1/org.jboss.ide.eclipse.releng/builders/builder-wrap.xml:199: The following error occurred while executing this line:
/qa/hudson_ws/workspace/devstudio-nightly-3.1.0.beta1/jbds-build/org.eclipse.releng.basebuilder/plugins/org.eclipse.pde.build_3.5.0.v20090527-1800/scripts/build.xml:35: The following error occurred while executing this line:
/qa/hudson_ws/workspace/devstudio-nightly-3.1.0.beta1/jbds-build/org.eclipse.releng.basebuilder/plugins/org.eclipse.pde.build_3.5.0.v20090527-1800/scripts/build.xml:91: The following error occurred while executing this line:
/qa/hudson_ws/workspace/devstudio-nightly-3.1.0.beta1/org.jboss.ide.eclipse.releng/builders/tests/customTargets.xml:11: The following error occurred while executing this line:
/qa/hudson_ws/workspace/devstudio-nightly-3.1.0.beta1/org.jboss.ide.eclipse.releng/builders/tests/customTargets.xml:13: The following error occurred while executing this line:
/qa/hudson_ws/workspace/devstudio-nightly-3.1.0.beta1/jbds-build/org.eclipse.releng.basebuilder/plugins/org.eclipse.pde.build_3.5.0.v20090527-1800/scripts/genericTargets.xml:106: Bundle org.jboss.tools.ws.ui.bot.test_0.0.0 failed to resolve.:
Missing required plug-in org.eclipse.swtbot.eclipse.ui_2.0.0.
Total time: 10 minutes 22 seconds
Total time: 10 minutes 53 seconds
Terminating xvnc.
[devstudio-nightly-3.1.0.beta1] $ vncserver -kill :12
Killing Xvnc process ID 21750
Recording test results
Description not found.
Recording Emma reports jbds-build/coverage.xml
Email was triggered for: Failure
There are 1 triggered emails.
Sending email for trigger: Failure
--------------------------------------------------
14 years, 9 months
[Still Failing] devstudio-nightly-3.1.0.beta1 #296
by jboss-qa-internal@redhat.com
Public:
https://hudson.jboss.org/hudson//job/devstudio-nightly-3.1.0.beta1/296
https://hudson.jboss.org/hudson//job/devstudio-nightly-3.1.0.beta1/296/te...
https://hudson.jboss.org/hudson//job/devstudio-nightly-3.1.0.beta1/296/ch...
https://hudson.jboss.org/hudson//job/devstudio-nightly-3.1.0.beta1/296/co...
Internal:
http://hudson.qa.jboss.com/hudson/job/devstudio-nightly-3.1.0.beta1/296/
http://hudson.qa.jboss.com/hudson/job/devstudio-nightly-3.1.0.beta1/296//...
http://hudson.qa.jboss.com/hudson/job/devstudio-nightly-3.1.0.beta1/296//...
http://hudson.qa.jboss.com/hudson/job/devstudio-nightly-3.1.0.beta1/296//...
--------------------------------------------------
Failed Tests:
No tests ran.
--------------------------------------------------
Changes:
[nickboldt] merge from branch to trunk
[nickboldt] merge from branch to trunk
[nickboldt] svn:ignore
[nickboldt] merge from branch to trunk
[nickboldt] org.jboss.tools.ws.ui.bot.test requires org.eclipse.swtbot.eclipse.ui, so add swtbot repo zip to test harness
[nickboldt] org.jboss.tools.ws.ui.bot.test requires org.eclipse.swtbot.eclipse.ui, so add swtbot repo zip to test harness
--------------------------------------------------
Console log:
[...truncated 67833 lines...]
[java] [copy] Copied 14 empty directories to 1 empty directory under /mnt/hudson_workspace/workspace/devstudio-nightly-3.1.0.beta1/jbds-build/eclipse/plugins/org.jboss.tools.common.verification.ui.test
[java] [copy] Copying 105 files to /mnt/hudson_workspace/workspace/devstudio-nightly-3.1.0.beta1/jbds-build/eclipse/plugins/org.jboss.tools.jsf.vpe.jstl.test
[java] [copy] Copying 9 files to /mnt/hudson_workspace/workspace/devstudio-nightly-3.1.0.beta1/jbds-build/eclipse/plugins/org.jboss.tools.jmx.ui.test
[java] [copy] Copying 43 files to /mnt/hudson_workspace/workspace/devstudio-nightly-3.1.0.beta1/jbds-build/eclipse/plugins/org.jboss.tools.jst.web.kb.test
[java] [copy] Copying 55 files to /mnt/hudson_workspace/workspace/devstudio-nightly-3.1.0.beta1/jbds-build/eclipse/plugins/org.jboss.tools.jst.css.test
[java] [copy] Copying 34 files to /mnt/hudson_workspace/workspace/devstudio-nightly-3.1.0.beta1/jbds-build/eclipse/plugins/org.jboss.tools.jsf.ui.bot.test
[java] [copy] Copying 15 files to /mnt/hudson_workspace/workspace/devstudio-nightly-3.1.0.beta1/jbds-build/eclipse/plugins/org.jboss.tools.jst.ui.bot.test
[java] [copy] Copying 23 files to /mnt/hudson_workspace/workspace/devstudio-nightly-3.1.0.beta1/jbds-build/eclipse/plugins/org.jboss.tools.seam.ui.bot.test
[java] [copy] Copying 58 files to /mnt/hudson_workspace/workspace/devstudio-nightly-3.1.0.beta1/jbds-build/eclipse/plugins/org.jboss.tools.vpe.ui.bot.test
[java] [copy] Copying 14 files to /mnt/hudson_workspace/workspace/devstudio-nightly-3.1.0.beta1/jbds-build/eclipse/plugins/org.jboss.tools.jst.ui.firstrun.bot.test
[java] [copy] Copying 87 files to /mnt/hudson_workspace/workspace/devstudio-nightly-3.1.0.beta1/jbds-build/eclipse/plugins/org.jboss.tools.ui.bot.ext
[java] [copy] Copying 13 files to /mnt/hudson_workspace/workspace/devstudio-nightly-3.1.0.beta1/jbds-build/eclipse/plugins/org.jboss.tools.struts.ui.bot.test
[java] [copy] Copying 1960 files to /mnt/hudson_workspace/workspace/devstudio-nightly-3.1.0.beta1/jbds-build/eclipse/plugins/org.jboss.tools.cdi.core.test
[java] [copy] Copied 387 empty directories to 9 empty directories under /mnt/hudson_workspace/workspace/devstudio-nightly-3.1.0.beta1/jbds-build/eclipse/plugins/org.jboss.tools.cdi.core.test
[java] [copy] Copying 10 files to /mnt/hudson_workspace/workspace/devstudio-nightly-3.1.0.beta1/jbds-build/eclipse/plugins/org.jboss.tools.cdi.text.ext.test
[java] [copy] Copying 8 files to /mnt/hudson_workspace/workspace/devstudio-nightly-3.1.0.beta1/jbds-build/eclipse/plugins/org.jboss.tools.cdi.ui.test
[java] [copy] Copying 31 files to /mnt/hudson_workspace/workspace/devstudio-nightly-3.1.0.beta1/jbds-build/eclipse/plugins/org.jboss.tools.jsf.vpe.jbpm.test
[java] [copy] Copied 23 empty directories to 3 empty directories under /mnt/hudson_workspace/workspace/devstudio-nightly-3.1.0.beta1/jbds-build/eclipse/plugins/org.jboss.tools.jsf.vpe.jbpm.test
[java] [copy] Copying 19 files to /mnt/hudson_workspace/workspace/devstudio-nightly-3.1.0.beta1/jbds-build/eclipse/plugins/org.jboss.tools.drools.ui.bot.test
[java]
[java] fetch.recursively:
[java]
[java] init:
[java]
[java] fetchElement:
[java]
[java] fetch:
[java]
[java] fetch.element:
[java] [copy] Copying 3 files to /mnt/hudson_workspace/workspace/devstudio-nightly-3.1.0.beta1/jbds-build/eclipse/features/org.hibernate.eclipse.test.feature
[java]
[java] fetch.plugins:
[java] [copy] Copying 562 files to /mnt/hudson_workspace/workspace/devstudio-nightly-3.1.0.beta1/jbds-build/eclipse/plugins/org.hibernate.eclipse.console.test
[java] [copy] Copied 172 empty directories to 1 empty directory under /mnt/hudson_workspace/workspace/devstudio-nightly-3.1.0.beta1/jbds-build/eclipse/plugins/org.hibernate.eclipse.console.test
[java] [copy] Copying 67 files to /mnt/hudson_workspace/workspace/devstudio-nightly-3.1.0.beta1/jbds-build/eclipse/plugins/org.hibernate.eclipse.jdt.ui.test
[java] [copy] Copying 9 files to /mnt/hudson_workspace/workspace/devstudio-nightly-3.1.0.beta1/jbds-build/eclipse/plugins/org.jboss.tools.hibernate.ui.test
[java] [copy] Copied 16 empty directories to 1 empty directory under /mnt/hudson_workspace/workspace/devstudio-nightly-3.1.0.beta1/jbds-build/eclipse/plugins/org.jboss.tools.hibernate.ui.test
[java]
[java] fetch.recursively:
[java]
[java] init:
[java]
[java] fetchElement:
[java]
[java] fetch:
[java]
[java] fetch.element:
[java] [copy] Copying 4 files to /mnt/hudson_workspace/workspace/devstudio-nightly-3.1.0.beta1/jbds-build/eclipse/features/org.jboss.ide.eclipse.as.test.feature
[java]
[java] fetch.plugins:
[java] [copy] Copying 81 files to /mnt/hudson_workspace/workspace/devstudio-nightly-3.1.0.beta1/jbds-build/eclipse/plugins/org.jboss.ide.eclipse.as.test
[java] [copy] Copied 48 empty directories to 5 empty directories under /mnt/hudson_workspace/workspace/devstudio-nightly-3.1.0.beta1/jbds-build/eclipse/plugins/org.jboss.ide.eclipse.as.test
[java] [copy] Copying 21 files to /mnt/hudson_workspace/workspace/devstudio-nightly-3.1.0.beta1/jbds-build/eclipse/plugins/org.jboss.tools.jmx.core.test
[java] [copy] Copying 8 files to /mnt/hudson_workspace/workspace/devstudio-nightly-3.1.0.beta1/jbds-build/eclipse/plugins/org.jboss.ide.eclipse.as.ui.test
[java] [copy] Copied 13 empty directories to 1 empty directory under /mnt/hudson_workspace/workspace/devstudio-nightly-3.1.0.beta1/jbds-build/eclipse/plugins/org.jboss.ide.eclipse.as.ui.test
[java] [copy] Copying 9 files to /mnt/hudson_workspace/workspace/devstudio-nightly-3.1.0.beta1/jbds-build/eclipse/plugins/org.jboss.ide.eclipse.as.archives.integration.test
[java]
[java] fetch.recursively:
[java]
[java] init:
[java]
[java] fetchElement:
[java]
[java] fetch:
[java]
[java] fetch.element:
[java] [copy] Copying 5 files to /mnt/hudson_workspace/workspace/devstudio-nightly-3.1.0.beta1/jbds-build/eclipse/features/org.jboss.ide.eclipse.archives.test.feature
[java]
[java] fetch.plugins:
[java] [copy] Copying 160 files to /mnt/hudson_workspace/workspace/devstudio-nightly-3.1.0.beta1/jbds-build/eclipse/plugins/org.jboss.ide.eclipse.archives.test
[java] [copy] Copied 100 empty directories to 10 empty directories under /mnt/hudson_workspace/workspace/devstudio-nightly-3.1.0.beta1/jbds-build/eclipse/plugins/org.jboss.ide.eclipse.archives.test
[java] [copy] Copying 13 files to /mnt/hudson_workspace/workspace/devstudio-nightly-3.1.0.beta1/jbds-build/eclipse/plugins/org.jboss.ide.eclipse.archives.ui.test
[java] [copy] Copied 17 empty directories to 1 empty directory under /mnt/hudson_workspace/workspace/devstudio-nightly-3.1.0.beta1/jbds-build/eclipse/plugins/org.jboss.ide.eclipse.archives.ui.test
[java]
[java] fetch.recursively:
[java]
[java] init:
[java]
[java] fetchElement:
[java]
[java] fetch:
[java]
[java] fetch.element:
[java] [copy] Copying 3 files to /mnt/hudson_workspace/workspace/devstudio-nightly-3.1.0.beta1/jbds-build/eclipse/features/org.jboss.tools.birt.test.feature
[java]
[java] fetch.plugins:
[java] [copy] Copying 6 files to /mnt/hudson_workspace/workspace/devstudio-nightly-3.1.0.beta1/jbds-build/eclipse/plugins/org.jboss.tools.birt.core.test
[java]
[java] fetch.recursively:
[java]
[java] init:
[java]
[java] fetchElement:
[java]
[java] fetch:
[java]
[java] fetch.element:
[java] [copy] Copying 3 files to /mnt/hudson_workspace/workspace/devstudio-nightly-3.1.0.beta1/jbds-build/eclipse/features/org.jboss.tools.esb.test.feature
[java]
[java] fetch.plugins:
[java] [copy] Copying 19 files to /mnt/hudson_workspace/workspace/devstudio-nightly-3.1.0.beta1/jbds-build/eclipse/plugins/org.jboss.tools.esb.core.test
[java] [copy] Copying 33 files to /mnt/hudson_workspace/workspace/devstudio-nightly-3.1.0.beta1/jbds-build/eclipse/plugins/org.jboss.tools.esb.project.core.test
[java] [copy] Copied 45 empty directories to 6 empty directories under /mnt/hudson_workspace/workspace/devstudio-nightly-3.1.0.beta1/jbds-build/eclipse/plugins/org.jboss.tools.esb.project.core.test
[java]
[java] fetch.recursively:
[java]
[java] init:
[java]
[java] fetchElement:
[java]
[java] fetch:
[java]
[java] fetch.element:
[java] [copy] Copying 4 files to /mnt/hudson_workspace/workspace/devstudio-nightly-3.1.0.beta1/jbds-build/eclipse/features/org.jboss.ide.eclipse.freemarker.test.feature
[java]
[java] fetch.plugins:
[java] [copy] Copying 15 files to /mnt/hudson_workspace/workspace/devstudio-nightly-3.1.0.beta1/jbds-build/eclipse/plugins/org.jboss.ide.eclipse.freemarker.test
[java]
[java] fetch.recursively:
[java]
[java] init:
[java]
[java] fetchElement:
[java]
[java] fetch:
[java]
[java] fetch.element:
[java] [copy] Copying 4 files to /mnt/hudson_workspace/workspace/devstudio-nightly-3.1.0.beta1/jbds-build/eclipse/features/org.jboss.tools.smooks.test.feature
[java]
[java] fetch.plugins:
[java] [copy] Copying 125 files to /mnt/hudson_workspace/workspace/devstudio-nightly-3.1.0.beta1/jbds-build/eclipse/plugins/org.jboss.tools.smooks.core.test
[java] [copy] Copied 39 empty directories to 5 empty directories under /mnt/hudson_workspace/workspace/devstudio-nightly-3.1.0.beta1/jbds-build/eclipse/plugins/org.jboss.tools.smooks.core.test
[java]
[java] fetch.recursively:
[java]
[java] init:
[java]
[java] fetchElement:
[java]
[java] fetch:
[java]
[java] fetch.element:
[java] [copy] Copying 4 files to /mnt/hudson_workspace/workspace/devstudio-nightly-3.1.0.beta1/jbds-build/eclipse/features/org.jboss.tools.portlet.test.feature
[java]
[java] fetch.plugins:
[java] [copy] Copying 8 files to /mnt/hudson_workspace/workspace/devstudio-nightly-3.1.0.beta1/jbds-build/eclipse/plugins/org.jboss.tools.portlet.core.test
[java]
[java] fetch.recursively:
[java]
[java] init:
[java]
[java] fetchElement:
[java]
[java] fetch:
[java]
[java] fetch.element:
[java] [copy] Copying 3 files to /mnt/hudson_workspace/workspace/devstudio-nightly-3.1.0.beta1/jbds-build/eclipse/features/org.jboss.tools.project.examples.test.feature
[java]
[java] fetch.plugins:
[java] [copy] Copying 7 files to /mnt/hudson_workspace/workspace/devstudio-nightly-3.1.0.beta1/jbds-build/eclipse/plugins/org.jboss.tools.project.examples.test
[java]
[java] fetch.recursively:
[java]
[java] postFetch:
[java]
[java] generate:
[java]
[java] preGenerate:
[java]
[java] allElements:
[java]
[java] init:
[java]
[java] generateScript:
[java] [eclipse.buildScript] Some inter-plug-in dependencies have not been satisfied.
[java] [eclipse.buildScript] Bundle org.jboss.tools.ws.ui.bot.test:
[java] [eclipse.buildScript] Missing required plug-in org.eclipse.swtbot.eclipse.ui_2.0.0.
[java] [eclipse.buildScript] Bundle org.maven.ide.eclipse.subclipse:
[java] [eclipse.buildScript] Missing required plug-in org.tigris.subversion.subclipse.core_0.0.0.
[java] [eclipse.buildScript] Missing required plug-in org.tigris.subversion.subclipse.ui_0.0.0.
[java] [eclipse.buildScript] Bundle org.maven.ide.eclipse.mylyn3:
[java] [eclipse.buildScript] Missing required plug-in org.eclipse.mylyn.tasks.ui_3.0.0.
[java] [eclipse.buildScript] Missing required plug-in org.eclipse.mylyn.tasks.core_3.0.0.
[java]
[java] init:
[java]
[java] generateScript:
[java] [eclipse.buildScript] Some inter-plug-in dependencies have not been satisfied.
[java] [eclipse.buildScript] Bundle org.jboss.tools.ws.ui.bot.test:
[java] [eclipse.buildScript] Missing required plug-in org.eclipse.swtbot.eclipse.ui_2.0.0.
[java] [eclipse.buildScript] Bundle org.maven.ide.eclipse.subclipse:
[java] [eclipse.buildScript] Missing required plug-in org.tigris.subversion.subclipse.core_0.0.0.
[java] [eclipse.buildScript] Missing required plug-in org.tigris.subversion.subclipse.ui_0.0.0.
[java] [eclipse.buildScript] Bundle org.maven.ide.eclipse.mylyn3:
[java] [eclipse.buildScript] Missing required plug-in org.eclipse.mylyn.tasks.ui_3.0.0.
[java] [eclipse.buildScript] Missing required plug-in org.eclipse.mylyn.tasks.core_3.0.0.
[java] Java Result: 13
BUILD FAILED
/mnt/hudson_workspace/workspace/devstudio-nightly-3.1.0.beta1/org.jboss.ide.eclipse.releng/builders/buildNightly.xml:18: The following error occurred while executing this line:
/mnt/hudson_workspace/workspace/devstudio-nightly-3.1.0.beta1/org.jboss.ide.eclipse.releng/builders/build.xml:68: The following error occurred while executing this line:
/mnt/hudson_workspace/workspace/devstudio-nightly-3.1.0.beta1/org.jboss.ide.eclipse.releng/builders/build.xml:27: The following error occurred while executing this line:
/mnt/hudson_workspace/workspace/devstudio-nightly-3.1.0.beta1/org.jboss.ide.eclipse.releng/builders/build.xml:39: The following error occurred while executing this line:
/mnt/hudson_workspace/workspace/devstudio-nightly-3.1.0.beta1/org.jboss.ide.eclipse.releng/builders/product/productBuild.xml:106: The following error occurred while executing this line:
/mnt/hudson_workspace/workspace/devstudio-nightly-3.1.0.beta1/org.jboss.ide.eclipse.releng/builders/product/productBuild.xml:120: The following error occurred while executing this line:
/mnt/hudson_workspace/workspace/devstudio-nightly-3.1.0.beta1/org.jboss.ide.eclipse.releng/builders/builder-wrap.xml:336: [eclipse.fetch] Missing directory entry: plugin(a)org.mozilla.xpcom.
[eclipse.fetch] Missing directory entry: bundle(a)org.mozilla.xpcom.
[eclipse.fetch] Missing directory entry: plugin(a)org.mozilla.xulrunner.carbon.macosx.
[eclipse.fetch] Missing directory entry: bundle(a)org.mozilla.xulrunner.carbon.macosx.
[eclipse.fetch] Missing directory entry: plugin(a)org.mozilla.xulrunner.cocoa.macosx.
[eclipse.fetch] Missing directory entry: bundle(a)org.mozilla.xulrunner.cocoa.macosx.
[eclipse.fetch] Missing directory entry: plugin(a)org.mozilla.xulrunner.gtk.linux.x86.
[eclipse.fetch] Missing directory entry: bundle(a)org.mozilla.xulrunner.gtk.linux.x86.
[eclipse.fetch] Missing directory entry: plugin(a)org.mozilla.xulrunner.gtk.linux.x86_64.
[eclipse.fetch] Missing directory entry: bundle(a)org.mozilla.xulrunner.gtk.linux.x86_64.
[eclipse.fetch] Missing directory entry: plugin(a)org.mozilla.xulrunner.win32.win32.x86.
[eclipse.fetch] Missing directory entry: bundle(a)org.mozilla.xulrunner.win32.win32.x86.
[exec] Result: 127
[eclipse.fetch] Missing directory entry: fragment(a)org.eclipse.ant.optional.junit.
[eclipse.fetch] Missing directory entry: bundle(a)org.eclipse.ant.optional.junit.
[eclipse.fetch] Missing directory entry: plugin(a)org.eclipse.test.
[eclipse.fetch] Missing directory entry: bundle(a)org.eclipse.test.
BUILD FAILED
/mnt/hudson_workspace/workspace/devstudio-nightly-3.1.0.beta1/org.jboss.ide.eclipse.releng/builders/product/productBuild.xml:493: The following error occurred while executing this line:
/mnt/hudson_workspace/workspace/devstudio-nightly-3.1.0.beta1/org.jboss.ide.eclipse.releng/builders/product/productBuild.xml:495: The following error occurred while executing this line:
/mnt/hudson_workspace/workspace/devstudio-nightly-3.1.0.beta1/org.jboss.ide.eclipse.releng/builders/product/productBuild.xml:429: The following error occurred while executing this line:
/mnt/hudson_workspace/workspace/devstudio-nightly-3.1.0.beta1/org.jboss.ide.eclipse.releng/builders/builder-wrap.xml:68: The following error occurred while executing this line:
/mnt/hudson_workspace/workspace/devstudio-nightly-3.1.0.beta1/org.jboss.ide.eclipse.releng/builders/builder-wrap.xml:199: The following error occurred while executing this line:
/mnt/hudson_workspace/workspace/devstudio-nightly-3.1.0.beta1/jbds-build/org.eclipse.releng.basebuilder/plugins/org.eclipse.pde.build_3.5.0.v20090527-1800/scripts/build.xml:35: The following error occurred while executing this line:
/mnt/hudson_workspace/workspace/devstudio-nightly-3.1.0.beta1/jbds-build/org.eclipse.releng.basebuilder/plugins/org.eclipse.pde.build_3.5.0.v20090527-1800/scripts/build.xml:91: The following error occurred while executing this line:
/mnt/hudson_workspace/workspace/devstudio-nightly-3.1.0.beta1/org.jboss.ide.eclipse.releng/builders/tests/customTargets.xml:11: The following error occurred while executing this line:
/mnt/hudson_workspace/workspace/devstudio-nightly-3.1.0.beta1/org.jboss.ide.eclipse.releng/builders/tests/customTargets.xml:13: The following error occurred while executing this line:
/mnt/hudson_workspace/workspace/devstudio-nightly-3.1.0.beta1/jbds-build/org.eclipse.releng.basebuilder/plugins/org.eclipse.pde.build_3.5.0.v20090527-1800/scripts/genericTargets.xml:106: Bundle org.jboss.tools.ws.ui.bot.test_0.0.0 failed to resolve.:
Missing required plug-in org.eclipse.swtbot.eclipse.ui_2.0.0.
Total time: 14 minutes 42 seconds
Total time: 15 minutes 15 seconds
Terminating xvnc.
[devstudio-nightly-3.1.0.beta1] $ vncserver -kill :12
Killing Xvnc process ID 25412
Recording test results
Description not found.
Recording Emma reports jbds-build/coverage.xml
Email was triggered for: Failure
There are 1 triggered emails.
Sending email for trigger: Failure
--------------------------------------------------
14 years, 9 months
[Still Failing] jbosstools-nightly-3.2.next #219
by jboss-qa-internal@redhat.com
Public:
https://hudson.jboss.org/hudson//job/jbosstools-nightly-3.2.next/219
https://hudson.jboss.org/hudson//job/jbosstools-nightly-3.2.next/219/test...
https://hudson.jboss.org/hudson//job/jbosstools-nightly-3.2.next/219/changes
https://hudson.jboss.org/hudson//job/jbosstools-nightly-3.2.next/219/console
Internal:
http://hudson.qa.jboss.com/hudson/job/jbosstools-nightly-3.2.next/219/
http://hudson.qa.jboss.com/hudson/job/jbosstools-nightly-3.2.next/219//te...
http://hudson.qa.jboss.com/hudson/job/jbosstools-nightly-3.2.next/219//ch...
http://hudson.qa.jboss.com/hudson/job/jbosstools-nightly-3.2.next/219//co...
--------------------------------------------------
Failed Tests:
No tests ran.
--------------------------------------------------
Changes:
[nickboldt] merge from branch to trunk
[nickboldt] merge from branch to trunk
[nickboldt] svn:ignore
[nickboldt] merge from branch to trunk
[nickboldt] org.jboss.tools.ws.ui.bot.test requires org.eclipse.swtbot.eclipse.ui, so add swtbot repo zip to test harness
--------------------------------------------------
Console log:
[...truncated 68688 lines...]
[java] [copy] Copying 9 files to /qa/hudson_ws/workspace/jbosstools-nightly-3.2.next/jbds-build/eclipse/plugins/org.jboss.tools.hibernate.ui.test
[java] [copy] Copied 16 empty directories to 1 empty directory under /qa/hudson_ws/workspace/jbosstools-nightly-3.2.next/jbds-build/eclipse/plugins/org.jboss.tools.hibernate.ui.test
[java]
[java] fetch.recursively:
[java]
[java] init:
[java]
[java] fetchElement:
[java]
[java] fetch:
[java]
[java] fetch.element:
[java] [copy] Copying 4 files to /qa/hudson_ws/workspace/jbosstools-nightly-3.2.next/jbds-build/eclipse/features/org.jboss.ide.eclipse.as.test.feature
[java]
[java] fetch.plugins:
[java] [copy] Copying 81 files to /qa/hudson_ws/workspace/jbosstools-nightly-3.2.next/jbds-build/eclipse/plugins/org.jboss.ide.eclipse.as.test
[java] [copy] Copied 48 empty directories to 6 empty directories under /qa/hudson_ws/workspace/jbosstools-nightly-3.2.next/jbds-build/eclipse/plugins/org.jboss.ide.eclipse.as.test
[java] [copy] Copying 21 files to /qa/hudson_ws/workspace/jbosstools-nightly-3.2.next/jbds-build/eclipse/plugins/org.jboss.tools.jmx.core.test
[java] [copy] Copying 8 files to /qa/hudson_ws/workspace/jbosstools-nightly-3.2.next/jbds-build/eclipse/plugins/org.jboss.ide.eclipse.as.ui.test
[java] [copy] Copied 13 empty directories to 1 empty directory under /qa/hudson_ws/workspace/jbosstools-nightly-3.2.next/jbds-build/eclipse/plugins/org.jboss.ide.eclipse.as.ui.test
[java] [copy] Copying 9 files to /qa/hudson_ws/workspace/jbosstools-nightly-3.2.next/jbds-build/eclipse/plugins/org.jboss.ide.eclipse.as.archives.integration.test
[java]
[java] fetch.recursively:
[java]
[java] init:
[java]
[java] fetchElement:
[java]
[java] fetch:
[java]
[java] fetch.element:
[java] [copy] Copying 5 files to /qa/hudson_ws/workspace/jbosstools-nightly-3.2.next/jbds-build/eclipse/features/org.jboss.ide.eclipse.archives.test.feature
[java]
[java] fetch.plugins:
[java] [copy] Copying 160 files to /qa/hudson_ws/workspace/jbosstools-nightly-3.2.next/jbds-build/eclipse/plugins/org.jboss.ide.eclipse.archives.test
[java] [copy] Copied 100 empty directories to 10 empty directories under /qa/hudson_ws/workspace/jbosstools-nightly-3.2.next/jbds-build/eclipse/plugins/org.jboss.ide.eclipse.archives.test
[java] [copy] Copying 13 files to /qa/hudson_ws/workspace/jbosstools-nightly-3.2.next/jbds-build/eclipse/plugins/org.jboss.ide.eclipse.archives.ui.test
[java] [copy] Copied 17 empty directories to 1 empty directory under /qa/hudson_ws/workspace/jbosstools-nightly-3.2.next/jbds-build/eclipse/plugins/org.jboss.ide.eclipse.archives.ui.test
[java]
[java] fetch.recursively:
[java]
[java] init:
[java]
[java] fetchElement:
[java]
[java] fetch:
[java]
[java] fetch.element:
[java] [copy] Copying 3 files to /qa/hudson_ws/workspace/jbosstools-nightly-3.2.next/jbds-build/eclipse/features/org.jboss.tools.birt.test.feature
[java]
[java] fetch.plugins:
[java] [copy] Copying 6 files to /qa/hudson_ws/workspace/jbosstools-nightly-3.2.next/jbds-build/eclipse/plugins/org.jboss.tools.birt.core.test
[java]
[java] fetch.recursively:
[java]
[java] init:
[java]
[java] fetchElement:
[java]
[java] fetch:
[java]
[java] fetch.element:
[java] [copy] Copying 3 files to /qa/hudson_ws/workspace/jbosstools-nightly-3.2.next/jbds-build/eclipse/features/org.jboss.tools.esb.test.feature
[java]
[java] fetch.plugins:
[java] [copy] Copying 19 files to /qa/hudson_ws/workspace/jbosstools-nightly-3.2.next/jbds-build/eclipse/plugins/org.jboss.tools.esb.core.test
[java] [copy] Copying 33 files to /qa/hudson_ws/workspace/jbosstools-nightly-3.2.next/jbds-build/eclipse/plugins/org.jboss.tools.esb.project.core.test
[java] [copy] Copied 45 empty directories to 5 empty directories under /qa/hudson_ws/workspace/jbosstools-nightly-3.2.next/jbds-build/eclipse/plugins/org.jboss.tools.esb.project.core.test
[java]
[java] fetch.recursively:
[java]
[java] init:
[java]
[java] fetchElement:
[java]
[java] fetch:
[java]
[java] fetch.element:
[java] [copy] Copying 4 files to /qa/hudson_ws/workspace/jbosstools-nightly-3.2.next/jbds-build/eclipse/features/org.jboss.ide.eclipse.freemarker.test.feature
[java]
[java] fetch.plugins:
[java] [copy] Copying 15 files to /qa/hudson_ws/workspace/jbosstools-nightly-3.2.next/jbds-build/eclipse/plugins/org.jboss.ide.eclipse.freemarker.test
[java]
[java] fetch.recursively:
[java]
[java] init:
[java]
[java] fetchElement:
[java]
[java] fetch:
[java]
[java] fetch.element:
[java] [copy] Copying 4 files to /qa/hudson_ws/workspace/jbosstools-nightly-3.2.next/jbds-build/eclipse/features/org.jboss.tools.smooks.test.feature
[java]
[java] fetch.plugins:
[java] [copy] Copying 125 files to /qa/hudson_ws/workspace/jbosstools-nightly-3.2.next/jbds-build/eclipse/plugins/org.jboss.tools.smooks.core.test
[java] [copy] Copied 39 empty directories to 6 empty directories under /qa/hudson_ws/workspace/jbosstools-nightly-3.2.next/jbds-build/eclipse/plugins/org.jboss.tools.smooks.core.test
[java]
[java] fetch.recursively:
[java]
[java] init:
[java]
[java] fetchElement:
[java]
[java] fetch:
[java]
[java] fetch.element:
[java] [copy] Copying 4 files to /qa/hudson_ws/workspace/jbosstools-nightly-3.2.next/jbds-build/eclipse/features/org.jboss.tools.portlet.test.feature
[java]
[java] fetch.plugins:
[java] [copy] Copying 8 files to /qa/hudson_ws/workspace/jbosstools-nightly-3.2.next/jbds-build/eclipse/plugins/org.jboss.tools.portlet.core.test
[java]
[java] fetch.recursively:
[java]
[java] init:
[java]
[java] fetchElement:
[java]
[java] fetch:
[java]
[java] fetch.element:
[java] [copy] Copying 3 files to /qa/hudson_ws/workspace/jbosstools-nightly-3.2.next/jbds-build/eclipse/features/org.jboss.tools.project.examples.test.feature
[java]
[java] fetch.plugins:
[java] [copy] Copying 7 files to /qa/hudson_ws/workspace/jbosstools-nightly-3.2.next/jbds-build/eclipse/plugins/org.jboss.tools.project.examples.test
[java]
[java] fetch.recursively:
[java]
[java] postFetch:
[java]
[java] generate:
[java]
[java] preGenerate:
[java]
[java] allElements:
[java]
[java] init:
[java]
[java] generateScript:
[java] [eclipse.buildScript] Some inter-plug-in dependencies have not been satisfied.
[java] [eclipse.buildScript] Bundle org.jboss.tools.ws.ui.bot.test:
[java] [eclipse.buildScript] Missing required plug-in org.eclipse.swtbot.eclipse.ui_2.0.0.
[java] [eclipse.buildScript] Bundle org.maven.ide.eclipse.mylyn3:
[java] [eclipse.buildScript] Missing required plug-in org.eclipse.mylyn.tasks.ui_3.0.0.
[java] [eclipse.buildScript] Missing required plug-in org.eclipse.mylyn.tasks.core_3.0.0.
[java] [eclipse.buildScript] Bundle org.maven.ide.eclipse.subclipse:
[java] [eclipse.buildScript] Missing required plug-in org.tigris.subversion.subclipse.core_0.0.0.
[java] [eclipse.buildScript] Missing required plug-in org.tigris.subversion.subclipse.ui_0.0.0.
[java]
[java] init:
[java]
[java] generateScript:
[java] [eclipse.buildScript] Some inter-plug-in dependencies have not been satisfied.
[java] [eclipse.buildScript] Bundle org.jboss.tools.ws.ui.bot.test:
[java] [eclipse.buildScript] Missing required plug-in org.eclipse.swtbot.eclipse.ui_2.0.0.
[java] [eclipse.buildScript] Bundle org.maven.ide.eclipse.mylyn3:
[java] [eclipse.buildScript] Missing required plug-in org.eclipse.mylyn.tasks.ui_3.0.0.
[java] [eclipse.buildScript] Missing required plug-in org.eclipse.mylyn.tasks.core_3.0.0.
[java] [eclipse.buildScript] Bundle org.maven.ide.eclipse.subclipse:
[java] [eclipse.buildScript] Missing required plug-in org.tigris.subversion.subclipse.core_0.0.0.
[java] [eclipse.buildScript] Missing required plug-in org.tigris.subversion.subclipse.ui_0.0.0.
[java] Java Result: 13
BUILD FAILED
/qa/hudson_ws/workspace/jbosstools-nightly-3.2.next/org.jboss.ide.eclipse.releng/builders/buildNightly.xml:18: The following error occurred while executing this line:
/qa/hudson_ws/workspace/jbosstools-nightly-3.2.next/org.jboss.ide.eclipse.releng/builders/build.xml:68: The following error occurred while executing this line:
/qa/hudson_ws/workspace/jbosstools-nightly-3.2.next/org.jboss.ide.eclipse.releng/builders/build.xml:27: The following error occurred while executing this line:
/qa/hudson_ws/workspace/jbosstools-nightly-3.2.next/org.jboss.ide.eclipse.releng/builders/build.xml:39: The following error occurred while executing this line:
/qa/hudson_ws/workspace/jbosstools-nightly-3.2.next/org.jboss.ide.eclipse.releng/builders/product/productBuild.xml:106: The following error occurred while executing this line:
/qa/hudson_ws/workspace/jbosstools-nightly-3.2.next/org.jboss.ide.eclipse.releng/builders/product/productBuild.xml:120: The following error occurred while executing this line:
/qa/hudson_ws/workspace/jbosstools-nightly-3.2.next/org.jboss.ide.eclipse.releng/builders/builder-wrap.xml:336: [exec] Result: 127
[eclipse.fetch] Missing directory entry: plugin(a)org.mozilla.xpcom.
[eclipse.fetch] Missing directory entry: bundle(a)org.mozilla.xpcom.
[eclipse.fetch] Missing directory entry: plugin(a)org.mozilla.xulrunner.carbon.macosx.
[eclipse.fetch] Missing directory entry: bundle(a)org.mozilla.xulrunner.carbon.macosx.
[eclipse.fetch] Missing directory entry: plugin(a)org.mozilla.xulrunner.cocoa.macosx.
[eclipse.fetch] Missing directory entry: bundle(a)org.mozilla.xulrunner.cocoa.macosx.
[eclipse.fetch] Missing directory entry: plugin(a)org.mozilla.xulrunner.gtk.linux.x86.
[eclipse.fetch] Missing directory entry: bundle(a)org.mozilla.xulrunner.gtk.linux.x86.
[eclipse.fetch] Missing directory entry: plugin(a)org.mozilla.xulrunner.gtk.linux.x86_64.
[eclipse.fetch] Missing directory entry: bundle(a)org.mozilla.xulrunner.gtk.linux.x86_64.
[eclipse.fetch] Missing directory entry: plugin(a)org.mozilla.xulrunner.win32.win32.x86.
[eclipse.fetch] Missing directory entry: bundle(a)org.mozilla.xulrunner.win32.win32.x86.
[eclipse.fetch] Missing directory entry: fragment(a)org.eclipse.ant.optional.junit.
[eclipse.fetch] Missing directory entry: bundle(a)org.eclipse.ant.optional.junit.
[eclipse.fetch] Missing directory entry: plugin(a)org.eclipse.test.
[eclipse.fetch] Missing directory entry: bundle(a)org.eclipse.test.
BUILD FAILED
/qa/hudson_ws/workspace/jbosstools-nightly-3.2.next/org.jboss.ide.eclipse.releng/builders/product/productBuild.xml:493: The following error occurred while executing this line:
/qa/hudson_ws/workspace/jbosstools-nightly-3.2.next/org.jboss.ide.eclipse.releng/builders/product/productBuild.xml:495: The following error occurred while executing this line:
/qa/hudson_ws/workspace/jbosstools-nightly-3.2.next/org.jboss.ide.eclipse.releng/builders/product/productBuild.xml:429: The following error occurred while executing this line:
/qa/hudson_ws/workspace/jbosstools-nightly-3.2.next/org.jboss.ide.eclipse.releng/builders/builder-wrap.xml:68: The following error occurred while executing this line:
/qa/hudson_ws/workspace/jbosstools-nightly-3.2.next/org.jboss.ide.eclipse.releng/builders/builder-wrap.xml:199: The following error occurred while executing this line:
/qa/hudson_ws/workspace/jbosstools-nightly-3.2.next/jbds-build/org.eclipse.releng.basebuilder/plugins/org.eclipse.pde.build_3.5.0.v20090527-1800/scripts/build.xml:35: The following error occurred while executing this line:
/qa/hudson_ws/workspace/jbosstools-nightly-3.2.next/jbds-build/org.eclipse.releng.basebuilder/plugins/org.eclipse.pde.build_3.5.0.v20090527-1800/scripts/build.xml:91: The following error occurred while executing this line:
/qa/hudson_ws/workspace/jbosstools-nightly-3.2.next/org.jboss.ide.eclipse.releng/builders/tests/customTargets.xml:11: The following error occurred while executing this line:
/qa/hudson_ws/workspace/jbosstools-nightly-3.2.next/org.jboss.ide.eclipse.releng/builders/tests/customTargets.xml:13: The following error occurred while executing this line:
/qa/hudson_ws/workspace/jbosstools-nightly-3.2.next/jbds-build/org.eclipse.releng.basebuilder/plugins/org.eclipse.pde.build_3.5.0.v20090527-1800/scripts/genericTargets.xml:106: Bundle org.jboss.tools.ws.ui.bot.test_0.0.0 failed to resolve.:
Missing required plug-in org.eclipse.swtbot.eclipse.ui_2.0.0.
Total time: 9 minutes 22 seconds
Total time: 9 minutes 48 seconds
Terminating xvnc.
[jbosstools-nightly-3.2.next] $ vncserver -kill :13
Killing Xvnc process ID 31238
Recording test results
Description not found.
Recording Emma reports jbds-build/coverage.xml
Recording plot data
No plot data file found: jbds-build/*/*/tests/test-results/emma-coverage/archives/lines.properties
No plot data file found: jbds-build/*/*/tests/test-results/emma-coverage/as/lines.properties
No plot data file found: jbds-build/*/*/tests/test-results/emma-coverage/hibernate-tools/lines.properties
No plot data file found: jbds-build/*/*/tests/test-results/emma-coverage/jbpm-convert/lines.properties
No plot data file found: jbds-build/*/*/tests/test-results/emma-coverage/jmx/lines.properties
No plot data file found: jbds-build/*/*/tests/test-results/emma-coverage/bpel/lines.properties
No plot data file found: jbds-build/*/*/tests/test-results/emma-coverage/common/lines.properties
No plot data file found: jbds-build/*/*/tests/test-results/emma-coverage/struts/lines.properties
No plot data file found: jbds-build/*/*/tests/test-results/emma-coverage/jsf/lines.properties
No plot data file found: jbds-build/*/*/tests/test-results/emma-coverage/jst/lines.properties
No plot data file found: jbds-build/*/*/tests/test-results/emma-coverage/seam/lines.properties
No plot data file found: jbds-build/*/*/tests/test-results/emma-coverage/drools-ide/lines.properties
No plot data file found: jbds-build/*/*/tests/test-results/emma-coverage/vpe/lines.properties
No plot data file found: jbds-build/*/*/tests/test-results/emma-coverage/esb/lines.properties
No plot data file found: jbds-build/*/*/tests/test-results/emma-coverage/freemarker/lines.properties
No plot data file found: jbds-build/*/*/tests/test-results/emma-coverage/birt/lines.properties
No plot data file found: jbds-build/*/*/tests/test-results/emma-coverage/smooks/lines.properties
No plot data file found: jbds-build/*/*/tests/test-results/emma-coverage/archives/classes.properties
No plot data file found: jbds-build/*/*/tests/test-results/emma-coverage/as/classes.properties
No plot data file found: jbds-build/*/*/tests/test-results/emma-coverage/hibernate-tools/classes.properties
No plot data file found: jbds-build/*/*/tests/test-results/emma-coverage/jbpm-convert/classes.properties
No plot data file found: jbds-build/*/*/tests/test-results/emma-coverage/jmx/classes.properties
No plot data file found: jbds-build/*/*/tests/test-results/emma-coverage/bpel/classes.properties
No plot data file found: jbds-build/*/*/tests/test-results/emma-coverage/common/classes.properties
No plot data file found: jbds-build/*/*/tests/test-results/emma-coverage/struts/classes.properties
No plot data file found: jbds-build/*/*/tests/test-results/emma-coverage/jsf/classes.properties
No plot data file found: jbds-build/*/*/tests/test-results/emma-coverage/jst/classes.properties
No plot data file found: jbds-build/*/*/tests/test-results/emma-coverage/seam/classes.properties
No plot data file found: jbds-build/*/*/tests/test-results/emma-coverage/drools-ide/classes.properties
No plot data file found: jbds-build/*/*/tests/test-results/emma-coverage/vpe/classes.properties
No plot data file found: jbds-build/*/*/tests/test-results/emma-coverage/esb/classes.properties
No plot data file found: jbds-build/*/*/tests/test-results/emma-coverage/freemarker/classes.properties
No plot data file found: jbds-build/*/*/tests/test-results/emma-coverage/birt/classes.properties
No plot data file found: jbds-build/*/*/tests/test-results/emma-coverage/smooks/classes.properties
Email was triggered for: Failure
There are 1 triggered emails.
Sending email for trigger: Failure
--------------------------------------------------
14 years, 9 months
[Failure] jbosstools-nightly-3.2.next #218
by jboss-qa-internal@redhat.com
Public:
https://hudson.jboss.org/hudson//job/jbosstools-nightly-3.2.next/218
https://hudson.jboss.org/hudson//job/jbosstools-nightly-3.2.next/218/test...
https://hudson.jboss.org/hudson//job/jbosstools-nightly-3.2.next/218/changes
https://hudson.jboss.org/hudson//job/jbosstools-nightly-3.2.next/218/console
Internal:
http://hudson.qa.jboss.com/hudson/job/jbosstools-nightly-3.2.next/218/
http://hudson.qa.jboss.com/hudson/job/jbosstools-nightly-3.2.next/218//te...
http://hudson.qa.jboss.com/hudson/job/jbosstools-nightly-3.2.next/218//ch...
http://hudson.qa.jboss.com/hudson/job/jbosstools-nightly-3.2.next/218//co...
--------------------------------------------------
Failed Tests:
No tests ran.
--------------------------------------------------
Changes:
[dgolovin] fix for null pointer exceptions in tests:
model.test
model.ui.test
reason was new tycho version 0.9.0-SHAPSHOT, it doesn't use source folder when starting tests plug-in. and test plug-in are deployed as jar instead of being unpacked. fixed by configuring plug-in to deploy test plug-ins unpacked
[irooskov(a)redhat.com] updated with JBDS-1214
[nickboldt] add pom.xml files
[nickboldt] add pom.xml files
[nickboldt] https://jira.jboss.org/browse/JBIDE-6158 add drools bot test
[nickboldt] add pom.xml files
[nickboldt] add pom.xml files
[nickboldt] add pom.xml files
[nickboldt] add pom.xml files
[nickboldt] add pom.xml files
[nickboldt] add pom.xml files
[nickboldt] add pom.xml files
[nickboldt] add pom.xml files
[nickboldt] add pom.xml files
[nickboldt] add pom.xml files
[nickboldt] add pom.xml files
[nickboldt] add pom.xml files
[nickboldt] add ws pom.xml files
[nickboldt] add ws tests including new bot test (JBIDE-6274)
[nickboldt] set unpack=true for common.ui, jmx.core; add new ws.ui.bot.test plugin
[nickboldt] https://jira.jboss.org/browse/JBIDE-6158 add drools bot test
[nickboldt] https://jira.jboss.org/browse/JBIDE-6274
--------------------------------------------------
Console log:
[...truncated 68575 lines...]
[java] [copy] Copying 9 files to /mnt/hudson_workspace/workspace/jbosstools-nightly-3.2.next/jbds-build/eclipse/plugins/org.jboss.tools.hibernate.ui.test
[java] [copy] Copied 16 empty directories to 1 empty directory under /mnt/hudson_workspace/workspace/jbosstools-nightly-3.2.next/jbds-build/eclipse/plugins/org.jboss.tools.hibernate.ui.test
[java]
[java] fetch.recursively:
[java]
[java] init:
[java]
[java] fetchElement:
[java]
[java] fetch:
[java]
[java] fetch.element:
[java] [copy] Copying 4 files to /mnt/hudson_workspace/workspace/jbosstools-nightly-3.2.next/jbds-build/eclipse/features/org.jboss.ide.eclipse.as.test.feature
[java]
[java] fetch.plugins:
[java] [copy] Copying 81 files to /mnt/hudson_workspace/workspace/jbosstools-nightly-3.2.next/jbds-build/eclipse/plugins/org.jboss.ide.eclipse.as.test
[java] [copy] Copied 48 empty directories to 6 empty directories under /mnt/hudson_workspace/workspace/jbosstools-nightly-3.2.next/jbds-build/eclipse/plugins/org.jboss.ide.eclipse.as.test
[java] [copy] Copying 21 files to /mnt/hudson_workspace/workspace/jbosstools-nightly-3.2.next/jbds-build/eclipse/plugins/org.jboss.tools.jmx.core.test
[java] [copy] Copying 8 files to /mnt/hudson_workspace/workspace/jbosstools-nightly-3.2.next/jbds-build/eclipse/plugins/org.jboss.ide.eclipse.as.ui.test
[java] [copy] Copied 13 empty directories to 1 empty directory under /mnt/hudson_workspace/workspace/jbosstools-nightly-3.2.next/jbds-build/eclipse/plugins/org.jboss.ide.eclipse.as.ui.test
[java] [copy] Copying 9 files to /mnt/hudson_workspace/workspace/jbosstools-nightly-3.2.next/jbds-build/eclipse/plugins/org.jboss.ide.eclipse.as.archives.integration.test
[java]
[java] fetch.recursively:
[java]
[java] init:
[java]
[java] fetchElement:
[java]
[java] fetch:
[java]
[java] fetch.element:
[java] [copy] Copying 5 files to /mnt/hudson_workspace/workspace/jbosstools-nightly-3.2.next/jbds-build/eclipse/features/org.jboss.ide.eclipse.archives.test.feature
[java]
[java] fetch.plugins:
[java] [copy] Copying 160 files to /mnt/hudson_workspace/workspace/jbosstools-nightly-3.2.next/jbds-build/eclipse/plugins/org.jboss.ide.eclipse.archives.test
[java] [copy] Copied 100 empty directories to 10 empty directories under /mnt/hudson_workspace/workspace/jbosstools-nightly-3.2.next/jbds-build/eclipse/plugins/org.jboss.ide.eclipse.archives.test
[java] [copy] Copying 13 files to /mnt/hudson_workspace/workspace/jbosstools-nightly-3.2.next/jbds-build/eclipse/plugins/org.jboss.ide.eclipse.archives.ui.test
[java] [copy] Copied 17 empty directories to 1 empty directory under /mnt/hudson_workspace/workspace/jbosstools-nightly-3.2.next/jbds-build/eclipse/plugins/org.jboss.ide.eclipse.archives.ui.test
[java]
[java] fetch.recursively:
[java]
[java] init:
[java]
[java] fetchElement:
[java]
[java] fetch:
[java]
[java] fetch.element:
[java] [copy] Copying 3 files to /mnt/hudson_workspace/workspace/jbosstools-nightly-3.2.next/jbds-build/eclipse/features/org.jboss.tools.birt.test.feature
[java]
[java] fetch.plugins:
[java] [copy] Copying 6 files to /mnt/hudson_workspace/workspace/jbosstools-nightly-3.2.next/jbds-build/eclipse/plugins/org.jboss.tools.birt.core.test
[java]
[java] fetch.recursively:
[java]
[java] init:
[java]
[java] fetchElement:
[java]
[java] fetch:
[java]
[java] fetch.element:
[java] [copy] Copying 3 files to /mnt/hudson_workspace/workspace/jbosstools-nightly-3.2.next/jbds-build/eclipse/features/org.jboss.tools.esb.test.feature
[java]
[java] fetch.plugins:
[java] [copy] Copying 19 files to /mnt/hudson_workspace/workspace/jbosstools-nightly-3.2.next/jbds-build/eclipse/plugins/org.jboss.tools.esb.core.test
[java] [copy] Copying 33 files to /mnt/hudson_workspace/workspace/jbosstools-nightly-3.2.next/jbds-build/eclipse/plugins/org.jboss.tools.esb.project.core.test
[java] [copy] Copied 45 empty directories to 6 empty directories under /mnt/hudson_workspace/workspace/jbosstools-nightly-3.2.next/jbds-build/eclipse/plugins/org.jboss.tools.esb.project.core.test
[java]
[java] fetch.recursively:
[java]
[java] init:
[java]
[java] fetchElement:
[java]
[java] fetch:
[java]
[java] fetch.element:
[java] [copy] Copying 4 files to /mnt/hudson_workspace/workspace/jbosstools-nightly-3.2.next/jbds-build/eclipse/features/org.jboss.ide.eclipse.freemarker.test.feature
[java]
[java] fetch.plugins:
[java] [copy] Copying 15 files to /mnt/hudson_workspace/workspace/jbosstools-nightly-3.2.next/jbds-build/eclipse/plugins/org.jboss.ide.eclipse.freemarker.test
[java]
[java] fetch.recursively:
[java]
[java] init:
[java]
[java] fetchElement:
[java]
[java] fetch:
[java]
[java] fetch.element:
[java] [copy] Copying 4 files to /mnt/hudson_workspace/workspace/jbosstools-nightly-3.2.next/jbds-build/eclipse/features/org.jboss.tools.smooks.test.feature
[java]
[java] fetch.plugins:
[java] [copy] Copying 125 files to /mnt/hudson_workspace/workspace/jbosstools-nightly-3.2.next/jbds-build/eclipse/plugins/org.jboss.tools.smooks.core.test
[java] [copy] Copied 39 empty directories to 7 empty directories under /mnt/hudson_workspace/workspace/jbosstools-nightly-3.2.next/jbds-build/eclipse/plugins/org.jboss.tools.smooks.core.test
[java]
[java] fetch.recursively:
[java]
[java] init:
[java]
[java] fetchElement:
[java]
[java] fetch:
[java]
[java] fetch.element:
[java] [copy] Copying 4 files to /mnt/hudson_workspace/workspace/jbosstools-nightly-3.2.next/jbds-build/eclipse/features/org.jboss.tools.portlet.test.feature
[java]
[java] fetch.plugins:
[java] [copy] Copying 8 files to /mnt/hudson_workspace/workspace/jbosstools-nightly-3.2.next/jbds-build/eclipse/plugins/org.jboss.tools.portlet.core.test
[java]
[java] fetch.recursively:
[java]
[java] init:
[java]
[java] fetchElement:
[java]
[java] fetch:
[java]
[java] fetch.element:
[java] [copy] Copying 3 files to /mnt/hudson_workspace/workspace/jbosstools-nightly-3.2.next/jbds-build/eclipse/features/org.jboss.tools.project.examples.test.feature
[java]
[java] fetch.plugins:
[java] [copy] Copying 7 files to /mnt/hudson_workspace/workspace/jbosstools-nightly-3.2.next/jbds-build/eclipse/plugins/org.jboss.tools.project.examples.test
[java]
[java] fetch.recursively:
[java]
[java] postFetch:
[java]
[java] generate:
[java]
[java] preGenerate:
[java]
[java] allElements:
[java]
[java] init:
[java]
[java] generateScript:
[java] [eclipse.buildScript] Some inter-plug-in dependencies have not been satisfied.
[java] [eclipse.buildScript] Bundle org.jboss.tools.ws.ui.bot.test:
[java] [eclipse.buildScript] Missing required plug-in org.eclipse.swtbot.eclipse.ui_2.0.0.
[java] [eclipse.buildScript] Bundle org.maven.ide.eclipse.subclipse:
[java] [eclipse.buildScript] Missing required plug-in org.tigris.subversion.subclipse.core_0.0.0.
[java] [eclipse.buildScript] Missing required plug-in org.tigris.subversion.subclipse.ui_0.0.0.
[java] [eclipse.buildScript] Bundle org.maven.ide.eclipse.mylyn3:
[java] [eclipse.buildScript] Missing required plug-in org.eclipse.mylyn.tasks.ui_3.0.0.
[java] [eclipse.buildScript] Missing required plug-in org.eclipse.mylyn.tasks.core_3.0.0.
[java]
[java] init:
[java]
[java] generateScript:
[java] [eclipse.buildScript] Some inter-plug-in dependencies have not been satisfied.
[java] [eclipse.buildScript] Bundle org.jboss.tools.ws.ui.bot.test:
[java] [eclipse.buildScript] Missing required plug-in org.eclipse.swtbot.eclipse.ui_2.0.0.
[java] [eclipse.buildScript] Bundle org.maven.ide.eclipse.subclipse:
[java] [eclipse.buildScript] Missing required plug-in org.tigris.subversion.subclipse.core_0.0.0.
[java] [eclipse.buildScript] Missing required plug-in org.tigris.subversion.subclipse.ui_0.0.0.
[java] [eclipse.buildScript] Bundle org.maven.ide.eclipse.mylyn3:
[java] [eclipse.buildScript] Missing required plug-in org.eclipse.mylyn.tasks.ui_3.0.0.
[java] [eclipse.buildScript] Missing required plug-in org.eclipse.mylyn.tasks.core_3.0.0.
[java] Java Result: 13
BUILD FAILED
/mnt/hudson_workspace/workspace/jbosstools-nightly-3.2.next/org.jboss.ide.eclipse.releng/builders/buildNightly.xml:18: The following error occurred while executing this line:
/mnt/hudson_workspace/workspace/jbosstools-nightly-3.2.next/org.jboss.ide.eclipse.releng/builders/build.xml:68: The following error occurred while executing this line:
/mnt/hudson_workspace/workspace/jbosstools-nightly-3.2.next/org.jboss.ide.eclipse.releng/builders/build.xml:27: The following error occurred while executing this line:
/mnt/hudson_workspace/workspace/jbosstools-nightly-3.2.next/org.jboss.ide.eclipse.releng/builders/build.xml:39: The following error occurred while executing this line:
/mnt/hudson_workspace/workspace/jbosstools-nightly-3.2.next/org.jboss.ide.eclipse.releng/builders/product/productBuild.xml:106: The following error occurred while executing this line:
/mnt/hudson_workspace/workspace/jbosstools-nightly-3.2.next/org.jboss.ide.eclipse.releng/builders/product/productBuild.xml:120: The following error occurred while executing this line:
/mnt/hudson_workspace/workspace/jbosstools-nightly-3.2.next/org.jboss.ide.eclipse.releng/builders/builder-wrap.xml:336: [exec] Result: 127
[eclipse.fetch] Missing directory entry: plugin(a)org.mozilla.xpcom.
[eclipse.fetch] Missing directory entry: bundle(a)org.mozilla.xpcom.
[eclipse.fetch] Missing directory entry: plugin(a)org.mozilla.xulrunner.carbon.macosx.
[eclipse.fetch] Missing directory entry: bundle(a)org.mozilla.xulrunner.carbon.macosx.
[eclipse.fetch] Missing directory entry: plugin(a)org.mozilla.xulrunner.cocoa.macosx.
[eclipse.fetch] Missing directory entry: bundle(a)org.mozilla.xulrunner.cocoa.macosx.
[eclipse.fetch] Missing directory entry: plugin(a)org.mozilla.xulrunner.gtk.linux.x86.
[eclipse.fetch] Missing directory entry: bundle(a)org.mozilla.xulrunner.gtk.linux.x86.
[eclipse.fetch] Missing directory entry: plugin(a)org.mozilla.xulrunner.gtk.linux.x86_64.
[eclipse.fetch] Missing directory entry: bundle(a)org.mozilla.xulrunner.gtk.linux.x86_64.
[eclipse.fetch] Missing directory entry: plugin(a)org.mozilla.xulrunner.win32.win32.x86.
[eclipse.fetch] Missing directory entry: bundle(a)org.mozilla.xulrunner.win32.win32.x86.
[eclipse.fetch] Missing directory entry: fragment(a)org.eclipse.ant.optional.junit.
[eclipse.fetch] Missing directory entry: bundle(a)org.eclipse.ant.optional.junit.
[eclipse.fetch] Missing directory entry: plugin(a)org.eclipse.test.
[eclipse.fetch] Missing directory entry: bundle(a)org.eclipse.test.
BUILD FAILED
/mnt/hudson_workspace/workspace/jbosstools-nightly-3.2.next/org.jboss.ide.eclipse.releng/builders/product/productBuild.xml:493: The following error occurred while executing this line:
/mnt/hudson_workspace/workspace/jbosstools-nightly-3.2.next/org.jboss.ide.eclipse.releng/builders/product/productBuild.xml:495: The following error occurred while executing this line:
/mnt/hudson_workspace/workspace/jbosstools-nightly-3.2.next/org.jboss.ide.eclipse.releng/builders/product/productBuild.xml:429: The following error occurred while executing this line:
/mnt/hudson_workspace/workspace/jbosstools-nightly-3.2.next/org.jboss.ide.eclipse.releng/builders/builder-wrap.xml:68: The following error occurred while executing this line:
/mnt/hudson_workspace/workspace/jbosstools-nightly-3.2.next/org.jboss.ide.eclipse.releng/builders/builder-wrap.xml:199: The following error occurred while executing this line:
/mnt/hudson_workspace/workspace/jbosstools-nightly-3.2.next/jbds-build/org.eclipse.releng.basebuilder/plugins/org.eclipse.pde.build_3.5.0.v20090527-1800/scripts/build.xml:35: The following error occurred while executing this line:
/mnt/hudson_workspace/workspace/jbosstools-nightly-3.2.next/jbds-build/org.eclipse.releng.basebuilder/plugins/org.eclipse.pde.build_3.5.0.v20090527-1800/scripts/build.xml:91: The following error occurred while executing this line:
/mnt/hudson_workspace/workspace/jbosstools-nightly-3.2.next/org.jboss.ide.eclipse.releng/builders/tests/customTargets.xml:11: The following error occurred while executing this line:
/mnt/hudson_workspace/workspace/jbosstools-nightly-3.2.next/org.jboss.ide.eclipse.releng/builders/tests/customTargets.xml:13: The following error occurred while executing this line:
/mnt/hudson_workspace/workspace/jbosstools-nightly-3.2.next/jbds-build/org.eclipse.releng.basebuilder/plugins/org.eclipse.pde.build_3.5.0.v20090527-1800/scripts/genericTargets.xml:106: Bundle org.jboss.tools.ws.ui.bot.test_0.0.0 failed to resolve.:
Missing required plug-in org.eclipse.swtbot.eclipse.ui_2.0.0.
Total time: 12 minutes 52 seconds
Total time: 13 minutes 28 seconds
Terminating xvnc.
[jbosstools-nightly-3.2.next] $ vncserver -kill :12
Killing Xvnc process ID 26044
Recording test results
Description not found.
Recording Emma reports jbds-build/coverage.xml
Recording plot data
No plot data file found: jbds-build/*/*/tests/test-results/emma-coverage/archives/lines.properties
No plot data file found: jbds-build/*/*/tests/test-results/emma-coverage/as/lines.properties
No plot data file found: jbds-build/*/*/tests/test-results/emma-coverage/hibernate-tools/lines.properties
No plot data file found: jbds-build/*/*/tests/test-results/emma-coverage/jbpm-convert/lines.properties
No plot data file found: jbds-build/*/*/tests/test-results/emma-coverage/jmx/lines.properties
No plot data file found: jbds-build/*/*/tests/test-results/emma-coverage/bpel/lines.properties
No plot data file found: jbds-build/*/*/tests/test-results/emma-coverage/common/lines.properties
No plot data file found: jbds-build/*/*/tests/test-results/emma-coverage/struts/lines.properties
No plot data file found: jbds-build/*/*/tests/test-results/emma-coverage/jsf/lines.properties
No plot data file found: jbds-build/*/*/tests/test-results/emma-coverage/jst/lines.properties
No plot data file found: jbds-build/*/*/tests/test-results/emma-coverage/seam/lines.properties
No plot data file found: jbds-build/*/*/tests/test-results/emma-coverage/drools-ide/lines.properties
No plot data file found: jbds-build/*/*/tests/test-results/emma-coverage/vpe/lines.properties
No plot data file found: jbds-build/*/*/tests/test-results/emma-coverage/esb/lines.properties
No plot data file found: jbds-build/*/*/tests/test-results/emma-coverage/freemarker/lines.properties
No plot data file found: jbds-build/*/*/tests/test-results/emma-coverage/birt/lines.properties
No plot data file found: jbds-build/*/*/tests/test-results/emma-coverage/smooks/lines.properties
No plot data file found: jbds-build/*/*/tests/test-results/emma-coverage/archives/classes.properties
No plot data file found: jbds-build/*/*/tests/test-results/emma-coverage/as/classes.properties
No plot data file found: jbds-build/*/*/tests/test-results/emma-coverage/hibernate-tools/classes.properties
No plot data file found: jbds-build/*/*/tests/test-results/emma-coverage/jbpm-convert/classes.properties
No plot data file found: jbds-build/*/*/tests/test-results/emma-coverage/jmx/classes.properties
No plot data file found: jbds-build/*/*/tests/test-results/emma-coverage/bpel/classes.properties
No plot data file found: jbds-build/*/*/tests/test-results/emma-coverage/common/classes.properties
No plot data file found: jbds-build/*/*/tests/test-results/emma-coverage/struts/classes.properties
No plot data file found: jbds-build/*/*/tests/test-results/emma-coverage/jsf/classes.properties
No plot data file found: jbds-build/*/*/tests/test-results/emma-coverage/jst/classes.properties
No plot data file found: jbds-build/*/*/tests/test-results/emma-coverage/seam/classes.properties
No plot data file found: jbds-build/*/*/tests/test-results/emma-coverage/drools-ide/classes.properties
No plot data file found: jbds-build/*/*/tests/test-results/emma-coverage/vpe/classes.properties
No plot data file found: jbds-build/*/*/tests/test-results/emma-coverage/esb/classes.properties
No plot data file found: jbds-build/*/*/tests/test-results/emma-coverage/freemarker/classes.properties
No plot data file found: jbds-build/*/*/tests/test-results/emma-coverage/birt/classes.properties
No plot data file found: jbds-build/*/*/tests/test-results/emma-coverage/smooks/classes.properties
Email was triggered for: Failure
There are 1 triggered emails.
Sending email for trigger: Failure
--------------------------------------------------
14 years, 9 months