See <
http://hudson.qa.jboss.com/hudson/job/JBoss-AS-7.0.x/2026/>
------------------------------------------
[...truncated 10921 lines...]
[INFO] --- xml-maven-plugin:1.0:transform (update-ip-addresses-jbossas.server) @
jboss-as-testsuite-integration-smoke ---
[INFO] Transforming file:
<
http://hudson.qa.jboss.com/hudson/job/JBoss-AS-7.0.x/ws/testsuite/integra...
[INFO] Transforming file:
<
http://hudson.qa.jboss.com/hudson/job/JBoss-AS-7.0.x/ws/testsuite/integra...
[INFO] Transforming file:
<
http://hudson.qa.jboss.com/hudson/job/JBoss-AS-7.0.x/ws/testsuite/integra...
[INFO] Transformed 3 file(s).
[INFO]
[INFO] --- maven-antrun-plugin:1.6:run (build-smoke.server) @
jboss-as-testsuite-integration-smoke ---
[INFO] Executing tasks
main:
build-smoke:
[echo] Building AS instance "smoke" from
<
http://hudson.qa.jboss.com/hudson/job/JBoss-AS-7.0.x/ws/testsuite/integra...
to
<
http://hudson.qa.jboss.com/hudson/job/JBoss-AS-7.0.x/ws/testsuite/integra...
[copy] Copying 107 files to
<
http://hudson.qa.jboss.com/hudson/job/JBoss-AS-7.0.x/ws/testsuite/integra...
[copy] Copied 20 empty directories to 3 empty directories under
<
http://hudson.qa.jboss.com/hudson/job/JBoss-AS-7.0.x/ws/testsuite/integra...
[copy] Warning:
<
http://hudson.qa.jboss.com/hudson/job/JBoss-AS-7.0.x/ws/testsuite/integra...
does not exist.
changeDefaultDatabase:
[echo] Changing IP addresses for config smoke
[xslt] Processing
<
http://hudson.qa.jboss.com/hudson/job/JBoss-AS-7.0.x/ws/testsuite/integra...
to
<
http://hudson.qa.jboss.com/hudson/job/JBoss-AS-7.0.x/ws/testsuite/integra...
[xslt] Loading stylesheet
<
http://hudson.qa.jboss.com/hudson/job/JBoss-AS-7.0.x/ws/testsuite/integra...
[xslt] Processing
<
http://hudson.qa.jboss.com/hudson/job/JBoss-AS-7.0.x/ws/testsuite/integra...
to
<
http://hudson.qa.jboss.com/hudson/job/JBoss-AS-7.0.x/ws/testsuite/integra...
[xslt] Processing
<
http://hudson.qa.jboss.com/hudson/job/JBoss-AS-7.0.x/ws/testsuite/integra...
to
<
http://hudson.qa.jboss.com/hudson/job/JBoss-AS-7.0.x/ws/testsuite/integra...
[move] Moving 3 files to
<
http://hudson.qa.jboss.com/hudson/job/JBoss-AS-7.0.x/ws/testsuite/integra...
[INFO] Executed tasks
[INFO]
[INFO] --- maven-compiler-plugin:2.3.2:testCompile (default-testCompile) @
jboss-as-testsuite-integration-smoke ---
[INFO] Compiling 75 source files to
<
http://hudson.qa.jboss.com/hudson/job/JBoss-AS-7.0.x/ws/testsuite/integra...
[INFO]
[INFO] --- maven-surefire-plugin:2.10:test (smoke-full.surefire) @
jboss-as-testsuite-integration-smoke ---
[INFO] Surefire report directory:
<
http://hudson.qa.jboss.com/hudson/job/JBoss-AS-7.0.x/ws/testsuite/integra...
-------------------------------------------------------
T E S T S
-------------------------------------------------------
Running org.jboss.as.test.smoke.embedded.demos.client.messaging.MessagingClientTestCase
Tests run: 1, Failures: 0, Errors: 0, Skipped: 0, Time elapsed: 14.354 sec
Running org.jboss.as.test.smoke.embedded.demos.client.jms.JmsClientTestCase
Tests run: 1, Failures: 0, Errors: 0, Skipped: 0, Time elapsed: 5.01 sec
Running org.jboss.as.test.smoke.embedded.demos.messaging.MessagingTestCase
Tests run: 1, Failures: 0, Errors: 0, Skipped: 0, Time elapsed: 1.718 sec
Running org.jboss.as.test.smoke.embedded.demos.jms.JmsTestCase
Tests run: 1, Failures: 0, Errors: 0, Skipped: 0, Time elapsed: 1.242 sec
Results :
Tests run: 4, Failures: 0, Errors: 0, Skipped: 0
[INFO]
[INFO] --- maven-surefire-plugin:2.10:test (smoke-web.surefire) @
jboss-as-testsuite-integration-smoke ---
[INFO] Surefire report directory:
<
http://hudson.qa.jboss.com/hudson/job/JBoss-AS-7.0.x/ws/testsuite/integra...
-------------------------------------------------------
T E S T S
-------------------------------------------------------
Running org.jboss.as.test.smoke.flat.xml.StandardConfigsXMLValidationUnitTestCase
Tests run: 4, Failures: 0, Errors: 0, Skipped: 0, Time elapsed: 6.687 sec
Running org.jboss.as.test.smoke.flat.xml.XSDValidationUnitTestCase
Tests run: 1, Failures: 0, Errors: 0, Skipped: 0, Time elapsed: 1.303 sec
Running org.jboss.as.test.smoke.embedded.mgmt.PlatformMBeansUnitTestCase
Tests run: 1, Failures: 0, Errors: 0, Skipped: 0, Time elapsed: 17.409 sec
Running org.jboss.as.test.smoke.embedded.mgmt.DescribeOperationUnitTestCase
Tests run: 1, Failures: 0, Errors: 0, Skipped: 0, Time elapsed: 4.17 sec
Running org.jboss.as.test.smoke.embedded.mgmt.BasicOperationsUnitTestCase
Tests run: 6, Failures: 0, Errors: 0, Skipped: 0, Time elapsed: 1.323 sec
Running org.jboss.as.test.smoke.embedded.mgmt.datasource.DataSourceResourcesUnitTestCase
Tests run: 2, Failures: 0, Errors: 0, Skipped: 0, Time elapsed: 1.249 sec
Running org.jboss.as.test.smoke.embedded.mgmt.datasource.DataSourceOperationsUnitTestCase
Tests run: 9, Failures: 0, Errors: 1, Skipped: 1, Time elapsed: 3.973 sec <<<
FAILURE!
Running org.jboss.as.test.smoke.embedded.mgmt.datasource.DataSourceCfgMetricUnitTestCase
Tests run: 1, Failures: 0, Errors: 0, Skipped: 0, Time elapsed: 0.934 sec
Running
org.jboss.as.test.smoke.embedded.mgmt.datasource.AddMySqlDataSourceOperationsUnitTestCase
Tests run: 1, Failures: 0, Errors: 0, Skipped: 1, Time elapsed: 0 sec
Running org.jboss.as.test.smoke.embedded.demos.war.WarTestCase
Tests run: 2, Failures: 0, Errors: 0, Skipped: 0, Time elapsed: 1.135 sec
Running org.jboss.as.test.smoke.embedded.demos.ds.DsTestCase
Tests run: 1, Failures: 0, Errors: 0, Skipped: 0, Time elapsed: 1.784 sec
Running org.jboss.as.test.smoke.embedded.demos.jaxrs.JaxrsTestCase
Tests run: 1, Failures: 0, Errors: 0, Skipped: 0, Time elapsed: 0.774 sec
Running org.jboss.as.test.smoke.embedded.demos.ws.WSTestCase
Tests run: 3, Failures: 0, Errors: 0, Skipped: 0, Time elapsed: 5.936 sec
Running org.jboss.as.test.smoke.embedded.demos.managedbean.ManagedBeanTestCase
Tests run: 1, Failures: 0, Errors: 0, Skipped: 0, Time elapsed: 2.342 sec
Running
org.jboss.as.test.smoke.embedded.demos.ejb3.jndi.StandaloneModuleEjbJndiBindingTestCase
Tests run: 4, Failures: 0, Errors: 0, Skipped: 0, Time elapsed: 1.772 sec
Running
org.jboss.as.test.smoke.embedded.demos.ejb3.jndi.EarDeploymentEjbJndiBindingTestCase
Tests run: 4, Failures: 0, Errors: 0, Skipped: 0, Time elapsed: 1.372 sec
Running org.jboss.as.test.smoke.embedded.demos.ejb3.dd.DDBasedEJBTestCase
Tests run: 4, Failures: 0, Errors: 0, Skipped: 0, Time elapsed: 1.798 sec
Running org.jboss.as.test.smoke.embedded.demos.sar.SarTestCase
Tests run: 1, Failures: 0, Errors: 0, Skipped: 0, Time elapsed: 0.389 sec
Running org.jboss.as.test.smoke.embedded.demos.rar.RarTestCase
Tests run: 2, Failures: 0, Errors: 0, Skipped: 0, Time elapsed: 1.55 sec
Running org.jboss.as.test.smoke.embedded.demos.webapp.WebAppTestCase
Tests run: 1, Failures: 0, Errors: 0, Skipped: 1, Time elapsed: 0.001 sec
Running org.jboss.as.test.smoke.embedded.demos.serviceloader.ServiceLoaderTestCase
Tests run: 1, Failures: 0, Errors: 0, Skipped: 0, Time elapsed: 1.212 sec
Running org.jboss.as.test.smoke.embedded.parse.ParseAndMarshalModelsTestCase
Tests run: 30, Failures: 0, Errors: 0, Skipped: 0, Time elapsed: 34.56 sec
Running org.jboss.as.test.smoke.embedded.deployment.rar.AS7_1452.AS7_1452TestCase
Tests run: 1, Failures: 0, Errors: 0, Skipped: 1, Time elapsed: 0 sec
Running org.jboss.as.test.smoke.surefire.servermodule.ServerInModuleDeploymentTestCase
Tests run: 6, Failures: 0, Errors: 0, Skipped: 0, Time elapsed: 9.512 sec
Running org.jboss.as.test.smoke.surefire.servermodule.ValidateModelTestCase
Tests run: 1, Failures: 0, Errors: 0, Skipped: 0, Time elapsed: 1.168 sec
Running org.jboss.as.test.smoke.surefire.servermodule.HttpDeploymentUploadUnitTestCase
Tests run: 1, Failures: 0, Errors: 0, Skipped: 0, Time elapsed: 0.386 sec
Running org.jboss.as.test.smoke.surefire.servermodule.ServerInModuleStartupTestCase
Tests run: 2, Failures: 0, Errors: 0, Skipped: 0, Time elapsed: 2.15 sec
Running org.jboss.as.test.smoke.configadmin.ConfigAdminServiceTestCase
Tests run: 3, Failures: 0, Errors: 0, Skipped: 0, Time elapsed: 4.236 sec
Running org.jboss.as.test.smoke.jsr88.EnterpriseDeploymentTestCase
Tests run: 6, Failures: 0, Errors: 0, Skipped: 3, Time elapsed: 0.789 sec
Running org.jboss.as.test.smoke.osgi.SimpleBundleTestCase
Tests run: 1, Failures: 0, Errors: 0, Skipped: 0, Time elapsed: 4.169 sec
Running org.jboss.as.test.smoke.osgi.SimpleArquillianDeployerTestCase
Tests run: 1, Failures: 0, Errors: 0, Skipped: 0, Time elapsed: 1.398 sec
Running org.jboss.as.test.smoke.osgi.SimpleBundleContextTestCase
Tests run: 1, Failures: 0, Errors: 0, Skipped: 0, Time elapsed: 1.047 sec
Running org.jboss.as.test.smoke.osgi.SimpleModuleRegistrationTestCase
Tests run: 1, Failures: 0, Errors: 0, Skipped: 0, Time elapsed: 0.883 sec
Running org.jboss.as.test.smoke.osgi.SimpleStartLevelTestCase
Tests run: 1, Failures: 0, Errors: 0, Skipped: 0, Time elapsed: 5.545 sec
Running org.jboss.as.test.smoke.osgi.SimplePackageAdminTestCase
Tests run: 1, Failures: 0, Errors: 0, Skipped: 0, Time elapsed: 0.939 sec
Running org.jboss.as.test.smoke.stilts.SimpleStompletTestCase
Tests run: 2, Failures: 0, Errors: 0, Skipped: 0, Time elapsed: 0.816 sec
Running org.jboss.as.test.smoke.TestsuiteSanityTestCase
Tests run: 2, Failures: 0, Errors: 0, Skipped: 0, Time elapsed: 0.001 sec
Results :
Tests in error:
testAddXaDsWithProperties(org.jboss.as.test.smoke.embedded.mgmt.datasource.DataSourceOperationsUnitTestCase):
JBAS010625: Channel closed
Tests run: 111, Failures: 0, Errors: 1, Skipped: 7
[INFO] ------------------------------------------------------------------------
[INFO] Reactor Summary:
[INFO]
[INFO] JBoss Application Server: Build Configuration ..... SUCCESS [6.025s]
[INFO] JBoss Application Server: Parent Aggregator ....... SUCCESS [5.569s]
[INFO] JBoss Application Server: Exported Java EE Specification APIs SUCCESS [1.532s]
[INFO] JBoss Application Server: Protocol Utilities ...... SUCCESS [20.834s]
[INFO] JBoss Application Server: Controller Client ....... SUCCESS [11.013s]
[INFO] JBoss Application Server: Public APIs ............. SUCCESS [2.406s]
[INFO] JBoss Application Server: Controller Core ......... SUCCESS [45.471s]
[INFO] JBoss Application Server: Domain Management ....... SUCCESS [5.489s]
[INFO] JBoss Application Server: Domain HTTP Interface ... SUCCESS [0.370s]
[INFO] JBoss Application Server: Domain HTTP Interface ... SUCCESS [6.194s]
[INFO] JBoss Application Server: Deployment Repository ... SUCCESS [4.327s]
[INFO] JBoss Application Server: Embedded ................ SUCCESS [7.199s]
[INFO] JBoss Application Server: Platform MBean integration SUCCESS [9.954s]
[INFO] JBoss Application Server: Process Controller ...... SUCCESS [13.581s]
[INFO] JBoss Application Server: Network ................. SUCCESS [4.481s]
[INFO] JBoss Application Server: Threading Subsystem ..... SUCCESS [12.466s]
[INFO] JBoss Application Server: Remoting Subsystem ...... SUCCESS [11.135s]
[INFO] JBoss Application Server: Server .................. SUCCESS [25.401s]
[INFO] JBoss Application Server: Subsystem Test Harness .. SUCCESS [10.850s]
[INFO] JBoss Application Server: Naming Subsystem ........ SUCCESS [16.157s]
[INFO] JBoss Application Server: EE ...................... SUCCESS [19.436s]
[INFO] JBoss Application Server: Transaction Subsystem ... SUCCESS [11.369s]
[INFO] JBoss Application Server: Clustering Subsystem .... SUCCESS [0.241s]
[INFO] JBoss Application Server: Common code for clustering subsystems SUCCESS [13.944s]
[INFO] JBoss Application Server: JGroups Subsystem ....... SUCCESS [13.987s]
[INFO] JBoss Application Server: Infinispan Subsystem .... SUCCESS [18.328s]
[INFO] JBoss Application Server: Security Subsystem ...... SUCCESS [19.196s]
[INFO] JBoss Application Server: Connector Subsystem ..... SUCCESS [28.525s]
[INFO] JBoss Application Server: JacORB Subsystem ........ SUCCESS [25.787s]
[INFO] JBoss Application Server: EJB Subsystem ........... SUCCESS [43.052s]
[INFO] JBoss Application Server: Clustering Server API ... SUCCESS [17.029s]
[INFO] JBoss Application Server: Distributed Web Session SPI SUCCESS [7.046s]
[INFO] JBoss Application Server: Clustering Server API implementation SUCCESS [8.157s]
[INFO] JBoss Application Server: Distributed Web Session Infinispan provider SUCCESS
[14.583s]
[INFO] JBoss Application Server: Web Subsystem ........... SUCCESS [33.086s]
[INFO] JBoss Application Server: Web Services Subsystem .. SUCCESS [0.235s]
[INFO] JBoss Application Server: Web Services Server Integration Subsystem SUCCESS
[22.800s]
[INFO] JBoss Application Server: Application Client Bootstrap SUCCESS [12.102s]
[INFO] JBoss Application Server: Command line interface .. SUCCESS [15.824s]
[INFO] JBoss Application Server: EJB Container Managed Persistence Subsystem SUCCESS
[46.335s]
[INFO] JBoss Application Server: Deployment Scanner ...... SUCCESS [13.152s]
[INFO] JBoss Application Server: Domain Controller ....... SUCCESS [16.342s]
[INFO] JBoss Application Server: Domain HTTP Error Context SUCCESS [1.215s]
[INFO] JBoss Application Server: EE Deployment ........... SUCCESS [6.358s]
[INFO] JBoss Application Server: JPA Subsystem ........... SUCCESS [0.229s]
[INFO] JBoss Application Server: JPA SPI ................. SUCCESS [7.321s]
[INFO] JBoss Application Server: JPA UTIL ................ SUCCESS [3.222s]
[INFO] JBoss Application Server: JPA Subsystem ........... SUCCESS [14.808s]
[INFO] JBoss Application Server: Weld Integration ........ SUCCESS [19.551s]
[INFO] JBoss Application Server: JAX-RS Integration ...... SUCCESS [10.919s]
[INFO] JBoss Application Server: JBoss Diagnostic Reporter SUCCESS [0.192s]
[INFO] JBoss Application Server: JDR ..................... SUCCESS [7.369s]
[INFO] JBoss Application Server: JMX Subsystem ........... SUCCESS [21.912s]
[INFO] JBoss Application Server: Host Controller ......... SUCCESS [15.997s]
[INFO] JBoss Application Server: Logging Subsystem ....... SUCCESS [20.869s]
[INFO] JBoss Application Server: Mail subsystem .......... SUCCESS [11.371s]
[INFO] JBoss Application Server: Messaging Subsystem ..... SUCCESS [30.519s]
[INFO] JBoss Application Server: ModCluster Subsystem .... SUCCESS [13.878s]
[INFO] JBoss Application Server: POJO Subsystem .......... SUCCESS [12.684s]
[INFO] JBoss Application Server: OSGi .................... SUCCESS [0.229s]
[INFO] JBoss Application Server: OSGi Subsystem .......... SUCCESS [23.925s]
[INFO] JBoss Application Server: OSGi Config Admin ....... SUCCESS [6.742s]
[INFO] JBoss Application Server: sosreport scripts ....... SUCCESS [1.838s]
[INFO] JBoss Application Server: Service Archive Subsystem SUCCESS [9.846s]
[INFO] JBoss Application Server: XTS Subsystem ........... SUCCESS [10.955s]
[INFO] JBoss Application Server: Hibernate 3.6.x JPA integration SUCCESS [5.076s]
[INFO] JBoss Application Server: Hibernate 4.0.x JPA integration SUCCESS [6.483s]
[INFO] JBoss Application Server: Build ................... SUCCESS [22.734s]
[INFO] JBoss Application Server: Arquillian .............. SUCCESS [0.330s]
[INFO] JBoss Application Server: Arquillian TestEnricher MSC SUCCESS [2.575s]
[INFO] JBoss Application Server: Arquillian Common ....... SUCCESS [5.387s]
[INFO] JBoss Application Server: Arquillian Protocol JMX . SUCCESS [5.215s]
[INFO] JBoss Application Server: Arquillian Managed Container SUCCESS [25.616s]
[INFO] JBoss Application Server: Arquillian Remote Container SUCCESS [4.622s]
[INFO] JBoss Application Server: Arquillian TestNG Integration SUCCESS [23.469s]
[INFO] JBoss Application Server: Arquillian Managed Domain Container SUCCESS [7.734s]
[INFO] JBoss Application Server: Demos: Aggregator ....... SUCCESS [1.824s]
[INFO] JBoss Application Server: Demos: Spec ............. SUCCESS [5.795s]
[INFO] JBoss Application Server: Demos: Legacy TO BE MOVED SUCCESS [14.153s]
[INFO] JBoss Application Server: Distribution ............ SUCCESS [1.294s]
[INFO] JBoss Application Server: OSGi Integration Plugin . SUCCESS [3.724s]
[INFO] JBoss Application Server: Remoting Subsystem Test . SUCCESS [6.292s]
[INFO] JBoss Application Server: Validation Tests for Exported Java EE Specification APIs
SUCCESS [2.367s]
[INFO] JBoss Application Server: Web Services Tests Integration Subsystem SUCCESS
[4.048s]
[INFO] JBoss Application Server Test Suite: Aggregator ... SUCCESS [5.532s]
[INFO] JBoss Application Server Test Suite: Integration Aggregator SUCCESS [4.374s]
[INFO] JBoss AS Test Suite: Integration - Smoke .......... FAILURE [2:58.908s]
[INFO] ------------------------------------------------------------------------
[INFO] BUILD FAILURE
[INFO] ------------------------------------------------------------------------
[INFO] Total time: 20:21.923s
[INFO] Finished at: Mon Nov 28 07:21:51 EST 2011
[INFO] Final Memory: 163M/455M
[INFO] ------------------------------------------------------------------------
[ERROR] Failed to execute goal org.apache.maven.plugins:maven-surefire-plugin:2.10:test
(smoke-web.surefire) on project jboss-as-testsuite-integration-smoke: There are test
failures.
[ERROR]
[ERROR] Please refer to
<
http://hudson.qa.jboss.com/hudson/job/JBoss-AS-7.0.x/ws/testsuite/integra...
for the individual test results.
[ERROR] -> [Help 1]
[ERROR]
[ERROR] To see the full stack trace of the errors, re-run Maven with the -e switch.
[ERROR] Re-run Maven using the -X switch to enable full debug logging.
[ERROR]
[ERROR] For more information about the errors and possible solutions, please read the
following articles:
[ERROR] [Help 1]
http://cwiki.apache.org/confluence/display/MAVEN/MojoFailureException
[ERROR]
[ERROR] After correcting the problems, you can resume the build with the command
[ERROR] mvn <goals> -rf :jboss-as-testsuite-integration-smoke
Recording test results
Archiving artifacts