Public:
$PUBLIC_HUDSON_URL/job/jbosstools-nightly-3.2.next/86
$PUBLIC_HUDSON_URL/job/jbosstools-nightly-3.2.next/86/testReport
$PUBLIC_HUDSON_URL/job/jbosstools-nightly-3.2.next/86/changes
$PUBLIC_HUDSON_URL/job/jbosstools-nightly-3.2.next/86/console
Internal:
http://hudson.qa.jboss.com/hudson/job/jbosstools-nightly-3.2.next/86/
http://hudson.qa.jboss.com/hudson/job/jbosstools-nightly-3.2.next/86//tes...
http://hudson.qa.jboss.com/hudson/job/jbosstools-nightly-3.2.next/86//cha...
http://hudson.qa.jboss.com/hudson/job/jbosstools-nightly-3.2.next/86//con...
--------------------------------------------------
Failed Tests:
All tests passed
--------------------------------------------------
Changes:
[abogachuk]
https://jira.jboss.org/jira/browse/JBDS-1151 - The obsolete word is updated.
[ochikvina] <html><head><meta name="qrichtext"
content="1" /></head><body
style="font-size:9pt;font-family:Sans Serif">
<
p>https://jira.jboss.org/jira/browse/JBDS-821 - review just added Apply Template
Wizard section in Smooks-doc.</p>
</body></html>
--------------------------------------------------
Console log:
[...truncated 135420 lines...]
check.archive:
[echo] Checking the requirement's archive jboss-4.2.3.GA.zip
[echo] Archive has not downloaded yet, download required
download.archive:
[download jbossas] Getting:
http://downloads.sourceforge.net/sourceforge/jboss/jboss-4.2.3.GA.zip
[download jbossas] To:
/mnt/hudson_workspace/workspace/jbosstools-nightly-3.2.next/jbds-build/requirements/jbossas/jboss-4.2.3.GA.zip
post.download.requirement:
unzip.archive:
unpack-zip:
[unzip] Expanding:
/mnt/hudson_workspace/workspace/jbosstools-nightly-3.2.next/jbds-build/requirements/jbossas/jboss-4.2.3.GA.zip
into
/mnt/hudson_workspace/workspace/jbosstools-nightly-3.2.next/jbds-build/3.2.0.beta1/201003221031/tests/jboss
post.unpack.requirement:
build.driver:
build.requirement:
build-jbossas:
init:
check.archive:
[echo] Checking the requirement's archive jboss-5.0.1.GA.zip
[echo] Archive has not downloaded yet, download required
download.archive:
[download jbossas] Getting:
http://downloads.sourceforge.net/sourceforge/jboss/jboss-5.0.1.GA.zip
[download jbossas] To:
/mnt/hudson_workspace/workspace/jbosstools-nightly-3.2.next/jbds-build/requirements/jbossas/jboss-5.0.1.GA.zip
post.download.requirement:
unzip.archive:
unpack-zip:
[unzip] Expanding:
/mnt/hudson_workspace/workspace/jbosstools-nightly-3.2.next/jbds-build/requirements/jbossas/jboss-5.0.1.GA.zip
into
/mnt/hudson_workspace/workspace/jbosstools-nightly-3.2.next/jbds-build/3.2.0.beta1/201003221031/tests/jboss
post.unpack.requirement:
build.driver:
build.requirement:
build-jbossas:
init:
check.archive:
[echo] Checking the requirement's archive jboss-5.1.0.GA.zip
[echo] Archive has not downloaded yet, download required
download.archive:
[download jbossas] Getting:
http://downloads.sourceforge.net/sourceforge/jboss/jboss-5.1.0.GA.zip
[download jbossas] To:
/mnt/hudson_workspace/workspace/jbosstools-nightly-3.2.next/jbds-build/requirements/jbossas/jboss-5.1.0.GA.zip
post.download.requirement:
unzip.archive:
unpack-zip:
[unzip] Expanding:
/mnt/hudson_workspace/workspace/jbosstools-nightly-3.2.next/jbds-build/requirements/jbossas/jboss-5.1.0.GA.zip
into
/mnt/hudson_workspace/workspace/jbosstools-nightly-3.2.next/jbds-build/3.2.0.beta1/201003221031/tests/jboss
post.unpack.requirement:
build.driver:
build.requirement:
[echo] load properties from
/mnt/hudson_workspace/workspace/jbosstools-nightly-3.2.next/org.jboss.ide.eclipse.releng/requirements/jbossas/return.properties
init:
check.archive:
[echo] Checking the requirement's archive jboss-eap-noauth-4.3.0.GA_CP03.zip
[echo] Archive has not downloaded yet, download required
download.archive:
[mkdir] Created dir:
/mnt/hudson_workspace/workspace/jbosstools-nightly-3.2.next/jbds-build/requirements/jbeap
[download jbeap] Getting:
http://download.devel.redhat.com/released/JBEAP-4.3.0/CP03/zip/jboss-eap-...
[download jbeap] To:
/mnt/hudson_workspace/workspace/jbosstools-nightly-3.2.next/jbds-build/requirements/jbeap/jboss-eap-noauth-4.3.0.GA_CP03.zip
post.download.requirement:
unzip.archive:
unpack-zip:
[unzip] Expanding:
/mnt/hudson_workspace/workspace/jbosstools-nightly-3.2.next/jbds-build/requirements/jbeap/jboss-eap-noauth-4.3.0.GA_CP03.zip
into
/mnt/hudson_workspace/workspace/jbosstools-nightly-3.2.next/jbds-build/3.2.0.beta1/201003221031/tests/jboss
post.unpack.requirement:
build.driver:
build.requirement:
[echo] load properties from
/mnt/hudson_workspace/workspace/jbosstools-nightly-3.2.next/org.jboss.ide.eclipse.releng/requirements/jbeap/return.properties
unzip.archive:
init:
check.archive:
[echo] Checking the requirement's archive rhds-seam-gen-patch.zip
[echo] Archive has not downloaded yet, download required
download.archive:
[mkdir] Created dir:
/mnt/hudson_workspace/workspace/jbosstools-nightly-3.2.next/jbds-build/requirements/eapseamgen
[download eapseamgen] Getting:
file://mnt/hudson_workspace/workspace/jbosstools-nightly-3.2.next/org.jboss.ide.eclipse.releng/requirements/eapseamgen/rhds-seam-gen-patch.zip
[download eapseamgen] To:
/mnt/hudson_workspace/workspace/jbosstools-nightly-3.2.next/jbds-build/requirements/eapseamgen/rhds-seam-gen-patch.zip
post.download.requirement:
unzip.archive:
unpack-zip:
[unzip] Expanding:
/mnt/hudson_workspace/workspace/jbosstools-nightly-3.2.next/jbds-build/requirements/eapseamgen/rhds-seam-gen-patch.zip
into
/mnt/hudson_workspace/workspace/jbosstools-nightly-3.2.next/jbds-build/3.2.0.beta1/201003221031/tests/jboss/jboss-eap-4.3/seam
post.unpack.requirement:
unpack.requirement:
build.driver:
build.requirement:
[echo] load properties from
/mnt/hudson_workspace/workspace/jbosstools-nightly-3.2.next/org.jboss.ide.eclipse.releng/requirements/eapseamgen/return.properties
init:
check.archive:
[echo] Checking the requirement's archive jboss-eap-fp-4.3.0.CP03-FP01.zip
[echo] Archive has not downloaded yet, download required
download.archive:
[mkdir] Created dir:
/mnt/hudson_workspace/workspace/jbosstools-nightly-3.2.next/jbds-build/requirements/seamfp
[download seamfp] Getting:
http://download.devel.redhat.com/released/JBEAP-4.3.0/CP03_FP01/zip/jboss...
[download seamfp] To:
/mnt/hudson_workspace/workspace/jbosstools-nightly-3.2.next/jbds-build/requirements/seamfp/jboss-eap-fp-4.3.0.CP03-FP01.zip
post.download.requirement:
unzip.archive:
unpack-zip:
[unzip] Expanding:
/mnt/hudson_workspace/workspace/jbosstools-nightly-3.2.next/jbds-build/requirements/seamfp/jboss-eap-fp-4.3.0.CP03-FP01.zip
into
/mnt/hudson_workspace/workspace/jbosstools-nightly-3.2.next/jbds-build/3.2.0.beta1/201003221031/tests/jboss
post.unpack.requirement:
build.driver:
build.requirement:
[echo] load properties from
/mnt/hudson_workspace/workspace/jbosstools-nightly-3.2.next/org.jboss.ide.eclipse.releng/requirements/seamfp/return.properties
init:
check.archive:
[echo] Checking the requirement's archive jboss-seam-2.0.1.GA.zip
[echo] Archive has not downloaded yet, download required
download.archive:
[mkdir] Created dir:
/mnt/hudson_workspace/workspace/jbosstools-nightly-3.2.next/jbds-build/requirements/seam-2.0.1.GA
[download seam-2.0.1.GA] Getting:
http://downloads.sourceforge.net/sourceforge/jboss/jboss-seam-2.0.1.GA.zip
[download seam-2.0.1.GA] To:
/mnt/hudson_workspace/workspace/jbosstools-nightly-3.2.next/jbds-build/requirements/seam-2.0.1.GA/jboss-seam-2.0.1.GA.zip
post.download.requirement:
unzip.archive:
unpack-zip:
[unzip] Expanding:
/mnt/hudson_workspace/workspace/jbosstools-nightly-3.2.next/jbds-build/requirements/seam-2.0.1.GA/jboss-seam-2.0.1.GA.zip
into
/mnt/hudson_workspace/workspace/jbosstools-nightly-3.2.next/jbds-build/3.2.0.beta1/201003221031/tests/jboss
post.unpack.requirement:
build.driver:
build.requirement:
[echo] load properties from
/mnt/hudson_workspace/workspace/jbosstools-nightly-3.2.next/org.jboss.ide.eclipse.releng/requirements/seam-2.0.1.GA/return.properties
init:
check.archive:
[echo] Checking the requirement's archive jboss-seam-2.0.2.SP1.zip
[echo] Archive has not downloaded yet, download required
download.archive:
[mkdir] Created dir:
/mnt/hudson_workspace/workspace/jbosstools-nightly-3.2.next/jbds-build/requirements/seam-2.0.2.SP1
[download seam-2.0.2.SP1] Getting:
http://downloads.sourceforge.net/sourceforge/jboss/jboss-seam-2.0.2.SP1.zip
[download seam-2.0.2.SP1] To:
/mnt/hudson_workspace/workspace/jbosstools-nightly-3.2.next/jbds-build/requirements/seam-2.0.2.SP1/jboss-seam-2.0.2.SP1.zip
[download seam-2.0.2.SP1] Error opening connection java.io.IOException: Server returned
HTTP response code: 500 for URL:
http://hivelocity.dl.sourceforge.net/project/jboss/JBoss%20Seam/2.0.2.SP1...
[download seam-2.0.2.SP1] Error opening connection java.io.IOException: Server returned
HTTP response code: 500 for URL:
http://hivelocity.dl.sourceforge.net/project/jboss/JBoss%20Seam/2.0.2.SP1...
[download seam-2.0.2.SP1] Error opening connection java.io.IOException: Server returned
HTTP response code: 500 for URL:
http://hivelocity.dl.sourceforge.net/project/jboss/JBoss%20Seam/2.0.2.SP1...
[download seam-2.0.2.SP1] Can't get
http://downloads.sourceforge.net/sourceforge/jboss/jboss-seam-2.0.2.SP1.zip to
/mnt/hudson_workspace/workspace/jbosstools-nightly-3.2.next/jbds-build/requirements/seam-2.0.2.SP1/jboss-seam-2.0.2.SP1.zip
BUILD FAILED
/mnt/hudson_workspace/workspace/jbosstools-nightly-3.2.next/org.jboss.ide.eclipse.releng/builders/buildNightly.xml:18:
The following error occurred while executing this line:
/mnt/hudson_workspace/workspace/jbosstools-nightly-3.2.next/org.jboss.ide.eclipse.releng/builders/build.xml:68:
The following error occurred while executing this line:
/mnt/hudson_workspace/workspace/jbosstools-nightly-3.2.next/org.jboss.ide.eclipse.releng/builders/build.xml:27:
The following error occurred while executing this line:
/mnt/hudson_workspace/workspace/jbosstools-nightly-3.2.next/org.jboss.ide.eclipse.releng/builders/build.xml:39:
The following error occurred while executing this line:
/mnt/hudson_workspace/workspace/jbosstools-nightly-3.2.next/org.jboss.ide.eclipse.releng/builders/product/productBuild.xml:106:
The following error occurred while executing this line:
/mnt/hudson_workspace/workspace/jbosstools-nightly-3.2.next/org.jboss.ide.eclipse.releng/builders/product/productBuild.xml:185:
The following error occurred while executing this line:
/mnt/hudson_workspace/workspace/jbosstools-nightly-3.2.next/org.jboss.ide.eclipse.releng/builders/tests/testBuild.xml:35:
The following error occurred while executing this line:
/mnt/hudson_workspace/workspace/jbosstools-nightly-3.2.next/org.jboss.ide.eclipse.releng/builders/common/buildRequirements.xml:40:
The following error occurred while executing this line:
/mnt/hudson_workspace/workspace/jbosstools-nightly-3.2.next/org.jboss.ide.eclipse.releng/builders/common/buildRequirements.xml:48:
The following error occurred while executing this line:
/mnt/hudson_workspace/workspace/jbosstools-nightly-3.2.next/org.jboss.ide.eclipse.releng/requirements/generic/build.xml:83:
Can't get
http://downloads.sourceforge.net/sourceforge/jboss/jboss-seam-2.0.2.SP1.zip
to
/mnt/hudson_workspace/workspace/jbosstools-nightly-3.2.next/jbds-build/requirements/seam-2.0.2.SP1/jboss-seam-2.0.2.SP1.zip
Total time: 103 minutes 3 seconds
Terminating xvnc.
[jbosstools-nightly-3.2.next] $ vncserver -kill :15
Killing Xvnc process ID 18953
Recording test results
Description not found.
Recording Emma reports jbds-build/coverage.xml
Recording plot data
No plot data file found:
jbds-build/*/*/tests/test-results/emma-coverage/archives/lines.properties
No plot data file found:
jbds-build/*/*/tests/test-results/emma-coverage/as/lines.properties
No plot data file found:
jbds-build/*/*/tests/test-results/emma-coverage/hibernate-tools/lines.properties
No plot data file found:
jbds-build/*/*/tests/test-results/emma-coverage/jbpm-convert/lines.properties
No plot data file found:
jbds-build/*/*/tests/test-results/emma-coverage/jmx/lines.properties
No plot data file found:
jbds-build/*/*/tests/test-results/emma-coverage/bpel/lines.properties
No plot data file found:
jbds-build/*/*/tests/test-results/emma-coverage/common/lines.properties
No plot data file found:
jbds-build/*/*/tests/test-results/emma-coverage/struts/lines.properties
No plot data file found:
jbds-build/*/*/tests/test-results/emma-coverage/jsf/lines.properties
No plot data file found:
jbds-build/*/*/tests/test-results/emma-coverage/jst/lines.properties
No plot data file found:
jbds-build/*/*/tests/test-results/emma-coverage/seam/lines.properties
No plot data file found:
jbds-build/*/*/tests/test-results/emma-coverage/drools-ide/lines.properties
No plot data file found:
jbds-build/*/*/tests/test-results/emma-coverage/vpe/lines.properties
No plot data file found:
jbds-build/*/*/tests/test-results/emma-coverage/esb/lines.properties
No plot data file found:
jbds-build/*/*/tests/test-results/emma-coverage/freemarker/lines.properties
No plot data file found:
jbds-build/*/*/tests/test-results/emma-coverage/birt/lines.properties
No plot data file found:
jbds-build/*/*/tests/test-results/emma-coverage/smooks/lines.properties
No plot data file found:
jbds-build/*/*/tests/test-results/emma-coverage/archives/classes.properties
No plot data file found:
jbds-build/*/*/tests/test-results/emma-coverage/as/classes.properties
No plot data file found:
jbds-build/*/*/tests/test-results/emma-coverage/hibernate-tools/classes.properties
No plot data file found:
jbds-build/*/*/tests/test-results/emma-coverage/jbpm-convert/classes.properties
No plot data file found:
jbds-build/*/*/tests/test-results/emma-coverage/jmx/classes.properties
No plot data file found:
jbds-build/*/*/tests/test-results/emma-coverage/bpel/classes.properties
No plot data file found:
jbds-build/*/*/tests/test-results/emma-coverage/common/classes.properties
No plot data file found:
jbds-build/*/*/tests/test-results/emma-coverage/struts/classes.properties
No plot data file found:
jbds-build/*/*/tests/test-results/emma-coverage/jsf/classes.properties
No plot data file found:
jbds-build/*/*/tests/test-results/emma-coverage/jst/classes.properties
No plot data file found:
jbds-build/*/*/tests/test-results/emma-coverage/seam/classes.properties
No plot data file found:
jbds-build/*/*/tests/test-results/emma-coverage/drools-ide/classes.properties
No plot data file found:
jbds-build/*/*/tests/test-results/emma-coverage/vpe/classes.properties
No plot data file found:
jbds-build/*/*/tests/test-results/emma-coverage/esb/classes.properties
No plot data file found:
jbds-build/*/*/tests/test-results/emma-coverage/freemarker/classes.properties
No plot data file found:
jbds-build/*/*/tests/test-results/emma-coverage/birt/classes.properties
No plot data file found:
jbds-build/*/*/tests/test-results/emma-coverage/smooks/classes.properties
Email was triggered for: Failure
There are 1 triggered emails.
Sending email for trigger: Failure
--------------------------------------------------