See
http://hudson.qa.jboss.com/hudson/job/drools/2601/changes
Changes:
[Rikkola] GUVNOR-139: Drools system settings can be set with preferences.properties
GUVNOR-140: DSL date format sets the format for the date picker widget
------------------------------------------
[...truncated 13452 lines...]
-------------------------------------------------------
T E S T S
-------------------------------------------------------
Running org.drools.runtime.pipeline.impl.XStreamStatelessSessionTest
Tests run: 2, Failures: 0, Errors: 0, Skipped: 0, Time elapsed: 2.799 sec
Running org.drools.runtime.pipeline.impl.XStreamStatefulSessionTest
Tests run: 2, Failures: 0, Errors: 0, Skipped: 0, Time elapsed: 0.123 sec
Running org.drools.runtime.pipeline.impl.XStreamGlobalTest
Tests run: 1, Failures: 0, Errors: 0, Skipped: 0, Time elapsed: 0.068 sec
Running org.drools.runtime.pipeline.impl.XStreamFactTest
Tests run: 1, Failures: 0, Errors: 0, Skipped: 0, Time elapsed: 0.058 sec
Results :
Tests run: 6, Failures: 0, Errors: 0, Skipped: 0
[INFO] [jar:jar]
[INFO] Building jar:
http://hudson.qa.jboss.com/hudson/job/drools/ws/trunk/drools-pipeline/dro...
[INFO] Preparing source:jar
[WARNING] Removing: jar from forked lifecycle, to prevent recursive invocation.
[INFO] No goals needed for project - skipping
[INFO] [source:jar {execution: default}]
[INFO] Building jar:
http://hudson.qa.jboss.com/hudson/job/drools/ws/trunk/drools-pipeline/dro...
[INFO] Preparing source:test-jar
[WARNING] Removing: jar from forked lifecycle, to prevent recursive invocation.
[WARNING] Removing: test-jar from forked lifecycle, to prevent recursive invocation.
[INFO] No goals needed for project - skipping
[INFO] [source:test-jar {execution: default}]
[INFO] Building jar:
http://hudson.qa.jboss.com/hudson/job/drools/ws/trunk/drools-pipeline/dro...
[INFO] [jar:test-jar {execution: default}]
[INFO] Building jar:
http://hudson.qa.jboss.com/hudson/job/drools/ws/trunk/drools-pipeline/dro...
[INFO] [install:install]
[INFO] Installing
http://hudson.qa.jboss.com/hudson/job/drools/ws/trunk/drools-pipeline/dro...
to
/home/hudson/.m2/repository/org/drools/drools-transformer-xstream/5.0.0.SNAPSHOT/drools-transformer-xstream-5.0.0.SNAPSHOT.jar
[INFO] Installing
http://hudson.qa.jboss.com/hudson/job/drools/ws/trunk/drools-pipeline/dro...
to
/home/hudson/.m2/repository/org/drools/drools-transformer-xstream/5.0.0.SNAPSHOT/drools-transformer-xstream-5.0.0.SNAPSHOT-sources.jar
[INFO] Installing
http://hudson.qa.jboss.com/hudson/job/drools/ws/trunk/drools-pipeline/dro...
to
/home/hudson/.m2/repository/org/drools/drools-transformer-xstream/5.0.0.SNAPSHOT/drools-transformer-xstream-5.0.0.SNAPSHOT-test-sources.jar
[INFO] Installing
http://hudson.qa.jboss.com/hudson/job/drools/ws/trunk/drools-pipeline/dro...
to
/home/hudson/.m2/repository/org/drools/drools-transformer-xstream/5.0.0.SNAPSHOT/drools-transformer-xstream-5.0.0.SNAPSHOT-tests.jar
[INFO] ------------------------------------------------------------------------
[INFO] Building Drools :: Pipeline:: Transformer :: JXLS
[INFO] task-segment: [clean, install]
[INFO] ------------------------------------------------------------------------
[INFO] [clean:clean]
[INFO] Deleting directory
http://hudson.qa.jboss.com/hudson/job/drools/ws/trunk/drools-pipeline/dro...
[INFO] [resources:resources]
[WARNING] Using platform encoding (UTF-8 actually) to copy filtered resources, i.e. build
is platform dependent!
[INFO] Copying 0 resource
[INFO] [compiler:compile]
[INFO] Compiling 1 source file to
http://hudson.qa.jboss.com/hudson/job/drools/ws/trunk/drools-pipeline/dro...
[INFO] [resources:testResources]
[WARNING] Using platform encoding (UTF-8 actually) to copy filtered resources, i.e. build
is platform dependent!
[INFO] Copying 0 resource
[INFO] Copying 3 resources
[INFO] [compiler:testCompile]
[INFO] Compiling 4 source files to
http://hudson.qa.jboss.com/hudson/job/drools/ws/trunk/drools-pipeline/dro...
[INFO] [surefire:test]
[INFO] Surefire report directory:
http://hudson.qa.jboss.com/hudson/job/drools/ws/trunk/drools-pipeline/dro...
-------------------------------------------------------
T E S T S
-------------------------------------------------------
Running org.drools.runtime.pipeline.impl.JxlsTest
INFO - XLSReaderImpl.readSheet(40) | Processing sheet Sheet1
INFO - XLSReaderImpl.readSheet(40) | Processing sheet Sheet3
Tests run: 1, Failures: 0, Errors: 0, Skipped: 0, Time elapsed: 1.228 sec
Results :
Tests run: 1, Failures: 0, Errors: 0, Skipped: 0
[INFO] [jar:jar]
[INFO] Building jar:
http://hudson.qa.jboss.com/hudson/job/drools/ws/trunk/drools-pipeline/dro...
[INFO] Preparing source:jar
[WARNING] Removing: jar from forked lifecycle, to prevent recursive invocation.
[INFO] No goals needed for project - skipping
[INFO] [source:jar {execution: default}]
[INFO] Building jar:
http://hudson.qa.jboss.com/hudson/job/drools/ws/trunk/drools-pipeline/dro...
[INFO] Preparing source:test-jar
[WARNING] Removing: jar from forked lifecycle, to prevent recursive invocation.
[WARNING] Removing: test-jar from forked lifecycle, to prevent recursive invocation.
[INFO] No goals needed for project - skipping
[INFO] [source:test-jar {execution: default}]
[INFO] Building jar:
http://hudson.qa.jboss.com/hudson/job/drools/ws/trunk/drools-pipeline/dro...
[INFO] [jar:test-jar {execution: default}]
[INFO] Building jar:
http://hudson.qa.jboss.com/hudson/job/drools/ws/trunk/drools-pipeline/dro...
[INFO] [install:install]
[INFO] Installing
http://hudson.qa.jboss.com/hudson/job/drools/ws/trunk/drools-pipeline/dro...
to
/home/hudson/.m2/repository/org/drools/drools-transformer-jxls/5.0.0.SNAPSHOT/drools-transformer-jxls-5.0.0.SNAPSHOT.jar
[INFO] Installing
http://hudson.qa.jboss.com/hudson/job/drools/ws/trunk/drools-pipeline/dro...
to
/home/hudson/.m2/repository/org/drools/drools-transformer-jxls/5.0.0.SNAPSHOT/drools-transformer-jxls-5.0.0.SNAPSHOT-sources.jar
[INFO] Installing
http://hudson.qa.jboss.com/hudson/job/drools/ws/trunk/drools-pipeline/dro...
to
/home/hudson/.m2/repository/org/drools/drools-transformer-jxls/5.0.0.SNAPSHOT/drools-transformer-jxls-5.0.0.SNAPSHOT-test-sources.jar
[INFO] Installing
http://hudson.qa.jboss.com/hudson/job/drools/ws/trunk/drools-pipeline/dro...
to
/home/hudson/.m2/repository/org/drools/drools-transformer-jxls/5.0.0.SNAPSHOT/drools-transformer-jxls-5.0.0.SNAPSHOT-tests.jar
[INFO] ------------------------------------------------------------------------
[INFO] Building Drools :: Pipeline :: Messenger :: JMS
[INFO] task-segment: [clean, install]
[INFO] ------------------------------------------------------------------------
[INFO] [clean:clean]
[INFO] Deleting directory
http://hudson.qa.jboss.com/hudson/job/drools/ws/trunk/drools-pipeline/dro...
[INFO] [resources:resources]
[WARNING] Using platform encoding (UTF-8 actually) to copy filtered resources, i.e. build
is platform dependent!
[INFO] skip non existing resourceDirectory
http://hudson.qa.jboss.com/hudson/job/drools/ws/trunk/drools-pipeline/dro...
[INFO] [compiler:compile]
[INFO] Compiling 4 source files to
http://hudson.qa.jboss.com/hudson/job/drools/ws/trunk/drools-pipeline/dro...
[INFO] [resources:testResources]
[WARNING] Using platform encoding (UTF-8 actually) to copy filtered resources, i.e. build
is platform dependent!
[INFO] Copying 0 resource
[INFO] Copying 3 resources
[INFO] [compiler:testCompile]
[INFO] Compiling 4 source files to
http://hudson.qa.jboss.com/hudson/job/drools/ws/trunk/drools-pipeline/dro...
[INFO] [surefire:test]
[INFO] Surefire report directory:
http://hudson.qa.jboss.com/hudson/job/drools/ws/trunk/drools-pipeline/dro...
-------------------------------------------------------
T E S T S
-------------------------------------------------------
Running org.drools.runtime.pipeline.impl.SimpleJmsMessengerTest
log4j:WARN No appenders could be found for logger
(org.apache.activemq.transport.vm.VMTransportFactory).
log4j:WARN Please initialize the log4j system properly.
msg received : ActiveMQObjectMessage {commandId = 5, responseRequired = true, messageId =
ID:soa1.qa.atl2.redhat.com-52699-1234970409377-2:0:1:1:1, originalDestination = null,
originalTransactionId = null, producerId =
ID:soa1.qa.atl2.redhat.com-52699-1234970409377-2:0:1:1, destination = queue://FOO.BAR,
transactionId = null, expiration = 0, timestamp = 1234970409946, arrival = 0, brokerInTime
= 1234970409949, brokerOutTime = 1234970409955, correlationId = null, replyTo = null,
persistent = true, type = null, priority = 4, groupID = null, groupSequence = 0,
targetConsumerId = null, compressed = false, userID = null, content =
org.apache.activemq.util.ByteSequence@be49e0, marshalledProperties = null, dataStructure =
null, redeliveryCounter = 0, size = 1037, properties = null, readOnlyProperties = true,
readOnlyBody = true, droppable = false}
msg received : ActiveMQObjectMessage {commandId = 6, responseRequired = true, messageId =
ID:soa1.qa.atl2.redhat.com-52699-1234970409377-2:0:1:1:2, originalDestination = null,
originalTransactionId = null, producerId =
ID:soa1.qa.atl2.redhat.com-52699-1234970409377-2:0:1:1, destination = queue://FOO.BAR,
transactionId = null, expiration = 0, timestamp = 1234970409953, arrival = 0, brokerInTime
= 1234970409954, brokerOutTime = 1234970409957, correlationId = null, replyTo = null,
persistent = true, type = null, priority = 4, groupID = null, groupSequence = 0,
targetConsumerId = null, compressed = false, userID = null, content =
org.apache.activemq.util.ByteSequence@114b82b, marshalledProperties = null, dataStructure
= null, redeliveryCounter = 0, size = 1038, properties = null, readOnlyProperties = true,
readOnlyBody = true, droppable = false}
msg received : ActiveMQObjectMessage {commandId = 7, responseRequired = true, messageId =
ID:soa1.qa.atl2.redhat.com-52699-1234970409377-2:0:1:1:3, originalDestination = null,
originalTransactionId = null, producerId =
ID:soa1.qa.atl2.redhat.com-52699-1234970409377-2:0:1:1, destination = queue://FOO.BAR,
transactionId = null, expiration = 0, timestamp = 1234970409957, arrival = 0, brokerInTime
= 1234970409957, brokerOutTime = 1234970409958, correlationId = null, replyTo = null,
persistent = true, type = null, priority = 4, groupID = null, groupSequence = 0,
targetConsumerId = null, compressed = false, userID = null, content =
org.apache.activemq.util.ByteSequence@27982, marshalledProperties = null, dataStructure =
null, redeliveryCounter = 0, size = 1038, properties = null, readOnlyProperties = true,
readOnlyBody = true, droppable = false}
msg received : ActiveMQObjectMessage {commandId = 8, responseRequired = true, messageId =
ID:soa1.qa.atl2.redhat.com-52699-1234970409377-2:0:1:1:4, originalDestination = null,
originalTransactionId = null, producerId =
ID:soa1.qa.atl2.redhat.com-52699-1234970409377-2:0:1:1, destination = queue://FOO.BAR,
transactionId = null, expiration = 0, timestamp = 1234970409958, arrival = 0, brokerInTime
= 1234970409958, brokerOutTime = 1234970409959, correlationId = null, replyTo = null,
persistent = true, type = null, priority = 4, groupID = null, groupSequence = 0,
targetConsumerId = null, compressed = false, userID = null, content =
org.apache.activemq.util.ByteSequence@da90c, marshalledProperties = null, dataStructure =
null, redeliveryCounter = 0, size = 1038, properties = null, readOnlyProperties = true,
readOnlyBody = true, droppable = false}
Exception in thread "Thread-4" java.lang.NullPointerException
at
org.drools.runtime.pipeline.impl.JmsUnwrapMessageObject.receive(JmsUnwrapMessageObject.java:18)
at org.drools.runtime.pipeline.impl.BaseEmitter.emit(BaseEmitter.java:31)
at
org.drools.runtime.pipeline.impl.StatefulKnowledgeSessionPipelineImpl.insert(StatefulKnowledgeSessionPipelineImpl.java:35)
at
org.drools.runtime.pipeline.impl.JmsMessenger$JmsMessengerRunner.run(JmsMessenger.java:129)
at java.lang.Thread.run(Thread.java:595)
Tests run: 1, Failures: 0, Errors: 0, Skipped: 0, Time elapsed: 1.665 sec
Running org.drools.runtime.pipeline.impl.JaxbSimpleJmsMessengerTest
msg received : ActiveMQObjectMessage {commandId = 5, responseRequired = true, messageId =
ID:soa1.qa.atl2.redhat.com-52699-1234970409377-2:2:1:1:1, originalDestination = null,
originalTransactionId = null, producerId =
ID:soa1.qa.atl2.redhat.com-52699-1234970409377-2:2:1:1, destination = queue://FOO.BAR,
transactionId = null, expiration = 0, timestamp = 1234970413548, arrival = 0, brokerInTime
= 1234970413549, brokerOutTime = 1234970413550, correlationId = null, replyTo = null,
persistent = true, type = null, priority = 4, groupID = null, groupSequence = 0,
targetConsumerId = null, compressed = false, userID = null, content =
org.apache.activemq.util.ByteSequence@1eb717e, marshalledProperties = null, dataStructure
= null, redeliveryCounter = 0, size = 1417, properties = null, readOnlyProperties = true,
readOnlyBody = true, droppable = false}
Exception in thread "Thread-6" java.lang.NullPointerException
at
org.drools.runtime.pipeline.impl.JmsUnwrapMessageObject.receive(JmsUnwrapMessageObject.java:18)
at org.drools.runtime.pipeline.impl.BaseEmitter.emit(BaseEmitter.java:31)
at
org.drools.runtime.pipeline.impl.StatefulKnowledgeSessionPipelineImpl.insert(StatefulKnowledgeSessionPipelineImpl.java:35)
at
org.drools.runtime.pipeline.impl.JmsMessenger$JmsMessengerRunner.run(JmsMessenger.java:129)
at java.lang.Thread.run(Thread.java:595)
Tests run: 1, Failures: 0, Errors: 0, Skipped: 0, Time elapsed: 3.592 sec
Results :
Tests run: 2, Failures: 0, Errors: 0, Skipped: 0
[INFO] [jar:jar]
[INFO] Building jar:
http://hudson.qa.jboss.com/hudson/job/drools/ws/trunk/drools-pipeline/dro...
[INFO] Preparing source:jar
[WARNING] Removing: jar from forked lifecycle, to prevent recursive invocation.
[INFO] No goals needed for project - skipping
[INFO] [source:jar {execution: default}]
[INFO] Building jar:
http://hudson.qa.jboss.com/hudson/job/drools/ws/trunk/drools-pipeline/dro...
[INFO] Preparing source:test-jar
[WARNING] Removing: jar from forked lifecycle, to prevent recursive invocation.
[WARNING] Removing: test-jar from forked lifecycle, to prevent recursive invocation.
[INFO] No goals needed for project - skipping
[INFO] [source:test-jar {execution: default}]
[INFO] Building jar:
http://hudson.qa.jboss.com/hudson/job/drools/ws/trunk/drools-pipeline/dro...
[INFO] [jar:test-jar {execution: default}]
[INFO] Building jar:
http://hudson.qa.jboss.com/hudson/job/drools/ws/trunk/drools-pipeline/dro...
[INFO] [install:install]
[INFO] Installing
http://hudson.qa.jboss.com/hudson/job/drools/ws/trunk/drools-pipeline/dro...
to
/home/hudson/.m2/repository/org/drools/drools-messenger-jms/5.0.0.SNAPSHOT/drools-messenger-jms-5.0.0.SNAPSHOT.jar
[INFO] Installing
http://hudson.qa.jboss.com/hudson/job/drools/ws/trunk/drools-pipeline/dro...
to
/home/hudson/.m2/repository/org/drools/drools-messenger-jms/5.0.0.SNAPSHOT/drools-messenger-jms-5.0.0.SNAPSHOT-sources.jar
[INFO] Installing
http://hudson.qa.jboss.com/hudson/job/drools/ws/trunk/drools-pipeline/dro...
to
/home/hudson/.m2/repository/org/drools/drools-messenger-jms/5.0.0.SNAPSHOT/drools-messenger-jms-5.0.0.SNAPSHOT-test-sources.jar
[INFO] Installing
http://hudson.qa.jboss.com/hudson/job/drools/ws/trunk/drools-pipeline/dro...
to
/home/hudson/.m2/repository/org/drools/drools-messenger-jms/5.0.0.SNAPSHOT/drools-messenger-jms-5.0.0.SNAPSHOT-tests.jar
[INFO] ------------------------------------------------------------------------
[INFO] Building Drools :: Transformer
[INFO] task-segment: [clean, install]
[INFO] ------------------------------------------------------------------------
[INFO] [clean:clean]
[INFO] [site:attach-descriptor]
[INFO] Preparing source:jar
[WARNING] Removing: jar from forked lifecycle, to prevent recursive invocation.
[INFO] No goals needed for project - skipping
[INFO] [source:jar {execution: default}]
[INFO] Preparing source:test-jar
[WARNING] Removing: jar from forked lifecycle, to prevent recursive invocation.
[WARNING] Removing: test-jar from forked lifecycle, to prevent recursive invocation.
[INFO] No goals needed for project - skipping
[INFO] [source:test-jar {execution: default}]
[INFO] [install:install]
[INFO] Installing
http://hudson.qa.jboss.com/hudson/job/drools/ws/trunk/drools-pipeline/pom... to
/home/hudson/.m2/repository/org/drools/drools-transformer/5.0.0.SNAPSHOT/drools-transformer-5.0.0.SNAPSHOT.pom
[INFO] ------------------------------------------------------------------------
[INFO] Building Drools :: Process :: WorkItems
[INFO] task-segment: [clean, install]
[INFO] ------------------------------------------------------------------------
[INFO] [clean:clean]
[INFO] Deleting directory
http://hudson.qa.jboss.com/hudson/job/drools/ws/trunk/drools-process/droo...
[INFO] [resources:resources]
[WARNING] Using platform encoding (UTF-8 actually) to copy filtered resources, i.e. build
is platform dependent!
[INFO] Copying 3 resources
[INFO] [compiler:compile]
[INFO] Compiling 15 source files to
http://hudson.qa.jboss.com/hudson/job/drools/ws/trunk/drools-process/droo...
[INFO] [resources:testResources]
[WARNING] Using platform encoding (UTF-8 actually) to copy filtered resources, i.e. build
is platform dependent!
[INFO] Copying 0 resource
[INFO] Copying 5 resources
[INFO] [compiler:testCompile]
[INFO] Compiling 6 source files to
http://hudson.qa.jboss.com/hudson/job/drools/ws/trunk/drools-process/droo...
[INFO] [surefire:test]
[INFO] Surefire report directory:
http://hudson.qa.jboss.com/hudson/job/drools/ws/trunk/drools-process/droo...
-------------------------------------------------------
T E S T S
-------------------------------------------------------
Running org.drools.process.workitem.rss.RSSWorkItemHandlerTest
Tests run: 1, Failures: 0, Errors: 0, Skipped: 0, Time elapsed: 2.201 sec
Running org.drools.process.workitem.email.EmailWorkItemHandlerTest
log4j:WARN No appenders could be found for logger
(org.subethamail.smtp.server.CommandHandler).
log4j:WARN Please initialize the log4j system properly.
Tests run: 1, Failures: 0, Errors: 0, Skipped: 0, Time elapsed: 0.069 sec
Running org.drools.process.workitem.jabber.JabberWorkItemHandlerTest
Error! A startup class specified in smack-config.xml could not be loaded:
org.jivesoftware.smackx.ServiceDiscoveryManager
Error! A startup class specified in smack-config.xml could not be loaded:
org.jivesoftware.smackx.XHTMLManager
Error! A startup class specified in smack-config.xml could not be loaded:
org.jivesoftware.smackx.muc.MultiUserChat
Error! A startup class specified in smack-config.xml could not be loaded:
org.jivesoftware.smackx.filetransfer.FileTransferManager
Error! A startup class specified in smack-config.xml could not be loaded:
org.jivesoftware.smackx.LastActivityManager
Error! A startup class specified in smack-config.xml could not be loaded:
org.jivesoftware.smackx.ServiceDiscoveryManager
Error! A startup class specified in smack-config.xml could not be loaded:
org.jivesoftware.smackx.XHTMLManager
Error! A startup class specified in smack-config.xml could not be loaded:
org.jivesoftware.smackx.muc.MultiUserChat
Error! A startup class specified in smack-config.xml could not be loaded:
org.jivesoftware.smackx.filetransfer.FileTransferManager
Error! A startup class specified in smack-config.xml could not be loaded:
org.jivesoftware.smackx.LastActivityManager
Connected to
talk.l.google.com
Logged in as drools.demo(a)gmail.com/Smack6A6B69DA
Message Sended
Tests run: 1, Failures: 0, Errors: 0, Skipped: 0, Time elapsed: 1.207 sec
Running com.sample.RuleFlowTest
Tests run: 0, Failures: 0, Errors: 0, Skipped: 0, Time elapsed: 0.003 sec
Running org.drools.process.workitem.ftp.FTPWorkItemHandlerTest
Tests run: 1, Failures: 0, Errors: 1, Skipped: 0, Time elapsed: 0.212 sec <<<
FAILURE!
Results :
Tests in error:
testUploadFile(org.drools.process.workitem.ftp.FTPWorkItemHandlerTest)
Tests run: 4, Failures: 0, Errors: 1, Skipped: 0
[INFO] ------------------------------------------------------------------------
[ERROR] BUILD FAILURE
[INFO] ------------------------------------------------------------------------
[INFO] There are test failures.
Please refer to
http://hudson.qa.jboss.com/hudson/job/drools/ws/trunk/drools-process/droo...
for the individual test results.
[INFO] ------------------------------------------------------------------------
[INFO] For more information, run Maven with the -e switch
[INFO] ------------------------------------------------------------------------
[INFO] Total time: 5 minutes 44 seconds
[INFO] Finished at: Wed Feb 18 10:20:21 EST 2009
[INFO] Final Memory: 43M/991M
[INFO] ------------------------------------------------------------------------
Terminating xvnc
[drools] $ vncserver -kill :14
Killing Xvnc process ID 24447
Recording test results