Public:
https://hudson.jboss.org/hudson//job/jbosstools-nightly-3.1.0.M2/341
https://hudson.jboss.org/hudson//job/jbosstools-nightly-3.1.0.M2/341/test...
https://hudson.jboss.org/hudson//job/jbosstools-nightly-3.1.0.M2/341/changes
https://hudson.jboss.org/hudson//job/jbosstools-nightly-3.1.0.M2/341/console
Internal:
http://hudson.qa.jboss.com/hudson/job/jbosstools-nightly-3.1.0.M2/341/
http://hudson.qa.jboss.com/hudson/job/jbosstools-nightly-3.1.0.M2/341//te...
http://hudson.qa.jboss.com/hudson/job/jbosstools-nightly-3.1.0.M2/341//ch...
http://hudson.qa.jboss.com/hudson/job/jbosstools-nightly-3.1.0.M2/341//co...
--------------------------------------------------
Failed Tests:
32 tests failed.
FAILED: ArchivesTestSuite
Error Message:
An error occurred while building project archives An error occurred while building project
archives
Stack Trace:
junit.framework.AssertionFailedError: An error occurred while building project archives
An error occurred while building project archives
at
org.jboss.ide.eclipse.archives.test.ui.BuildActionTest.waitForGo(BuildActionTest.java:132)
at
org.jboss.ide.eclipse.archives.test.ui.BuildActionTest.testBuildAction(BuildActionTest.java:92)
at org.eclipse.test.EclipseTestRunner.run(EclipseTestRunner.java:354)
at org.eclipse.test.EclipseTestRunner.run(EclipseTestRunner.java:206)
at org.eclipse.test.UITestApplication$3.run(UITestApplication.java:195)
at org.eclipse.swt.widgets.RunnableLock.run(RunnableLock.java:35)
at org.eclipse.swt.widgets.Synchronizer.runAsyncMessages(Synchronizer.java:134)
at org.eclipse.swt.widgets.Display.runAsyncMessages(Display.java:3468)
at org.eclipse.swt.widgets.Display.readAndDispatch(Display.java:3115)
at org.eclipse.ui.internal.Workbench.runEventLoop(Workbench.java:2405)
at org.eclipse.ui.internal.Workbench.runUI(Workbench.java:2369)
at org.eclipse.ui.internal.Workbench.access$4(Workbench.java:2221)
at org.eclipse.ui.internal.Workbench$5.run(Workbench.java:500)
at org.eclipse.core.databinding.observable.Realm.runWithDefault(Realm.java:332)
at org.eclipse.ui.internal.Workbench.createAndRunWorkbench(Workbench.java:493)
at org.eclipse.ui.PlatformUI.createAndRunWorkbench(PlatformUI.java:149)
at org.eclipse.ui.internal.ide.application.IDEApplication.start(IDEApplication.java:113)
at org.eclipse.test.UITestApplication.runApplication(UITestApplication.java:138)
at org.eclipse.test.UITestApplication.run(UITestApplication.java:60)
at org.eclipse.test.UITestApplication.start(UITestApplication.java:210)
at org.eclipse.equinox.internal.app.EclipseAppHandle.run(EclipseAppHandle.java:194)
at
org.eclipse.core.runtime.internal.adaptor.EclipseAppLauncher.runApplication(EclipseAppLauncher.java:110)
at
org.eclipse.core.runtime.internal.adaptor.EclipseAppLauncher.start(EclipseAppLauncher.java:79)
at org.eclipse.core.runtime.adaptor.EclipseStarter.run(EclipseStarter.java:368)
at org.eclipse.core.runtime.adaptor.EclipseStarter.run(EclipseStarter.java:179)
at org.eclipse.equinox.launcher.Main.invokeFramework(Main.java:559)
at org.eclipse.equinox.launcher.Main.basicRun(Main.java:514)
at org.eclipse.equinox.launcher.Main.run(Main.java:1311)
at org.eclipse.equinox.launcher.Main.main(Main.java:1287)
at org.eclipse.core.launcher.Main.main(Main.java:34)
FAILED: ASTestSuite
Error Message:
JBoss 3.2 (${jboss32.home}) does not exist.
Stack Trace:
junit.framework.AssertionFailedError: JBoss 3.2 (${jboss32.home}) does not exist.
at org.jboss.ide.eclipse.as.test.PreReqTest._testExists(PreReqTest.java:58)
at org.jboss.ide.eclipse.as.test.PreReqTest.testAS32Exists(PreReqTest.java:41)
at org.eclipse.test.EclipseTestRunner.run(EclipseTestRunner.java:354)
at org.eclipse.test.EclipseTestRunner.run(EclipseTestRunner.java:206)
at org.eclipse.test.UITestApplication$3.run(UITestApplication.java:195)
at org.eclipse.swt.widgets.RunnableLock.run(RunnableLock.java:35)
at org.eclipse.swt.widgets.Synchronizer.runAsyncMessages(Synchronizer.java:134)
at org.eclipse.swt.widgets.Display.runAsyncMessages(Display.java:3468)
at org.eclipse.swt.widgets.Display.readAndDispatch(Display.java:3115)
at org.eclipse.ui.internal.Workbench.runEventLoop(Workbench.java:2405)
at org.eclipse.ui.internal.Workbench.runUI(Workbench.java:2369)
at org.eclipse.ui.internal.Workbench.access$4(Workbench.java:2221)
at org.eclipse.ui.internal.Workbench$5.run(Workbench.java:500)
at org.eclipse.core.databinding.observable.Realm.runWithDefault(Realm.java:332)
at org.eclipse.ui.internal.Workbench.createAndRunWorkbench(Workbench.java:493)
at org.eclipse.ui.PlatformUI.createAndRunWorkbench(PlatformUI.java:149)
at org.eclipse.ui.internal.ide.application.IDEApplication.start(IDEApplication.java:113)
at org.eclipse.test.UITestApplication.runApplication(UITestApplication.java:138)
at org.eclipse.test.UITestApplication.run(UITestApplication.java:60)
at org.eclipse.test.UITestApplication.start(UITestApplication.java:210)
at org.eclipse.equinox.internal.app.EclipseAppHandle.run(EclipseAppHandle.java:194)
at
org.eclipse.core.runtime.internal.adaptor.EclipseAppLauncher.runApplication(EclipseAppLauncher.java:110)
at
org.eclipse.core.runtime.internal.adaptor.EclipseAppLauncher.start(EclipseAppLauncher.java:79)
at org.eclipse.core.runtime.adaptor.EclipseStarter.run(EclipseStarter.java:368)
at org.eclipse.core.runtime.adaptor.EclipseStarter.run(EclipseStarter.java:179)
at org.eclipse.equinox.launcher.Main.invokeFramework(Main.java:559)
at org.eclipse.equinox.launcher.Main.basicRun(Main.java:514)
at org.eclipse.equinox.launcher.Main.run(Main.java:1311)
at org.eclipse.equinox.launcher.Main.main(Main.java:1287)
at org.eclipse.core.launcher.Main.main(Main.java:34)
FAILED: ASTestSuite
Error Message:
JBoss 4.0 (${jboss40.home}) does not exist.
Stack Trace:
junit.framework.AssertionFailedError: JBoss 4.0 (${jboss40.home}) does not exist.
at org.jboss.ide.eclipse.as.test.PreReqTest._testExists(PreReqTest.java:58)
at org.jboss.ide.eclipse.as.test.PreReqTest.testAS40Exists(PreReqTest.java:45)
at org.eclipse.test.EclipseTestRunner.run(EclipseTestRunner.java:354)
at org.eclipse.test.EclipseTestRunner.run(EclipseTestRunner.java:206)
at org.eclipse.test.UITestApplication$3.run(UITestApplication.java:195)
at org.eclipse.swt.widgets.RunnableLock.run(RunnableLock.java:35)
at org.eclipse.swt.widgets.Synchronizer.runAsyncMessages(Synchronizer.java:134)
at org.eclipse.swt.widgets.Display.runAsyncMessages(Display.java:3468)
at org.eclipse.swt.widgets.Display.readAndDispatch(Display.java:3115)
at org.eclipse.ui.internal.Workbench.runEventLoop(Workbench.java:2405)
at org.eclipse.ui.internal.Workbench.runUI(Workbench.java:2369)
at org.eclipse.ui.internal.Workbench.access$4(Workbench.java:2221)
at org.eclipse.ui.internal.Workbench$5.run(Workbench.java:500)
at org.eclipse.core.databinding.observable.Realm.runWithDefault(Realm.java:332)
at org.eclipse.ui.internal.Workbench.createAndRunWorkbench(Workbench.java:493)
at org.eclipse.ui.PlatformUI.createAndRunWorkbench(PlatformUI.java:149)
at org.eclipse.ui.internal.ide.application.IDEApplication.start(IDEApplication.java:113)
at org.eclipse.test.UITestApplication.runApplication(UITestApplication.java:138)
at org.eclipse.test.UITestApplication.run(UITestApplication.java:60)
at org.eclipse.test.UITestApplication.start(UITestApplication.java:210)
at org.eclipse.equinox.internal.app.EclipseAppHandle.run(EclipseAppHandle.java:194)
at
org.eclipse.core.runtime.internal.adaptor.EclipseAppLauncher.runApplication(EclipseAppLauncher.java:110)
at
org.eclipse.core.runtime.internal.adaptor.EclipseAppLauncher.start(EclipseAppLauncher.java:79)
at org.eclipse.core.runtime.adaptor.EclipseStarter.run(EclipseStarter.java:368)
at org.eclipse.core.runtime.adaptor.EclipseStarter.run(EclipseStarter.java:179)
at org.eclipse.equinox.launcher.Main.invokeFramework(Main.java:559)
at org.eclipse.equinox.launcher.Main.basicRun(Main.java:514)
at org.eclipse.equinox.launcher.Main.run(Main.java:1311)
at org.eclipse.equinox.launcher.Main.main(Main.java:1287)
at org.eclipse.core.launcher.Main.main(Main.java:34)
FAILED: ASTestSuite
Error Message:
JBoss 4.2 (${jboss42.home}) does not exist.
Stack Trace:
junit.framework.AssertionFailedError: JBoss 4.2 (${jboss42.home}) does not exist.
at org.jboss.ide.eclipse.as.test.PreReqTest._testExists(PreReqTest.java:58)
at org.jboss.ide.eclipse.as.test.PreReqTest.testAS42Exists(PreReqTest.java:49)
at org.eclipse.test.EclipseTestRunner.run(EclipseTestRunner.java:354)
at org.eclipse.test.EclipseTestRunner.run(EclipseTestRunner.java:206)
at org.eclipse.test.UITestApplication$3.run(UITestApplication.java:195)
at org.eclipse.swt.widgets.RunnableLock.run(RunnableLock.java:35)
at org.eclipse.swt.widgets.Synchronizer.runAsyncMessages(Synchronizer.java:134)
at org.eclipse.swt.widgets.Display.runAsyncMessages(Display.java:3468)
at org.eclipse.swt.widgets.Display.readAndDispatch(Display.java:3115)
at org.eclipse.ui.internal.Workbench.runEventLoop(Workbench.java:2405)
at org.eclipse.ui.internal.Workbench.runUI(Workbench.java:2369)
at org.eclipse.ui.internal.Workbench.access$4(Workbench.java:2221)
at org.eclipse.ui.internal.Workbench$5.run(Workbench.java:500)
at org.eclipse.core.databinding.observable.Realm.runWithDefault(Realm.java:332)
at org.eclipse.ui.internal.Workbench.createAndRunWorkbench(Workbench.java:493)
at org.eclipse.ui.PlatformUI.createAndRunWorkbench(PlatformUI.java:149)
at org.eclipse.ui.internal.ide.application.IDEApplication.start(IDEApplication.java:113)
at org.eclipse.test.UITestApplication.runApplication(UITestApplication.java:138)
at org.eclipse.test.UITestApplication.run(UITestApplication.java:60)
at org.eclipse.test.UITestApplication.start(UITestApplication.java:210)
at org.eclipse.equinox.internal.app.EclipseAppHandle.run(EclipseAppHandle.java:194)
at
org.eclipse.core.runtime.internal.adaptor.EclipseAppLauncher.runApplication(EclipseAppLauncher.java:110)
at
org.eclipse.core.runtime.internal.adaptor.EclipseAppLauncher.start(EclipseAppLauncher.java:79)
at org.eclipse.core.runtime.adaptor.EclipseStarter.run(EclipseStarter.java:368)
at org.eclipse.core.runtime.adaptor.EclipseStarter.run(EclipseStarter.java:179)
at org.eclipse.equinox.launcher.Main.invokeFramework(Main.java:559)
at org.eclipse.equinox.launcher.Main.basicRun(Main.java:514)
at org.eclipse.equinox.launcher.Main.run(Main.java:1311)
at org.eclipse.equinox.launcher.Main.main(Main.java:1287)
at org.eclipse.core.launcher.Main.main(Main.java:34)
FAILED: ASTestSuite
Error Message:
Default JBoss Installation
(/home/hudson/hudson_workspace/workspace/jbosstools-nightly-3.1.0.M2/jbds-build/3.1.0.M2/200907061943/tests/jboss/jboss-eap-4.3/jboss-as)
does not exist.
Stack Trace:
junit.framework.AssertionFailedError: Default JBoss Installation
(/home/hudson/hudson_workspace/workspace/jbosstools-nightly-3.1.0.M2/jbds-build/3.1.0.M2/200907061943/tests/jboss/jboss-eap-4.3/jboss-as)
does not exist.
at org.jboss.ide.eclipse.as.test.PreReqTest._testExists(PreReqTest.java:58)
at org.jboss.ide.eclipse.as.test.PreReqTest.testASHomeExists(PreReqTest.java:53)
at org.eclipse.test.EclipseTestRunner.run(EclipseTestRunner.java:354)
at org.eclipse.test.EclipseTestRunner.run(EclipseTestRunner.java:206)
at org.eclipse.test.UITestApplication$3.run(UITestApplication.java:195)
at org.eclipse.swt.widgets.RunnableLock.run(RunnableLock.java:35)
at org.eclipse.swt.widgets.Synchronizer.runAsyncMessages(Synchronizer.java:134)
at org.eclipse.swt.widgets.Display.runAsyncMessages(Display.java:3468)
at org.eclipse.swt.widgets.Display.readAndDispatch(Display.java:3115)
at org.eclipse.ui.internal.Workbench.runEventLoop(Workbench.java:2405)
at org.eclipse.ui.internal.Workbench.runUI(Workbench.java:2369)
at org.eclipse.ui.internal.Workbench.access$4(Workbench.java:2221)
at org.eclipse.ui.internal.Workbench$5.run(Workbench.java:500)
at org.eclipse.core.databinding.observable.Realm.runWithDefault(Realm.java:332)
at org.eclipse.ui.internal.Workbench.createAndRunWorkbench(Workbench.java:493)
at org.eclipse.ui.PlatformUI.createAndRunWorkbench(PlatformUI.java:149)
at org.eclipse.ui.internal.ide.application.IDEApplication.start(IDEApplication.java:113)
at org.eclipse.test.UITestApplication.runApplication(UITestApplication.java:138)
at org.eclipse.test.UITestApplication.run(UITestApplication.java:60)
at org.eclipse.test.UITestApplication.start(UITestApplication.java:210)
at org.eclipse.equinox.internal.app.EclipseAppHandle.run(EclipseAppHandle.java:194)
at
org.eclipse.core.runtime.internal.adaptor.EclipseAppLauncher.runApplication(EclipseAppLauncher.java:110)
at
org.eclipse.core.runtime.internal.adaptor.EclipseAppLauncher.start(EclipseAppLauncher.java:79)
at org.eclipse.core.runtime.adaptor.EclipseStarter.run(EclipseStarter.java:368)
at org.eclipse.core.runtime.adaptor.EclipseStarter.run(EclipseStarter.java:179)
at org.eclipse.equinox.launcher.Main.invokeFramework(Main.java:559)
at org.eclipse.equinox.launcher.Main.basicRun(Main.java:514)
at org.eclipse.equinox.launcher.Main.run(Main.java:1311)
at org.eclipse.equinox.launcher.Main.main(Main.java:1287)
at org.eclipse.core.launcher.Main.main(Main.java:34)
FAILED: ASTestSuite
Error Message:
URI does not have the expected value
Stack Trace:
junit.framework.AssertionFailedError: URI does not have the expected value
at
org.jboss.ide.eclipse.as.test.publishing.JBIDE2512bTest.testJBIDE2512b(JBIDE2512bTest.java:39)
at org.eclipse.test.EclipseTestRunner.run(EclipseTestRunner.java:354)
at org.eclipse.test.EclipseTestRunner.run(EclipseTestRunner.java:206)
at org.eclipse.test.UITestApplication$3.run(UITestApplication.java:195)
at org.eclipse.swt.widgets.RunnableLock.run(RunnableLock.java:35)
at org.eclipse.swt.widgets.Synchronizer.runAsyncMessages(Synchronizer.java:134)
at org.eclipse.swt.widgets.Display.runAsyncMessages(Display.java:3468)
at org.eclipse.swt.widgets.Display.readAndDispatch(Display.java:3115)
at org.eclipse.ui.internal.Workbench.runEventLoop(Workbench.java:2405)
at org.eclipse.ui.internal.Workbench.runUI(Workbench.java:2369)
at org.eclipse.ui.internal.Workbench.access$4(Workbench.java:2221)
at org.eclipse.ui.internal.Workbench$5.run(Workbench.java:500)
at org.eclipse.core.databinding.observable.Realm.runWithDefault(Realm.java:332)
at org.eclipse.ui.internal.Workbench.createAndRunWorkbench(Workbench.java:493)
at org.eclipse.ui.PlatformUI.createAndRunWorkbench(PlatformUI.java:149)
at org.eclipse.ui.internal.ide.application.IDEApplication.start(IDEApplication.java:113)
at org.eclipse.test.UITestApplication.runApplication(UITestApplication.java:138)
at org.eclipse.test.UITestApplication.run(UITestApplication.java:60)
at org.eclipse.test.UITestApplication.start(UITestApplication.java:210)
at org.eclipse.equinox.internal.app.EclipseAppHandle.run(EclipseAppHandle.java:194)
at
org.eclipse.core.runtime.internal.adaptor.EclipseAppLauncher.runApplication(EclipseAppLauncher.java:110)
at
org.eclipse.core.runtime.internal.adaptor.EclipseAppLauncher.start(EclipseAppLauncher.java:79)
at org.eclipse.core.runtime.adaptor.EclipseStarter.run(EclipseStarter.java:368)
at org.eclipse.core.runtime.adaptor.EclipseStarter.run(EclipseStarter.java:179)
at org.eclipse.equinox.launcher.Main.invokeFramework(Main.java:559)
at org.eclipse.equinox.launcher.Main.basicRun(Main.java:514)
at org.eclipse.equinox.launcher.Main.run(Main.java:1311)
at org.eclipse.equinox.launcher.Main.main(Main.java:1287)
at org.eclipse.core.launcher.Main.main(Main.java:34)
FAILED: ASTestSuite
Error Message:
null
Stack Trace:
junit.framework.AssertionFailedError
at
org.jboss.ide.eclipse.as.test.server.StartupShutdownTest.createServer(StartupShutdownTest.java:109)
at org.jboss.ide.eclipse.as.test.publishing.JBIDE4184Test.setUp(JBIDE4184Test.java:30)
at org.eclipse.test.EclipseTestRunner.run(EclipseTestRunner.java:354)
at org.eclipse.test.EclipseTestRunner.run(EclipseTestRunner.java:206)
at org.eclipse.test.UITestApplication$3.run(UITestApplication.java:195)
at org.eclipse.swt.widgets.RunnableLock.run(RunnableLock.java:35)
at org.eclipse.swt.widgets.Synchronizer.runAsyncMessages(Synchronizer.java:134)
at org.eclipse.swt.widgets.Display.runAsyncMessages(Display.java:3468)
at org.eclipse.swt.widgets.Display.readAndDispatch(Display.java:3115)
at org.eclipse.ui.internal.Workbench.runEventLoop(Workbench.java:2405)
at org.eclipse.ui.internal.Workbench.runUI(Workbench.java:2369)
at org.eclipse.ui.internal.Workbench.access$4(Workbench.java:2221)
at org.eclipse.ui.internal.Workbench$5.run(Workbench.java:500)
at org.eclipse.core.databinding.observable.Realm.runWithDefault(Realm.java:332)
at org.eclipse.ui.internal.Workbench.createAndRunWorkbench(Workbench.java:493)
at org.eclipse.ui.PlatformUI.createAndRunWorkbench(PlatformUI.java:149)
at org.eclipse.ui.internal.ide.application.IDEApplication.start(IDEApplication.java:113)
at org.eclipse.test.UITestApplication.runApplication(UITestApplication.java:138)
at org.eclipse.test.UITestApplication.run(UITestApplication.java:60)
at org.eclipse.test.UITestApplication.start(UITestApplication.java:210)
at org.eclipse.equinox.internal.app.EclipseAppHandle.run(EclipseAppHandle.java:194)
at
org.eclipse.core.runtime.internal.adaptor.EclipseAppLauncher.runApplication(EclipseAppLauncher.java:110)
at
org.eclipse.core.runtime.internal.adaptor.EclipseAppLauncher.start(EclipseAppLauncher.java:79)
at org.eclipse.core.runtime.adaptor.EclipseStarter.run(EclipseStarter.java:368)
at org.eclipse.core.runtime.adaptor.EclipseStarter.run(EclipseStarter.java:179)
at org.eclipse.equinox.launcher.Main.invokeFramework(Main.java:559)
at org.eclipse.equinox.launcher.Main.basicRun(Main.java:514)
at org.eclipse.equinox.launcher.Main.run(Main.java:1311)
at org.eclipse.equinox.launcher.Main.main(Main.java:1287)
at org.eclipse.core.launcher.Main.main(Main.java:34)
FAILED: JMXCoreAllTests
Error Message:
Failed to retrieve RMIServer stub: javax.naming.ServiceUnavailableException [Root
exception is java.rmi.ConnectException: Connection refused to host: localhost; nested
exception is: java.net.ConnectException: Connection refused]
Stack Trace:
java.io.IOException: Failed to retrieve RMIServer stub:
javax.naming.ServiceUnavailableException [Root exception is java.rmi.ConnectException:
Connection refused to host: localhost; nested exception is:
java.net.ConnectException: Connection refused]
at javax.management.remote.rmi.RMIConnector.connect(RMIConnector.java:317)
at javax.management.remote.JMXConnectorFactory.connect(JMXConnectorFactory.java:248)
at
org.jboss.tools.jmx.core.providers.DefaultConnectionWrapper.connect(DefaultConnectionWrapper.java:80)
at
org.jboss.tools.jmx.core.tests.DefaultProviderTest.testConnection(DefaultProviderTest.java:116)
at org.eclipse.test.EclipseTestRunner.run(EclipseTestRunner.java:354)
at org.eclipse.test.EclipseTestRunner.run(EclipseTestRunner.java:206)
at org.eclipse.test.UITestApplication$3.run(UITestApplication.java:195)
at org.eclipse.swt.widgets.RunnableLock.run(RunnableLock.java:35)
at org.eclipse.swt.widgets.Synchronizer.runAsyncMessages(Synchronizer.java:134)
at org.eclipse.swt.widgets.Display.runAsyncMessages(Display.java:3468)
at org.eclipse.swt.widgets.Display.readAndDispatch(Display.java:3115)
at org.eclipse.ui.internal.Workbench.runEventLoop(Workbench.java:2405)
at org.eclipse.ui.internal.Workbench.runUI(Workbench.java:2369)
at org.eclipse.ui.internal.Workbench.access$4(Workbench.java:2221)
at org.eclipse.ui.internal.Workbench$5.run(Workbench.java:500)
at org.eclipse.core.databinding.observable.Realm.runWithDefault(Realm.java:332)
at org.eclipse.ui.internal.Workbench.createAndRunWorkbench(Workbench.java:493)
at org.eclipse.ui.PlatformUI.createAndRunWorkbench(PlatformUI.java:149)
at org.eclipse.ui.internal.ide.application.IDEApplication.start(IDEApplication.java:113)
at org.eclipse.test.UITestApplication.runApplication(UITestApplication.java:138)
at org.eclipse.test.UITestApplication.run(UITestApplication.java:60)
at org.eclipse.test.UITestApplication.start(UITestApplication.java:210)
at org.eclipse.equinox.internal.app.EclipseAppHandle.run(EclipseAppHandle.java:194)
at
org.eclipse.core.runtime.internal.adaptor.EclipseAppLauncher.runApplication(EclipseAppLauncher.java:110)
at
org.eclipse.core.runtime.internal.adaptor.EclipseAppLauncher.start(EclipseAppLauncher.java:79)
at org.eclipse.core.runtime.adaptor.EclipseStarter.run(EclipseStarter.java:368)
at org.eclipse.core.runtime.adaptor.EclipseStarter.run(EclipseStarter.java:179)
at org.eclipse.equinox.launcher.Main.invokeFramework(Main.java:559)
at org.eclipse.equinox.launcher.Main.basicRun(Main.java:514)
at org.eclipse.equinox.launcher.Main.run(Main.java:1311)
at org.eclipse.equinox.launcher.Main.main(Main.java:1287)
at org.eclipse.core.launcher.Main.main(Main.java:34)
Caused by: javax.naming.ServiceUnavailableException [Root exception is
java.rmi.ConnectException: Connection refused to host: localhost; nested exception is:
java.net.ConnectException: Connection refused]
at com.sun.jndi.rmi.registry.RegistryContext.lookup(RegistryContext.java:97)
at com.sun.jndi.toolkit.url.GenericURLContext.lookup(GenericURLContext.java:185)
at javax.naming.InitialContext.lookup(InitialContext.java:351)
at javax.management.remote.rmi.RMIConnector.findRMIServerJNDI(RMIConnector.java:1817)
at javax.management.remote.rmi.RMIConnector.findRMIServer(RMIConnector.java:1787)
at javax.management.remote.rmi.RMIConnector.connect(RMIConnector.java:259)
Caused by: java.rmi.ConnectException: Connection refused to host: localhost; nested
exception is:
java.net.ConnectException: Connection refused
at sun.rmi.transport.tcp.TCPEndpoint.newSocket(TCPEndpoint.java:574)
at sun.rmi.transport.tcp.TCPChannel.createConnection(TCPChannel.java:185)
at sun.rmi.transport.tcp.TCPChannel.newConnection(TCPChannel.java:171)
at sun.rmi.server.UnicastRef.newCall(UnicastRef.java:306)
at sun.rmi.registry.RegistryImpl_Stub.lookup(Unknown Source)
at com.sun.jndi.rmi.registry.RegistryContext.lookup(RegistryContext.java:93)
Caused by: java.net.ConnectException: Connection refused
at java.net.PlainSocketImpl.socketConnect(Native Method)
at java.net.PlainSocketImpl.doConnect(PlainSocketImpl.java:333)
at java.net.PlainSocketImpl.connectToAddress(PlainSocketImpl.java:195)
at java.net.PlainSocketImpl.connect(PlainSocketImpl.java:182)
at java.net.SocksSocketImpl.connect(SocksSocketImpl.java:366)
at java.net.Socket.connect(Socket.java:520)
at java.net.Socket.connect(Socket.java:470)
at java.net.Socket.<init>(Socket.java:367)
at java.net.Socket.<init>(Socket.java:180)
at
sun.rmi.transport.proxy.RMIDirectSocketFactory.createSocket(RMIDirectSocketFactory.java:22)
at
sun.rmi.transport.proxy.RMIMasterSocketFactory.createSocket(RMIMasterSocketFactory.java:128)
at sun.rmi.transport.tcp.TCPEndpoint.newSocket(TCPEndpoint.java:569)
FAILED: Seam12XFacetTestSuite121EAP
Error Message:
/home/hudson/hudson_workspace/workspace/jbosstools-nightly-3.1.0.M2/jbds-build/3.1.0.M2/200907061943/tests/jboss/jboss-eap-4.3/seam
does not exist
Stack Trace:
junit.framework.AssertionFailedError:
/home/hudson/hudson_workspace/workspace/jbosstools-nightly-3.1.0.M2/jbds-build/3.1.0.M2/200907061943/tests/jboss/jboss-eap-4.3/seam
does not exist
at
org.jboss.tools.seam.core.test.project.facet.AbstractSeamFacetTest.assertSeamHomeAvailable(AbstractSeamFacetTest.java:263)
at
org.jboss.tools.seam.core.test.project.facet.AbstractSeamFacetTest.setUp(AbstractSeamFacetTest.java:83)
at junit.extensions.TestDecorator.basicRun(TestDecorator.java:24)
at junit.extensions.TestSetup$1.protect(TestSetup.java:21)
at junit.extensions.TestSetup.run(TestSetup.java:25)
at org.eclipse.test.EclipseTestRunner.run(EclipseTestRunner.java:354)
at org.eclipse.test.EclipseTestRunner.run(EclipseTestRunner.java:206)
at org.eclipse.test.UITestApplication$3.run(UITestApplication.java:195)
at org.eclipse.swt.widgets.RunnableLock.run(RunnableLock.java:35)
at org.eclipse.swt.widgets.Synchronizer.runAsyncMessages(Synchronizer.java:134)
at org.eclipse.swt.widgets.Display.runAsyncMessages(Display.java:3468)
at org.eclipse.swt.widgets.Display.readAndDispatch(Display.java:3115)
at org.eclipse.ui.internal.Workbench.runEventLoop(Workbench.java:2405)
at org.eclipse.ui.internal.Workbench.runUI(Workbench.java:2369)
at org.eclipse.ui.internal.Workbench.access$4(Workbench.java:2221)
at org.eclipse.ui.internal.Workbench$5.run(Workbench.java:500)
at org.eclipse.core.databinding.observable.Realm.runWithDefault(Realm.java:332)
at org.eclipse.ui.internal.Workbench.createAndRunWorkbench(Workbench.java:493)
at org.eclipse.ui.PlatformUI.createAndRunWorkbench(PlatformUI.java:149)
at org.eclipse.ui.internal.ide.application.IDEApplication.start(IDEApplication.java:113)
at org.eclipse.test.UITestApplication.runApplication(UITestApplication.java:138)
at org.eclipse.test.UITestApplication.run(UITestApplication.java:60)
at org.eclipse.test.UITestApplication.start(UITestApplication.java:210)
at org.eclipse.equinox.internal.app.EclipseAppHandle.run(EclipseAppHandle.java:194)
at
org.eclipse.core.runtime.internal.adaptor.EclipseAppLauncher.runApplication(EclipseAppLauncher.java:110)
at
org.eclipse.core.runtime.internal.adaptor.EclipseAppLauncher.start(EclipseAppLauncher.java:79)
at org.eclipse.core.runtime.adaptor.EclipseStarter.run(EclipseStarter.java:368)
at org.eclipse.core.runtime.adaptor.EclipseStarter.run(EclipseStarter.java:179)
at org.eclipse.equinox.launcher.Main.invokeFramework(Main.java:559)
at org.eclipse.equinox.launcher.Main.basicRun(Main.java:514)
at org.eclipse.equinox.launcher.Main.run(Main.java:1311)
at org.eclipse.equinox.launcher.Main.main(Main.java:1287)
at org.eclipse.core.launcher.Main.main(Main.java:34)
FAILED: Seam12XFacetTestSuite121EAP
Error Message:
/home/hudson/hudson_workspace/workspace/jbosstools-nightly-3.1.0.M2/jbds-build/3.1.0.M2/200907061943/tests/jboss/jboss-eap-4.3/seam
does not exist
Stack Trace:
junit.framework.AssertionFailedError:
/home/hudson/hudson_workspace/workspace/jbosstools-nightly-3.1.0.M2/jbds-build/3.1.0.M2/200907061943/tests/jboss/jboss-eap-4.3/seam
does not exist
at
org.jboss.tools.seam.core.test.project.facet.AbstractSeamFacetTest.assertSeamHomeAvailable(AbstractSeamFacetTest.java:263)
at
org.jboss.tools.seam.core.test.project.facet.AbstractSeamFacetTest.setUp(AbstractSeamFacetTest.java:83)
at junit.extensions.TestDecorator.basicRun(TestDecorator.java:24)
at junit.extensions.TestSetup$1.protect(TestSetup.java:21)
at junit.extensions.TestSetup.run(TestSetup.java:25)
at org.eclipse.test.EclipseTestRunner.run(EclipseTestRunner.java:354)
at org.eclipse.test.EclipseTestRunner.run(EclipseTestRunner.java:206)
at org.eclipse.test.UITestApplication$3.run(UITestApplication.java:195)
at org.eclipse.swt.widgets.RunnableLock.run(RunnableLock.java:35)
at org.eclipse.swt.widgets.Synchronizer.runAsyncMessages(Synchronizer.java:134)
at org.eclipse.swt.widgets.Display.runAsyncMessages(Display.java:3468)
at org.eclipse.swt.widgets.Display.readAndDispatch(Display.java:3115)
at org.eclipse.ui.internal.Workbench.runEventLoop(Workbench.java:2405)
at org.eclipse.ui.internal.Workbench.runUI(Workbench.java:2369)
at org.eclipse.ui.internal.Workbench.access$4(Workbench.java:2221)
at org.eclipse.ui.internal.Workbench$5.run(Workbench.java:500)
at org.eclipse.core.databinding.observable.Realm.runWithDefault(Realm.java:332)
at org.eclipse.ui.internal.Workbench.createAndRunWorkbench(Workbench.java:493)
at org.eclipse.ui.PlatformUI.createAndRunWorkbench(PlatformUI.java:149)
at org.eclipse.ui.internal.ide.application.IDEApplication.start(IDEApplication.java:113)
at org.eclipse.test.UITestApplication.runApplication(UITestApplication.java:138)
at org.eclipse.test.UITestApplication.run(UITestApplication.java:60)
at org.eclipse.test.UITestApplication.start(UITestApplication.java:210)
at org.eclipse.equinox.internal.app.EclipseAppHandle.run(EclipseAppHandle.java:194)
at
org.eclipse.core.runtime.internal.adaptor.EclipseAppLauncher.runApplication(EclipseAppLauncher.java:110)
at
org.eclipse.core.runtime.internal.adaptor.EclipseAppLauncher.start(EclipseAppLauncher.java:79)
at org.eclipse.core.runtime.adaptor.EclipseStarter.run(EclipseStarter.java:368)
at org.eclipse.core.runtime.adaptor.EclipseStarter.run(EclipseStarter.java:179)
at org.eclipse.equinox.launcher.Main.invokeFramework(Main.java:559)
at org.eclipse.equinox.launcher.Main.basicRun(Main.java:514)
at org.eclipse.equinox.launcher.Main.run(Main.java:1311)
at org.eclipse.equinox.launcher.Main.main(Main.java:1287)
at org.eclipse.core.launcher.Main.main(Main.java:34)
FAILED: Seam12XFacetTestSuite121EAP
Error Message:
/home/hudson/hudson_workspace/workspace/jbosstools-nightly-3.1.0.M2/jbds-build/3.1.0.M2/200907061943/tests/jboss/jboss-eap-4.3/seam
does not exist
Stack Trace:
junit.framework.AssertionFailedError:
/home/hudson/hudson_workspace/workspace/jbosstools-nightly-3.1.0.M2/jbds-build/3.1.0.M2/200907061943/tests/jboss/jboss-eap-4.3/seam
does not exist
at
org.jboss.tools.seam.core.test.project.facet.AbstractSeamFacetTest.assertSeamHomeAvailable(AbstractSeamFacetTest.java:263)
at
org.jboss.tools.seam.core.test.project.facet.AbstractSeamFacetTest.setUp(AbstractSeamFacetTest.java:83)
at junit.extensions.TestDecorator.basicRun(TestDecorator.java:24)
at junit.extensions.TestSetup$1.protect(TestSetup.java:21)
at junit.extensions.TestSetup.run(TestSetup.java:25)
at org.eclipse.test.EclipseTestRunner.run(EclipseTestRunner.java:354)
at org.eclipse.test.EclipseTestRunner.run(EclipseTestRunner.java:206)
at org.eclipse.test.UITestApplication$3.run(UITestApplication.java:195)
at org.eclipse.swt.widgets.RunnableLock.run(RunnableLock.java:35)
at org.eclipse.swt.widgets.Synchronizer.runAsyncMessages(Synchronizer.java:134)
at org.eclipse.swt.widgets.Display.runAsyncMessages(Display.java:3468)
at org.eclipse.swt.widgets.Display.readAndDispatch(Display.java:3115)
at org.eclipse.ui.internal.Workbench.runEventLoop(Workbench.java:2405)
at org.eclipse.ui.internal.Workbench.runUI(Workbench.java:2369)
at org.eclipse.ui.internal.Workbench.access$4(Workbench.java:2221)
at org.eclipse.ui.internal.Workbench$5.run(Workbench.java:500)
at org.eclipse.core.databinding.observable.Realm.runWithDefault(Realm.java:332)
at org.eclipse.ui.internal.Workbench.createAndRunWorkbench(Workbench.java:493)
at org.eclipse.ui.PlatformUI.createAndRunWorkbench(PlatformUI.java:149)
at org.eclipse.ui.internal.ide.application.IDEApplication.start(IDEApplication.java:113)
at org.eclipse.test.UITestApplication.runApplication(UITestApplication.java:138)
at org.eclipse.test.UITestApplication.run(UITestApplication.java:60)
at org.eclipse.test.UITestApplication.start(UITestApplication.java:210)
at org.eclipse.equinox.internal.app.EclipseAppHandle.run(EclipseAppHandle.java:194)
at
org.eclipse.core.runtime.internal.adaptor.EclipseAppLauncher.runApplication(EclipseAppLauncher.java:110)
at
org.eclipse.core.runtime.internal.adaptor.EclipseAppLauncher.start(EclipseAppLauncher.java:79)
at org.eclipse.core.runtime.adaptor.EclipseStarter.run(EclipseStarter.java:368)
at org.eclipse.core.runtime.adaptor.EclipseStarter.run(EclipseStarter.java:179)
at org.eclipse.equinox.launcher.Main.invokeFramework(Main.java:559)
at org.eclipse.equinox.launcher.Main.basicRun(Main.java:514)
at org.eclipse.equinox.launcher.Main.run(Main.java:1311)
at org.eclipse.equinox.launcher.Main.main(Main.java:1287)
at org.eclipse.core.launcher.Main.main(Main.java:34)
FAILED: Seam12XFacetTestSuite121EAP
Error Message:
/home/hudson/hudson_workspace/workspace/jbosstools-nightly-3.1.0.M2/jbds-build/3.1.0.M2/200907061943/tests/jboss/jboss-eap-4.3/seam
does not exist
Stack Trace:
junit.framework.AssertionFailedError:
/home/hudson/hudson_workspace/workspace/jbosstools-nightly-3.1.0.M2/jbds-build/3.1.0.M2/200907061943/tests/jboss/jboss-eap-4.3/seam
does not exist
at
org.jboss.tools.seam.core.test.project.facet.AbstractSeamFacetTest.assertSeamHomeAvailable(AbstractSeamFacetTest.java:263)
at
org.jboss.tools.seam.core.test.project.facet.AbstractSeamFacetTest.setUp(AbstractSeamFacetTest.java:83)
at junit.extensions.TestDecorator.basicRun(TestDecorator.java:24)
at junit.extensions.TestSetup$1.protect(TestSetup.java:21)
at junit.extensions.TestSetup.run(TestSetup.java:25)
at org.eclipse.test.EclipseTestRunner.run(EclipseTestRunner.java:354)
at org.eclipse.test.EclipseTestRunner.run(EclipseTestRunner.java:206)
at org.eclipse.test.UITestApplication$3.run(UITestApplication.java:195)
at org.eclipse.swt.widgets.RunnableLock.run(RunnableLock.java:35)
at org.eclipse.swt.widgets.Synchronizer.runAsyncMessages(Synchronizer.java:134)
at org.eclipse.swt.widgets.Display.runAsyncMessages(Display.java:3468)
at org.eclipse.swt.widgets.Display.readAndDispatch(Display.java:3115)
at org.eclipse.ui.internal.Workbench.runEventLoop(Workbench.java:2405)
at org.eclipse.ui.internal.Workbench.runUI(Workbench.java:2369)
at org.eclipse.ui.internal.Workbench.access$4(Workbench.java:2221)
at org.eclipse.ui.internal.Workbench$5.run(Workbench.java:500)
at org.eclipse.core.databinding.observable.Realm.runWithDefault(Realm.java:332)
at org.eclipse.ui.internal.Workbench.createAndRunWorkbench(Workbench.java:493)
at org.eclipse.ui.PlatformUI.createAndRunWorkbench(PlatformUI.java:149)
at org.eclipse.ui.internal.ide.application.IDEApplication.start(IDEApplication.java:113)
at org.eclipse.test.UITestApplication.runApplication(UITestApplication.java:138)
at org.eclipse.test.UITestApplication.run(UITestApplication.java:60)
at org.eclipse.test.UITestApplication.start(UITestApplication.java:210)
at org.eclipse.equinox.internal.app.EclipseAppHandle.run(EclipseAppHandle.java:194)
at
org.eclipse.core.runtime.internal.adaptor.EclipseAppLauncher.runApplication(EclipseAppLauncher.java:110)
at
org.eclipse.core.runtime.internal.adaptor.EclipseAppLauncher.start(EclipseAppLauncher.java:79)
at org.eclipse.core.runtime.adaptor.EclipseStarter.run(EclipseStarter.java:368)
at org.eclipse.core.runtime.adaptor.EclipseStarter.run(EclipseStarter.java:179)
at org.eclipse.equinox.launcher.Main.invokeFramework(Main.java:559)
at org.eclipse.equinox.launcher.Main.basicRun(Main.java:514)
at org.eclipse.equinox.launcher.Main.run(Main.java:1311)
at org.eclipse.equinox.launcher.Main.main(Main.java:1287)
at org.eclipse.core.launcher.Main.main(Main.java:34)
FAILED: Seam20XFacetTestSuiteFP
Error Message:
/home/hudson/hudson_workspace/workspace/jbosstools-nightly-3.1.0.M2/jbds-build/3.1.0.M2/200907061943/tests/jboss/jboss-eap-4.3/seamfp
does not exist
Stack Trace:
junit.framework.AssertionFailedError:
/home/hudson/hudson_workspace/workspace/jbosstools-nightly-3.1.0.M2/jbds-build/3.1.0.M2/200907061943/tests/jboss/jboss-eap-4.3/seamfp
does not exist
at
org.jboss.tools.seam.core.test.project.facet.AbstractSeamFacetTest.assertSeamHomeAvailable(AbstractSeamFacetTest.java:263)
at
org.jboss.tools.seam.core.test.project.facet.Seam2FacetInstallDelegateTest.setUp(Seam2FacetInstallDelegateTest.java:67)
at
org.jboss.tools.seam.core.test.project.facet.Seam20XFacetTestSuite201GA$Seam2FacetInstallDelegateTestSetup.setUp(Seam20XFacetTestSuite201GA.java:36)
at junit.extensions.TestSetup$1.protect(TestSetup.java:20)
at junit.extensions.TestSetup.run(TestSetup.java:25)
at org.eclipse.test.EclipseTestRunner.run(EclipseTestRunner.java:354)
at org.eclipse.test.EclipseTestRunner.run(EclipseTestRunner.java:206)
at org.eclipse.test.UITestApplication$3.run(UITestApplication.java:195)
at org.eclipse.swt.widgets.RunnableLock.run(RunnableLock.java:35)
at org.eclipse.swt.widgets.Synchronizer.runAsyncMessages(Synchronizer.java:134)
at org.eclipse.swt.widgets.Display.runAsyncMessages(Display.java:3468)
at org.eclipse.swt.widgets.Display.readAndDispatch(Display.java:3115)
at org.eclipse.ui.internal.Workbench.runEventLoop(Workbench.java:2405)
at org.eclipse.ui.internal.Workbench.runUI(Workbench.java:2369)
at org.eclipse.ui.internal.Workbench.access$4(Workbench.java:2221)
at org.eclipse.ui.internal.Workbench$5.run(Workbench.java:500)
at org.eclipse.core.databinding.observable.Realm.runWithDefault(Realm.java:332)
at org.eclipse.ui.internal.Workbench.createAndRunWorkbench(Workbench.java:493)
at org.eclipse.ui.PlatformUI.createAndRunWorkbench(PlatformUI.java:149)
at org.eclipse.ui.internal.ide.application.IDEApplication.start(IDEApplication.java:113)
at org.eclipse.test.UITestApplication.runApplication(UITestApplication.java:138)
at org.eclipse.test.UITestApplication.run(UITestApplication.java:60)
at org.eclipse.test.UITestApplication.start(UITestApplication.java:210)
at org.eclipse.equinox.internal.app.EclipseAppHandle.run(EclipseAppHandle.java:194)
at
org.eclipse.core.runtime.internal.adaptor.EclipseAppLauncher.runApplication(EclipseAppLauncher.java:110)
at
org.eclipse.core.runtime.internal.adaptor.EclipseAppLauncher.start(EclipseAppLauncher.java:79)
at org.eclipse.core.runtime.adaptor.EclipseStarter.run(EclipseStarter.java:368)
at org.eclipse.core.runtime.adaptor.EclipseStarter.run(EclipseStarter.java:179)
at org.eclipse.equinox.launcher.Main.invokeFramework(Main.java:559)
at org.eclipse.equinox.launcher.Main.basicRun(Main.java:514)
at org.eclipse.equinox.launcher.Main.run(Main.java:1311)
at org.eclipse.equinox.launcher.Main.main(Main.java:1287)
at org.eclipse.core.launcher.Main.main(Main.java:34)
FAILED: SeamUiAllTests
Error Message:
Component org.jboss.seam.captcha.captcha not found
Stack Trace:
junit.framework.AssertionFailedError: Component org.jboss.seam.captcha.captcha not found
at
org.jboss.tools.seam.ui.test.wizard.OpenSeamComponentDialogTest.find(OpenSeamComponentDialogTest.java:99)
at
org.jboss.tools.seam.ui.test.wizard.OpenSeamComponentDialogTest.testOpenSeamComponentDialogSearch(OpenSeamComponentDialogTest.java:71)
at org.eclipse.test.EclipseTestRunner.run(EclipseTestRunner.java:354)
at org.eclipse.test.EclipseTestRunner.run(EclipseTestRunner.java:206)
at org.eclipse.test.UITestApplication$3.run(UITestApplication.java:195)
at org.eclipse.swt.widgets.RunnableLock.run(RunnableLock.java:35)
at org.eclipse.swt.widgets.Synchronizer.runAsyncMessages(Synchronizer.java:134)
at org.eclipse.swt.widgets.Display.runAsyncMessages(Display.java:3468)
at org.eclipse.swt.widgets.Display.readAndDispatch(Display.java:3115)
at org.eclipse.ui.internal.Workbench.runEventLoop(Workbench.java:2405)
at org.eclipse.ui.internal.Workbench.runUI(Workbench.java:2369)
at org.eclipse.ui.internal.Workbench.access$4(Workbench.java:2221)
at org.eclipse.ui.internal.Workbench$5.run(Workbench.java:500)
at org.eclipse.core.databinding.observable.Realm.runWithDefault(Realm.java:332)
at org.eclipse.ui.internal.Workbench.createAndRunWorkbench(Workbench.java:493)
at org.eclipse.ui.PlatformUI.createAndRunWorkbench(PlatformUI.java:149)
at org.eclipse.ui.internal.ide.application.IDEApplication.start(IDEApplication.java:113)
at org.eclipse.test.UITestApplication.runApplication(UITestApplication.java:138)
at org.eclipse.test.UITestApplication.run(UITestApplication.java:60)
at org.eclipse.test.UITestApplication.start(UITestApplication.java:210)
at org.eclipse.equinox.internal.app.EclipseAppHandle.run(EclipseAppHandle.java:194)
at
org.eclipse.core.runtime.internal.adaptor.EclipseAppLauncher.runApplication(EclipseAppLauncher.java:110)
at
org.eclipse.core.runtime.internal.adaptor.EclipseAppLauncher.start(EclipseAppLauncher.java:79)
at org.eclipse.core.runtime.adaptor.EclipseStarter.run(EclipseStarter.java:368)
at org.eclipse.core.runtime.adaptor.EclipseStarter.run(EclipseStarter.java:179)
at org.eclipse.equinox.launcher.Main.invokeFramework(Main.java:559)
at org.eclipse.equinox.launcher.Main.basicRun(Main.java:514)
at org.eclipse.equinox.launcher.Main.run(Main.java:1311)
at org.eclipse.equinox.launcher.Main.main(Main.java:1287)
at org.eclipse.core.launcher.Main.main(Main.java:34)
FAILED: SeamUiAllTests
Error Message:
Finish button is disabled at first wizard page in spite of created JBoss AS Runtime,
Server, DB Connection and Seam Runtime and valid project name.
Stack Trace:
junit.framework.AssertionFailedError: Finish button is disabled at first wizard page in
spite of created JBoss AS Runtime, Server, DB Connection and Seam Runtime and valid
project name.
at
org.jboss.tools.seam.ui.test.wizard.SeamProjectNewWizardTest.testJiraJbide1111(SeamProjectNewWizardTest.java:103)
at junit.extensions.TestDecorator.basicRun(TestDecorator.java:24)
at junit.extensions.TestSetup$1.protect(TestSetup.java:21)
at junit.extensions.TestSetup.run(TestSetup.java:25)
at org.eclipse.test.EclipseTestRunner.run(EclipseTestRunner.java:354)
at org.eclipse.test.EclipseTestRunner.run(EclipseTestRunner.java:206)
at org.eclipse.test.UITestApplication$3.run(UITestApplication.java:195)
at org.eclipse.swt.widgets.RunnableLock.run(RunnableLock.java:35)
at org.eclipse.swt.widgets.Synchronizer.runAsyncMessages(Synchronizer.java:134)
at org.eclipse.swt.widgets.Display.runAsyncMessages(Display.java:3468)
at org.eclipse.swt.widgets.Display.readAndDispatch(Display.java:3115)
at org.eclipse.ui.internal.Workbench.runEventLoop(Workbench.java:2405)
at org.eclipse.ui.internal.Workbench.runUI(Workbench.java:2369)
at org.eclipse.ui.internal.Workbench.access$4(Workbench.java:2221)
at org.eclipse.ui.internal.Workbench$5.run(Workbench.java:500)
at org.eclipse.core.databinding.observable.Realm.runWithDefault(Realm.java:332)
at org.eclipse.ui.internal.Workbench.createAndRunWorkbench(Workbench.java:493)
at org.eclipse.ui.PlatformUI.createAndRunWorkbench(PlatformUI.java:149)
at org.eclipse.ui.internal.ide.application.IDEApplication.start(IDEApplication.java:113)
at org.eclipse.test.UITestApplication.runApplication(UITestApplication.java:138)
at org.eclipse.test.UITestApplication.run(UITestApplication.java:60)
at org.eclipse.test.UITestApplication.start(UITestApplication.java:210)
at org.eclipse.equinox.internal.app.EclipseAppHandle.run(EclipseAppHandle.java:194)
at
org.eclipse.core.runtime.internal.adaptor.EclipseAppLauncher.runApplication(EclipseAppLauncher.java:110)
at
org.eclipse.core.runtime.internal.adaptor.EclipseAppLauncher.start(EclipseAppLauncher.java:79)
at org.eclipse.core.runtime.adaptor.EclipseStarter.run(EclipseStarter.java:368)
at org.eclipse.core.runtime.adaptor.EclipseStarter.run(EclipseStarter.java:179)
at org.eclipse.equinox.launcher.Main.invokeFramework(Main.java:559)
at org.eclipse.equinox.launcher.Main.basicRun(Main.java:514)
at org.eclipse.equinox.launcher.Main.run(Main.java:1311)
at org.eclipse.equinox.launcher.Main.main(Main.java:1287)
at org.eclipse.core.launcher.Main.main(Main.java:34)
FAILED: SeamUiAllTests
Error Message:
Some Seam EL proposals were shown in the Content Assistant but they shouldn't
Stack Trace:
junit.framework.AssertionFailedError: Some Seam EL proposals were shown in the Content
Assistant but they shouldn't
at
org.jboss.tools.seam.ui.test.ca.SeamELContentAssistTestCase.testSeamELContentAssist(SeamELContentAssistTestCase.java:528)
at junit.extensions.TestDecorator.basicRun(TestDecorator.java:24)
at junit.extensions.TestSetup$1.protect(TestSetup.java:21)
at junit.extensions.TestSetup.run(TestSetup.java:25)
at org.eclipse.test.EclipseTestRunner.run(EclipseTestRunner.java:354)
at org.eclipse.test.EclipseTestRunner.run(EclipseTestRunner.java:206)
at org.eclipse.test.UITestApplication$3.run(UITestApplication.java:195)
at org.eclipse.swt.widgets.RunnableLock.run(RunnableLock.java:35)
at org.eclipse.swt.widgets.Synchronizer.runAsyncMessages(Synchronizer.java:134)
at org.eclipse.swt.widgets.Display.runAsyncMessages(Display.java:3468)
at org.eclipse.swt.widgets.Display.readAndDispatch(Display.java:3115)
at org.eclipse.ui.internal.Workbench.runEventLoop(Workbench.java:2405)
at org.eclipse.ui.internal.Workbench.runUI(Workbench.java:2369)
at org.eclipse.ui.internal.Workbench.access$4(Workbench.java:2221)
at org.eclipse.ui.internal.Workbench$5.run(Workbench.java:500)
at org.eclipse.core.databinding.observable.Realm.runWithDefault(Realm.java:332)
at org.eclipse.ui.internal.Workbench.createAndRunWorkbench(Workbench.java:493)
at org.eclipse.ui.PlatformUI.createAndRunWorkbench(PlatformUI.java:149)
at org.eclipse.ui.internal.ide.application.IDEApplication.start(IDEApplication.java:113)
at org.eclipse.test.UITestApplication.runApplication(UITestApplication.java:138)
at org.eclipse.test.UITestApplication.run(UITestApplication.java:60)
at org.eclipse.test.UITestApplication.start(UITestApplication.java:210)
at org.eclipse.equinox.internal.app.EclipseAppHandle.run(EclipseAppHandle.java:194)
at
org.eclipse.core.runtime.internal.adaptor.EclipseAppLauncher.runApplication(EclipseAppLauncher.java:110)
at
org.eclipse.core.runtime.internal.adaptor.EclipseAppLauncher.start(EclipseAppLauncher.java:79)
at org.eclipse.core.runtime.adaptor.EclipseStarter.run(EclipseStarter.java:368)
at org.eclipse.core.runtime.adaptor.EclipseStarter.run(EclipseStarter.java:179)
at org.eclipse.equinox.launcher.Main.invokeFramework(Main.java:559)
at org.eclipse.equinox.launcher.Main.basicRun(Main.java:514)
at org.eclipse.equinox.launcher.Main.run(Main.java:1311)
at org.eclipse.equinox.launcher.Main.main(Main.java:1287)
at org.eclipse.core.launcher.Main.main(Main.java:34)
FAILED: SeamUiAllTests
Error Message:
Settings page is not valid: Seam Runtime 'Seam 1.2.0 Seam Settings Page Test' home
directory doesn't exist for selected Seam Web Project
Stack Trace:
junit.framework.AssertionFailedError: Settings page is not valid: Seam Runtime 'Seam
1.2.0 Seam Settings Page Test' home directory doesn't exist for selected Seam Web
Project
at
org.jboss.tools.seam.ui.test.preferences.SeamSettingsPreferencesPageTest.testSettingsPage(SeamSettingsPreferencesPageTest.java:104)
at junit.extensions.TestDecorator.basicRun(TestDecorator.java:24)
at junit.extensions.TestSetup$1.protect(TestSetup.java:21)
at junit.extensions.TestSetup.run(TestSetup.java:25)
at org.eclipse.test.EclipseTestRunner.run(EclipseTestRunner.java:354)
at org.eclipse.test.EclipseTestRunner.run(EclipseTestRunner.java:206)
at org.eclipse.test.UITestApplication$3.run(UITestApplication.java:195)
at org.eclipse.swt.widgets.RunnableLock.run(RunnableLock.java:35)
at org.eclipse.swt.widgets.Synchronizer.runAsyncMessages(Synchronizer.java:134)
at org.eclipse.swt.widgets.Display.runAsyncMessages(Display.java:3468)
at org.eclipse.swt.widgets.Display.readAndDispatch(Display.java:3115)
at org.eclipse.ui.internal.Workbench.runEventLoop(Workbench.java:2405)
at org.eclipse.ui.internal.Workbench.runUI(Workbench.java:2369)
at org.eclipse.ui.internal.Workbench.access$4(Workbench.java:2221)
at org.eclipse.ui.internal.Workbench$5.run(Workbench.java:500)
at org.eclipse.core.databinding.observable.Realm.runWithDefault(Realm.java:332)
at org.eclipse.ui.internal.Workbench.createAndRunWorkbench(Workbench.java:493)
at org.eclipse.ui.PlatformUI.createAndRunWorkbench(PlatformUI.java:149)
at org.eclipse.ui.internal.ide.application.IDEApplication.start(IDEApplication.java:113)
at org.eclipse.test.UITestApplication.runApplication(UITestApplication.java:138)
at org.eclipse.test.UITestApplication.run(UITestApplication.java:60)
at org.eclipse.test.UITestApplication.start(UITestApplication.java:210)
at org.eclipse.equinox.internal.app.EclipseAppHandle.run(EclipseAppHandle.java:194)
at
org.eclipse.core.runtime.internal.adaptor.EclipseAppLauncher.runApplication(EclipseAppLauncher.java:110)
at
org.eclipse.core.runtime.internal.adaptor.EclipseAppLauncher.start(EclipseAppLauncher.java:79)
at org.eclipse.core.runtime.adaptor.EclipseStarter.run(EclipseStarter.java:368)
at org.eclipse.core.runtime.adaptor.EclipseStarter.run(EclipseStarter.java:179)
at org.eclipse.equinox.launcher.Main.invokeFramework(Main.java:559)
at org.eclipse.equinox.launcher.Main.basicRun(Main.java:514)
at org.eclipse.equinox.launcher.Main.run(Main.java:1311)
at org.eclipse.equinox.launcher.Main.main(Main.java:1287)
at org.eclipse.core.launcher.Main.main(Main.java:34)
FAILED: Seam12XOperationsTestSuite121EAP
Error Message:
Failed while installing Seam 1.2.
Stack Trace:
org.eclipse.wst.common.project.facet.core.FacetedProjectFrameworkException: Failed while
installing Seam 1.2.
at
org.eclipse.wst.common.project.facet.core.internal.FacetedProject.callDelegate(FacetedProject.java:1497)
at
org.eclipse.wst.common.project.facet.core.internal.FacetedProject.modifyInternal(FacetedProject.java:438)
at
org.eclipse.wst.common.project.facet.core.internal.FacetedProject.mergeChangesInternal(FacetedProject.java:1171)
at
org.eclipse.wst.common.project.facet.core.internal.FacetedProject.access$2(FacetedProject.java:1107)
at
org.eclipse.wst.common.project.facet.core.internal.FacetedProject$1.run(FacetedProject.java:321)
at org.eclipse.core.internal.resources.Workspace.run(Workspace.java:1800)
at
org.eclipse.wst.common.project.facet.core.internal.FacetedProject.modify(FacetedProject.java:336)
at
org.eclipse.wst.common.project.facet.core.internal.FacetedProject.installProjectFacet(FacetedProject.java:252)
at
org.jboss.tools.seam.core.test.project.facet.AbstractSeamFacetTest.createSeamProject(AbstractSeamFacetTest.java:181)
at
org.jboss.tools.seam.core.test.project.facet.AbstractSeamFacetTest.createSeamEarProject(AbstractSeamFacetTest.java:233)
at
org.jboss.tools.seam.ui.test.wizard.Seam12EARNewOperationTest.setUp(Seam12EARNewOperationTest.java:62)
at
org.jboss.tools.seam.ui.test.wizard.Seam12XOperationsTestSuite121EAP$Seam12EARNewOperationTestSetup.setUp(Seam12XOperationsTestSuite121EAP.java:45)
at junit.extensions.TestSetup$1.protect(TestSetup.java:20)
at junit.extensions.TestSetup.run(TestSetup.java:25)
at org.eclipse.test.EclipseTestRunner.run(EclipseTestRunner.java:354)
at org.eclipse.test.EclipseTestRunner.run(EclipseTestRunner.java:206)
at org.eclipse.test.UITestApplication$3.run(UITestApplication.java:195)
at org.eclipse.swt.widgets.RunnableLock.run(RunnableLock.java:35)
at org.eclipse.swt.widgets.Synchronizer.runAsyncMessages(Synchronizer.java:134)
at org.eclipse.swt.widgets.Display.runAsyncMessages(Display.java:3468)
at org.eclipse.swt.widgets.Display.readAndDispatch(Display.java:3115)
at org.eclipse.ui.internal.Workbench.runEventLoop(Workbench.java:2405)
at org.eclipse.ui.internal.Workbench.runUI(Workbench.java:2369)
at org.eclipse.ui.internal.Workbench.access$4(Workbench.java:2221)
at org.eclipse.ui.internal.Workbench$5.run(Workbench.java:500)
at org.eclipse.core.databinding.observable.Realm.runWithDefault(Realm.java:332)
at org.eclipse.ui.internal.Workbench.createAndRunWorkbench(Workbench.java:493)
at org.eclipse.ui.PlatformUI.createAndRunWorkbench(PlatformUI.java:149)
at org.eclipse.ui.internal.ide.application.IDEApplication.start(IDEApplication.java:113)
at org.eclipse.test.UITestApplication.runApplication(UITestApplication.java:138)
at org.eclipse.test.UITestApplication.run(UITestApplication.java:60)
at org.eclipse.test.UITestApplication.start(UITestApplication.java:210)
at org.eclipse.equinox.internal.app.EclipseAppHandle.run(EclipseAppHandle.java:194)
at
org.eclipse.core.runtime.internal.adaptor.EclipseAppLauncher.runApplication(EclipseAppLauncher.java:110)
at
org.eclipse.core.runtime.internal.adaptor.EclipseAppLauncher.start(EclipseAppLauncher.java:79)
at org.eclipse.core.runtime.adaptor.EclipseStarter.run(EclipseStarter.java:368)
at org.eclipse.core.runtime.adaptor.EclipseStarter.run(EclipseStarter.java:179)
at org.eclipse.equinox.launcher.Main.invokeFramework(Main.java:559)
at org.eclipse.equinox.launcher.Main.basicRun(Main.java:514)
at org.eclipse.equinox.launcher.Main.run(Main.java:1311)
at org.eclipse.equinox.launcher.Main.main(Main.java:1287)
at org.eclipse.core.launcher.Main.main(Main.java:34)
Caused by: java.lang.IllegalArgumentException: Copy failed -
'/home/hudson/hudson_workspace/workspace/jbosstools-nightly-3.1.0.M2/jbds-build/3.1.0.M2/200907061943/tests/jboss/jboss-eap-4.3/seam/seam-gen/view'
does not exist
at
org.jboss.tools.seam.internal.core.project.facet.AntCopyUtils.copyFilesAndFolders(AntCopyUtils.java:142)
at
org.jboss.tools.seam.internal.core.project.facet.SeamFacetAbstractInstallDelegate.copyFilesToWarProject(SeamFacetAbstractInstallDelegate.java:382)
at
org.jboss.tools.seam.internal.core.project.facet.SeamFacetInstallDelegate.copyFilesToWarProject(SeamFacetInstallDelegate.java:127)
at
org.jboss.tools.seam.internal.core.project.facet.SeamFacetAbstractInstallDelegate.doExecuteForWar(SeamFacetAbstractInstallDelegate.java:338)
at
org.jboss.tools.seam.internal.core.project.facet.SeamFacetAbstractInstallDelegate.doExecute(SeamFacetAbstractInstallDelegate.java:785)
at
org.jboss.tools.seam.internal.core.project.facet.SeamFacetAbstractInstallDelegate.execute(SeamFacetAbstractInstallDelegate.java:184)
at
org.eclipse.wst.common.project.facet.core.internal.FacetedProject.callDelegate(FacetedProject.java:1467)
FAILED: Seam12XOperationsTestSuite121EAP
Error Message:
Failed while installing Seam 1.2.
Stack Trace:
org.eclipse.wst.common.project.facet.core.FacetedProjectFrameworkException: Failed while
installing Seam 1.2.
at
org.eclipse.wst.common.project.facet.core.internal.FacetedProject.callDelegate(FacetedProject.java:1497)
at
org.eclipse.wst.common.project.facet.core.internal.FacetedProject.modifyInternal(FacetedProject.java:438)
at
org.eclipse.wst.common.project.facet.core.internal.FacetedProject.mergeChangesInternal(FacetedProject.java:1171)
at
org.eclipse.wst.common.project.facet.core.internal.FacetedProject.access$2(FacetedProject.java:1107)
at
org.eclipse.wst.common.project.facet.core.internal.FacetedProject$1.run(FacetedProject.java:321)
at org.eclipse.core.internal.resources.Workspace.run(Workspace.java:1800)
at
org.eclipse.wst.common.project.facet.core.internal.FacetedProject.modify(FacetedProject.java:336)
at
org.eclipse.wst.common.project.facet.core.internal.FacetedProject.installProjectFacet(FacetedProject.java:252)
at
org.jboss.tools.seam.core.test.project.facet.AbstractSeamFacetTest.createSeamProject(AbstractSeamFacetTest.java:181)
at
org.jboss.tools.seam.core.test.project.facet.AbstractSeamFacetTest.createSeamWarProject(AbstractSeamFacetTest.java:217)
at
org.jboss.tools.seam.ui.test.wizard.Seam12WARNewOperationTest.setUp(Seam12WARNewOperationTest.java:57)
at
org.jboss.tools.seam.ui.test.wizard.Seam12XOperationsTestSuite121EAP$Seam12WARNewOperationTestSetup.setUp(Seam12XOperationsTestSuite121EAP.java:65)
at junit.extensions.TestSetup$1.protect(TestSetup.java:20)
at junit.extensions.TestSetup.run(TestSetup.java:25)
at org.eclipse.test.EclipseTestRunner.run(EclipseTestRunner.java:354)
at org.eclipse.test.EclipseTestRunner.run(EclipseTestRunner.java:206)
at org.eclipse.test.UITestApplication$3.run(UITestApplication.java:195)
at org.eclipse.swt.widgets.RunnableLock.run(RunnableLock.java:35)
at org.eclipse.swt.widgets.Synchronizer.runAsyncMessages(Synchronizer.java:134)
at org.eclipse.swt.widgets.Display.runAsyncMessages(Display.java:3468)
at org.eclipse.swt.widgets.Display.readAndDispatch(Display.java:3115)
at org.eclipse.ui.internal.Workbench.runEventLoop(Workbench.java:2405)
at org.eclipse.ui.internal.Workbench.runUI(Workbench.java:2369)
at org.eclipse.ui.internal.Workbench.access$4(Workbench.java:2221)
at org.eclipse.ui.internal.Workbench$5.run(Workbench.java:500)
at org.eclipse.core.databinding.observable.Realm.runWithDefault(Realm.java:332)
at org.eclipse.ui.internal.Workbench.createAndRunWorkbench(Workbench.java:493)
at org.eclipse.ui.PlatformUI.createAndRunWorkbench(PlatformUI.java:149)
at org.eclipse.ui.internal.ide.application.IDEApplication.start(IDEApplication.java:113)
at org.eclipse.test.UITestApplication.runApplication(UITestApplication.java:138)
at org.eclipse.test.UITestApplication.run(UITestApplication.java:60)
at org.eclipse.test.UITestApplication.start(UITestApplication.java:210)
at org.eclipse.equinox.internal.app.EclipseAppHandle.run(EclipseAppHandle.java:194)
at
org.eclipse.core.runtime.internal.adaptor.EclipseAppLauncher.runApplication(EclipseAppLauncher.java:110)
at
org.eclipse.core.runtime.internal.adaptor.EclipseAppLauncher.start(EclipseAppLauncher.java:79)
at org.eclipse.core.runtime.adaptor.EclipseStarter.run(EclipseStarter.java:368)
at org.eclipse.core.runtime.adaptor.EclipseStarter.run(EclipseStarter.java:179)
at org.eclipse.equinox.launcher.Main.invokeFramework(Main.java:559)
at org.eclipse.equinox.launcher.Main.basicRun(Main.java:514)
at org.eclipse.equinox.launcher.Main.run(Main.java:1311)
at org.eclipse.equinox.launcher.Main.main(Main.java:1287)
at org.eclipse.core.launcher.Main.main(Main.java:34)
Caused by: java.lang.IllegalArgumentException: Copy failed -
'/home/hudson/hudson_workspace/workspace/jbosstools-nightly-3.1.0.M2/jbds-build/3.1.0.M2/200907061943/tests/jboss/jboss-eap-4.3/seam/seam-gen/view'
does not exist
at
org.jboss.tools.seam.internal.core.project.facet.AntCopyUtils.copyFilesAndFolders(AntCopyUtils.java:142)
at
org.jboss.tools.seam.internal.core.project.facet.SeamFacetAbstractInstallDelegate.copyFilesToWarProject(SeamFacetAbstractInstallDelegate.java:382)
at
org.jboss.tools.seam.internal.core.project.facet.SeamFacetInstallDelegate.copyFilesToWarProject(SeamFacetInstallDelegate.java:127)
at
org.jboss.tools.seam.internal.core.project.facet.SeamFacetAbstractInstallDelegate.doExecuteForWar(SeamFacetAbstractInstallDelegate.java:338)
at
org.jboss.tools.seam.internal.core.project.facet.SeamFacetAbstractInstallDelegate.doExecute(SeamFacetAbstractInstallDelegate.java:785)
at
org.jboss.tools.seam.internal.core.project.facet.SeamFacetAbstractInstallDelegate.execute(SeamFacetAbstractInstallDelegate.java:184)
at
org.eclipse.wst.common.project.facet.core.internal.FacetedProject.callDelegate(FacetedProject.java:1467)
FAILED: Seam20XOperationsTestSuiteFP
Error Message:
/home/hudson/hudson_workspace/workspace/jbosstools-nightly-3.1.0.M2/jbds-build/3.1.0.M2/200907061943/tests/jboss/jboss-eap-4.3/seamfp
does not exist
Stack Trace:
junit.framework.AssertionFailedError:
/home/hudson/hudson_workspace/workspace/jbosstools-nightly-3.1.0.M2/jbds-build/3.1.0.M2/200907061943/tests/jboss/jboss-eap-4.3/seamfp
does not exist
at
org.jboss.tools.seam.core.test.project.facet.AbstractSeamFacetTest.assertSeamHomeAvailable(AbstractSeamFacetTest.java:263)
at
org.jboss.tools.seam.ui.test.wizard.Seam20EARNewOperationTest.setUp(Seam20EARNewOperationTest.java:35)
at
org.jboss.tools.seam.ui.test.wizard.Seam20XOperationsTestSuite201GA$Seam20EARNewOperationTestSetup.setUp(Seam20XOperationsTestSuite201GA.java:47)
at junit.extensions.TestSetup$1.protect(TestSetup.java:20)
at junit.extensions.TestSetup.run(TestSetup.java:25)
at org.eclipse.test.EclipseTestRunner.run(EclipseTestRunner.java:354)
at org.eclipse.test.EclipseTestRunner.run(EclipseTestRunner.java:206)
at org.eclipse.test.UITestApplication$3.run(UITestApplication.java:195)
at org.eclipse.swt.widgets.RunnableLock.run(RunnableLock.java:35)
at org.eclipse.swt.widgets.Synchronizer.runAsyncMessages(Synchronizer.java:134)
at org.eclipse.swt.widgets.Display.runAsyncMessages(Display.java:3468)
at org.eclipse.swt.widgets.Display.readAndDispatch(Display.java:3115)
at org.eclipse.ui.internal.Workbench.runEventLoop(Workbench.java:2405)
at org.eclipse.ui.internal.Workbench.runUI(Workbench.java:2369)
at org.eclipse.ui.internal.Workbench.access$4(Workbench.java:2221)
at org.eclipse.ui.internal.Workbench$5.run(Workbench.java:500)
at org.eclipse.core.databinding.observable.Realm.runWithDefault(Realm.java:332)
at org.eclipse.ui.internal.Workbench.createAndRunWorkbench(Workbench.java:493)
at org.eclipse.ui.PlatformUI.createAndRunWorkbench(PlatformUI.java:149)
at org.eclipse.ui.internal.ide.application.IDEApplication.start(IDEApplication.java:113)
at org.eclipse.test.UITestApplication.runApplication(UITestApplication.java:138)
at org.eclipse.test.UITestApplication.run(UITestApplication.java:60)
at org.eclipse.test.UITestApplication.start(UITestApplication.java:210)
at org.eclipse.equinox.internal.app.EclipseAppHandle.run(EclipseAppHandle.java:194)
at
org.eclipse.core.runtime.internal.adaptor.EclipseAppLauncher.runApplication(EclipseAppLauncher.java:110)
at
org.eclipse.core.runtime.internal.adaptor.EclipseAppLauncher.start(EclipseAppLauncher.java:79)
at org.eclipse.core.runtime.adaptor.EclipseStarter.run(EclipseStarter.java:368)
at org.eclipse.core.runtime.adaptor.EclipseStarter.run(EclipseStarter.java:179)
at org.eclipse.equinox.launcher.Main.invokeFramework(Main.java:559)
at org.eclipse.equinox.launcher.Main.basicRun(Main.java:514)
at org.eclipse.equinox.launcher.Main.run(Main.java:1311)
at org.eclipse.equinox.launcher.Main.main(Main.java:1287)
at org.eclipse.core.launcher.Main.main(Main.java:34)
FAILED: Seam20XOperationsTestSuiteFP
Error Message:
/home/hudson/hudson_workspace/workspace/jbosstools-nightly-3.1.0.M2/jbds-build/3.1.0.M2/200907061943/tests/jboss/jboss-eap-4.3/seamfp
does not exist
Stack Trace:
junit.framework.AssertionFailedError:
/home/hudson/hudson_workspace/workspace/jbosstools-nightly-3.1.0.M2/jbds-build/3.1.0.M2/200907061943/tests/jboss/jboss-eap-4.3/seamfp
does not exist
at
org.jboss.tools.seam.core.test.project.facet.AbstractSeamFacetTest.assertSeamHomeAvailable(AbstractSeamFacetTest.java:263)
at
org.jboss.tools.seam.ui.test.wizard.Seam20WARNewOperationTest.setUp(Seam20WARNewOperationTest.java:40)
at
org.jboss.tools.seam.ui.test.wizard.Seam20XOperationsTestSuite201GA$Seam20WARNewOperationTestSetup.setUp(Seam20XOperationsTestSuite201GA.java:67)
at junit.extensions.TestSetup$1.protect(TestSetup.java:20)
at junit.extensions.TestSetup.run(TestSetup.java:25)
at org.eclipse.test.EclipseTestRunner.run(EclipseTestRunner.java:354)
at org.eclipse.test.EclipseTestRunner.run(EclipseTestRunner.java:206)
at org.eclipse.test.UITestApplication$3.run(UITestApplication.java:195)
at org.eclipse.swt.widgets.RunnableLock.run(RunnableLock.java:35)
at org.eclipse.swt.widgets.Synchronizer.runAsyncMessages(Synchronizer.java:134)
at org.eclipse.swt.widgets.Display.runAsyncMessages(Display.java:3468)
at org.eclipse.swt.widgets.Display.readAndDispatch(Display.java:3115)
at org.eclipse.ui.internal.Workbench.runEventLoop(Workbench.java:2405)
at org.eclipse.ui.internal.Workbench.runUI(Workbench.java:2369)
at org.eclipse.ui.internal.Workbench.access$4(Workbench.java:2221)
at org.eclipse.ui.internal.Workbench$5.run(Workbench.java:500)
at org.eclipse.core.databinding.observable.Realm.runWithDefault(Realm.java:332)
at org.eclipse.ui.internal.Workbench.createAndRunWorkbench(Workbench.java:493)
at org.eclipse.ui.PlatformUI.createAndRunWorkbench(PlatformUI.java:149)
at org.eclipse.ui.internal.ide.application.IDEApplication.start(IDEApplication.java:113)
at org.eclipse.test.UITestApplication.runApplication(UITestApplication.java:138)
at org.eclipse.test.UITestApplication.run(UITestApplication.java:60)
at org.eclipse.test.UITestApplication.start(UITestApplication.java:210)
at org.eclipse.equinox.internal.app.EclipseAppHandle.run(EclipseAppHandle.java:194)
at
org.eclipse.core.runtime.internal.adaptor.EclipseAppLauncher.runApplication(EclipseAppLauncher.java:110)
at
org.eclipse.core.runtime.internal.adaptor.EclipseAppLauncher.start(EclipseAppLauncher.java:79)
at org.eclipse.core.runtime.adaptor.EclipseStarter.run(EclipseStarter.java:368)
at org.eclipse.core.runtime.adaptor.EclipseStarter.run(EclipseStarter.java:179)
at org.eclipse.equinox.launcher.Main.invokeFramework(Main.java:559)
at org.eclipse.equinox.launcher.Main.basicRun(Main.java:514)
at org.eclipse.equinox.launcher.Main.run(Main.java:1311)
at org.eclipse.equinox.launcher.Main.main(Main.java:1287)
at org.eclipse.core.launcher.Main.main(Main.java:34)
FAILED: JBossWSCoreAllTests
Error Message:
null
Stack Trace:
junit.framework.AssertionFailedError
at
org.jboss.tools.ws.core.test.command.AbstractJBossWSCommandTest.createServer(AbstractJBossWSCommandTest.java:174)
at
org.jboss.tools.ws.core.test.command.AbstractJBossWSCommandTest.setUp(AbstractJBossWSCommandTest.java:117)
at
org.jboss.tools.ws.core.test.command.JBossWSJavaFirstCommandTest.setUp(JBossWSJavaFirstCommandTest.java:80)
at org.eclipse.test.EclipseTestRunner.run(EclipseTestRunner.java:354)
at org.eclipse.test.EclipseTestRunner.run(EclipseTestRunner.java:206)
at org.eclipse.test.UITestApplication$3.run(UITestApplication.java:195)
at org.eclipse.swt.widgets.RunnableLock.run(RunnableLock.java:35)
at org.eclipse.swt.widgets.Synchronizer.runAsyncMessages(Synchronizer.java:134)
at org.eclipse.swt.widgets.Display.runAsyncMessages(Display.java:3468)
at org.eclipse.swt.widgets.Display.readAndDispatch(Display.java:3115)
at org.eclipse.ui.internal.Workbench.runEventLoop(Workbench.java:2405)
at org.eclipse.ui.internal.Workbench.runUI(Workbench.java:2369)
at org.eclipse.ui.internal.Workbench.access$4(Workbench.java:2221)
at org.eclipse.ui.internal.Workbench$5.run(Workbench.java:500)
at org.eclipse.core.databinding.observable.Realm.runWithDefault(Realm.java:332)
at org.eclipse.ui.internal.Workbench.createAndRunWorkbench(Workbench.java:493)
at org.eclipse.ui.PlatformUI.createAndRunWorkbench(PlatformUI.java:149)
at org.eclipse.ui.internal.ide.application.IDEApplication.start(IDEApplication.java:113)
at org.eclipse.test.UITestApplication.runApplication(UITestApplication.java:138)
at org.eclipse.test.UITestApplication.run(UITestApplication.java:60)
at org.eclipse.test.UITestApplication.start(UITestApplication.java:210)
at org.eclipse.equinox.internal.app.EclipseAppHandle.run(EclipseAppHandle.java:194)
at
org.eclipse.core.runtime.internal.adaptor.EclipseAppLauncher.runApplication(EclipseAppLauncher.java:110)
at
org.eclipse.core.runtime.internal.adaptor.EclipseAppLauncher.start(EclipseAppLauncher.java:79)
at org.eclipse.core.runtime.adaptor.EclipseStarter.run(EclipseStarter.java:368)
at org.eclipse.core.runtime.adaptor.EclipseStarter.run(EclipseStarter.java:179)
at org.eclipse.equinox.launcher.Main.invokeFramework(Main.java:559)
at org.eclipse.equinox.launcher.Main.basicRun(Main.java:514)
at org.eclipse.equinox.launcher.Main.run(Main.java:1311)
at org.eclipse.equinox.launcher.Main.main(Main.java:1287)
at org.eclipse.core.launcher.Main.main(Main.java:34)
FAILED: JBossWSCoreAllTests
Error Message:
null
Stack Trace:
junit.framework.AssertionFailedError
at
org.jboss.tools.ws.core.test.command.AbstractJBossWSCommandTest.createServer(AbstractJBossWSCommandTest.java:174)
at
org.jboss.tools.ws.core.test.command.AbstractJBossWSCommandTest.setUp(AbstractJBossWSCommandTest.java:117)
at
org.jboss.tools.ws.core.test.command.JBossWSJavaFirstCommandTest.setUp(JBossWSJavaFirstCommandTest.java:80)
at org.eclipse.test.EclipseTestRunner.run(EclipseTestRunner.java:354)
at org.eclipse.test.EclipseTestRunner.run(EclipseTestRunner.java:206)
at org.eclipse.test.UITestApplication$3.run(UITestApplication.java:195)
at org.eclipse.swt.widgets.RunnableLock.run(RunnableLock.java:35)
at org.eclipse.swt.widgets.Synchronizer.runAsyncMessages(Synchronizer.java:134)
at org.eclipse.swt.widgets.Display.runAsyncMessages(Display.java:3468)
at org.eclipse.swt.widgets.Display.readAndDispatch(Display.java:3115)
at org.eclipse.ui.internal.Workbench.runEventLoop(Workbench.java:2405)
at org.eclipse.ui.internal.Workbench.runUI(Workbench.java:2369)
at org.eclipse.ui.internal.Workbench.access$4(Workbench.java:2221)
at org.eclipse.ui.internal.Workbench$5.run(Workbench.java:500)
at org.eclipse.core.databinding.observable.Realm.runWithDefault(Realm.java:332)
at org.eclipse.ui.internal.Workbench.createAndRunWorkbench(Workbench.java:493)
at org.eclipse.ui.PlatformUI.createAndRunWorkbench(PlatformUI.java:149)
at org.eclipse.ui.internal.ide.application.IDEApplication.start(IDEApplication.java:113)
at org.eclipse.test.UITestApplication.runApplication(UITestApplication.java:138)
at org.eclipse.test.UITestApplication.run(UITestApplication.java:60)
at org.eclipse.test.UITestApplication.start(UITestApplication.java:210)
at org.eclipse.equinox.internal.app.EclipseAppHandle.run(EclipseAppHandle.java:194)
at
org.eclipse.core.runtime.internal.adaptor.EclipseAppLauncher.runApplication(EclipseAppLauncher.java:110)
at
org.eclipse.core.runtime.internal.adaptor.EclipseAppLauncher.start(EclipseAppLauncher.java:79)
at org.eclipse.core.runtime.adaptor.EclipseStarter.run(EclipseStarter.java:368)
at org.eclipse.core.runtime.adaptor.EclipseStarter.run(EclipseStarter.java:179)
at org.eclipse.equinox.launcher.Main.invokeFramework(Main.java:559)
at org.eclipse.equinox.launcher.Main.basicRun(Main.java:514)
at org.eclipse.equinox.launcher.Main.run(Main.java:1311)
at org.eclipse.equinox.launcher.Main.main(Main.java:1287)
at org.eclipse.core.launcher.Main.main(Main.java:34)
FAILED: JBossWSCoreAllTests
Error Message:
null
Stack Trace:
junit.framework.AssertionFailedError
at
org.jboss.tools.ws.core.test.command.AbstractJBossWSCommandTest.createServer(AbstractJBossWSCommandTest.java:174)
at
org.jboss.tools.ws.core.test.command.AbstractJBossWSCommandTest.setUp(AbstractJBossWSCommandTest.java:117)
at
org.jboss.tools.ws.core.test.command.JBossWSJavaFirstCommandTest.setUp(JBossWSJavaFirstCommandTest.java:80)
at org.eclipse.test.EclipseTestRunner.run(EclipseTestRunner.java:354)
at org.eclipse.test.EclipseTestRunner.run(EclipseTestRunner.java:206)
at org.eclipse.test.UITestApplication$3.run(UITestApplication.java:195)
at org.eclipse.swt.widgets.RunnableLock.run(RunnableLock.java:35)
at org.eclipse.swt.widgets.Synchronizer.runAsyncMessages(Synchronizer.java:134)
at org.eclipse.swt.widgets.Display.runAsyncMessages(Display.java:3468)
at org.eclipse.swt.widgets.Display.readAndDispatch(Display.java:3115)
at org.eclipse.ui.internal.Workbench.runEventLoop(Workbench.java:2405)
at org.eclipse.ui.internal.Workbench.runUI(Workbench.java:2369)
at org.eclipse.ui.internal.Workbench.access$4(Workbench.java:2221)
at org.eclipse.ui.internal.Workbench$5.run(Workbench.java:500)
at org.eclipse.core.databinding.observable.Realm.runWithDefault(Realm.java:332)
at org.eclipse.ui.internal.Workbench.createAndRunWorkbench(Workbench.java:493)
at org.eclipse.ui.PlatformUI.createAndRunWorkbench(PlatformUI.java:149)
at org.eclipse.ui.internal.ide.application.IDEApplication.start(IDEApplication.java:113)
at org.eclipse.test.UITestApplication.runApplication(UITestApplication.java:138)
at org.eclipse.test.UITestApplication.run(UITestApplication.java:60)
at org.eclipse.test.UITestApplication.start(UITestApplication.java:210)
at org.eclipse.equinox.internal.app.EclipseAppHandle.run(EclipseAppHandle.java:194)
at
org.eclipse.core.runtime.internal.adaptor.EclipseAppLauncher.runApplication(EclipseAppLauncher.java:110)
at
org.eclipse.core.runtime.internal.adaptor.EclipseAppLauncher.start(EclipseAppLauncher.java:79)
at org.eclipse.core.runtime.adaptor.EclipseStarter.run(EclipseStarter.java:368)
at org.eclipse.core.runtime.adaptor.EclipseStarter.run(EclipseStarter.java:179)
at org.eclipse.equinox.launcher.Main.invokeFramework(Main.java:559)
at org.eclipse.equinox.launcher.Main.basicRun(Main.java:514)
at org.eclipse.equinox.launcher.Main.run(Main.java:1311)
at org.eclipse.equinox.launcher.Main.main(Main.java:1287)
at org.eclipse.core.launcher.Main.main(Main.java:34)
FAILED: JBossWSCoreAllTests
Error Message:
null
Stack Trace:
junit.framework.AssertionFailedError
at
org.jboss.tools.ws.core.test.command.AbstractJBossWSCommandTest.createServer(AbstractJBossWSCommandTest.java:174)
at
org.jboss.tools.ws.core.test.command.AbstractJBossWSCommandTest.setUp(AbstractJBossWSCommandTest.java:117)
at
org.jboss.tools.ws.core.test.command.JBossWSJavaFirstCommandTest.setUp(JBossWSJavaFirstCommandTest.java:80)
at org.eclipse.test.EclipseTestRunner.run(EclipseTestRunner.java:354)
at org.eclipse.test.EclipseTestRunner.run(EclipseTestRunner.java:206)
at org.eclipse.test.UITestApplication$3.run(UITestApplication.java:195)
at org.eclipse.swt.widgets.RunnableLock.run(RunnableLock.java:35)
at org.eclipse.swt.widgets.Synchronizer.runAsyncMessages(Synchronizer.java:134)
at org.eclipse.swt.widgets.Display.runAsyncMessages(Display.java:3468)
at org.eclipse.swt.widgets.Display.readAndDispatch(Display.java:3115)
at org.eclipse.ui.internal.Workbench.runEventLoop(Workbench.java:2405)
at org.eclipse.ui.internal.Workbench.runUI(Workbench.java:2369)
at org.eclipse.ui.internal.Workbench.access$4(Workbench.java:2221)
at org.eclipse.ui.internal.Workbench$5.run(Workbench.java:500)
at org.eclipse.core.databinding.observable.Realm.runWithDefault(Realm.java:332)
at org.eclipse.ui.internal.Workbench.createAndRunWorkbench(Workbench.java:493)
at org.eclipse.ui.PlatformUI.createAndRunWorkbench(PlatformUI.java:149)
at org.eclipse.ui.internal.ide.application.IDEApplication.start(IDEApplication.java:113)
at org.eclipse.test.UITestApplication.runApplication(UITestApplication.java:138)
at org.eclipse.test.UITestApplication.run(UITestApplication.java:60)
at org.eclipse.test.UITestApplication.start(UITestApplication.java:210)
at org.eclipse.equinox.internal.app.EclipseAppHandle.run(EclipseAppHandle.java:194)
at
org.eclipse.core.runtime.internal.adaptor.EclipseAppLauncher.runApplication(EclipseAppLauncher.java:110)
at
org.eclipse.core.runtime.internal.adaptor.EclipseAppLauncher.start(EclipseAppLauncher.java:79)
at org.eclipse.core.runtime.adaptor.EclipseStarter.run(EclipseStarter.java:368)
at org.eclipse.core.runtime.adaptor.EclipseStarter.run(EclipseStarter.java:179)
at org.eclipse.equinox.launcher.Main.invokeFramework(Main.java:559)
at org.eclipse.equinox.launcher.Main.basicRun(Main.java:514)
at org.eclipse.equinox.launcher.Main.run(Main.java:1311)
at org.eclipse.equinox.launcher.Main.main(Main.java:1287)
at org.eclipse.core.launcher.Main.main(Main.java:34)
FAILED: JBossWSCoreAllTests
Error Message:
null
Stack Trace:
junit.framework.AssertionFailedError
at
org.jboss.tools.ws.core.test.command.AbstractJBossWSCommandTest.createServer(AbstractJBossWSCommandTest.java:174)
at
org.jboss.tools.ws.core.test.command.AbstractJBossWSCommandTest.setUp(AbstractJBossWSCommandTest.java:117)
at
org.jboss.tools.ws.core.test.command.JBossWSClientCommandTest.setUp(JBossWSClientCommandTest.java:63)
at org.eclipse.test.EclipseTestRunner.run(EclipseTestRunner.java:354)
at org.eclipse.test.EclipseTestRunner.run(EclipseTestRunner.java:206)
at org.eclipse.test.UITestApplication$3.run(UITestApplication.java:195)
at org.eclipse.swt.widgets.RunnableLock.run(RunnableLock.java:35)
at org.eclipse.swt.widgets.Synchronizer.runAsyncMessages(Synchronizer.java:134)
at org.eclipse.swt.widgets.Display.runAsyncMessages(Display.java:3468)
at org.eclipse.swt.widgets.Display.readAndDispatch(Display.java:3115)
at org.eclipse.ui.internal.Workbench.runEventLoop(Workbench.java:2405)
at org.eclipse.ui.internal.Workbench.runUI(Workbench.java:2369)
at org.eclipse.ui.internal.Workbench.access$4(Workbench.java:2221)
at org.eclipse.ui.internal.Workbench$5.run(Workbench.java:500)
at org.eclipse.core.databinding.observable.Realm.runWithDefault(Realm.java:332)
at org.eclipse.ui.internal.Workbench.createAndRunWorkbench(Workbench.java:493)
at org.eclipse.ui.PlatformUI.createAndRunWorkbench(PlatformUI.java:149)
at org.eclipse.ui.internal.ide.application.IDEApplication.start(IDEApplication.java:113)
at org.eclipse.test.UITestApplication.runApplication(UITestApplication.java:138)
at org.eclipse.test.UITestApplication.run(UITestApplication.java:60)
at org.eclipse.test.UITestApplication.start(UITestApplication.java:210)
at org.eclipse.equinox.internal.app.EclipseAppHandle.run(EclipseAppHandle.java:194)
at
org.eclipse.core.runtime.internal.adaptor.EclipseAppLauncher.runApplication(EclipseAppLauncher.java:110)
at
org.eclipse.core.runtime.internal.adaptor.EclipseAppLauncher.start(EclipseAppLauncher.java:79)
at org.eclipse.core.runtime.adaptor.EclipseStarter.run(EclipseStarter.java:368)
at org.eclipse.core.runtime.adaptor.EclipseStarter.run(EclipseStarter.java:179)
at org.eclipse.equinox.launcher.Main.invokeFramework(Main.java:559)
at org.eclipse.equinox.launcher.Main.basicRun(Main.java:514)
at org.eclipse.equinox.launcher.Main.run(Main.java:1311)
at org.eclipse.equinox.launcher.Main.main(Main.java:1287)
at org.eclipse.core.launcher.Main.main(Main.java:34)
FAILED: JBossWSCoreAllTests
Error Message:
null
Stack Trace:
junit.framework.AssertionFailedError
at
org.jboss.tools.ws.core.test.command.AbstractJBossWSCommandTest.createServer(AbstractJBossWSCommandTest.java:174)
at
org.jboss.tools.ws.core.test.command.AbstractJBossWSCommandTest.setUp(AbstractJBossWSCommandTest.java:117)
at
org.jboss.tools.ws.core.test.command.JBossWSClientCommandTest.setUp(JBossWSClientCommandTest.java:63)
at org.eclipse.test.EclipseTestRunner.run(EclipseTestRunner.java:354)
at org.eclipse.test.EclipseTestRunner.run(EclipseTestRunner.java:206)
at org.eclipse.test.UITestApplication$3.run(UITestApplication.java:195)
at org.eclipse.swt.widgets.RunnableLock.run(RunnableLock.java:35)
at org.eclipse.swt.widgets.Synchronizer.runAsyncMessages(Synchronizer.java:134)
at org.eclipse.swt.widgets.Display.runAsyncMessages(Display.java:3468)
at org.eclipse.swt.widgets.Display.readAndDispatch(Display.java:3115)
at org.eclipse.ui.internal.Workbench.runEventLoop(Workbench.java:2405)
at org.eclipse.ui.internal.Workbench.runUI(Workbench.java:2369)
at org.eclipse.ui.internal.Workbench.access$4(Workbench.java:2221)
at org.eclipse.ui.internal.Workbench$5.run(Workbench.java:500)
at org.eclipse.core.databinding.observable.Realm.runWithDefault(Realm.java:332)
at org.eclipse.ui.internal.Workbench.createAndRunWorkbench(Workbench.java:493)
at org.eclipse.ui.PlatformUI.createAndRunWorkbench(PlatformUI.java:149)
at org.eclipse.ui.internal.ide.application.IDEApplication.start(IDEApplication.java:113)
at org.eclipse.test.UITestApplication.runApplication(UITestApplication.java:138)
at org.eclipse.test.UITestApplication.run(UITestApplication.java:60)
at org.eclipse.test.UITestApplication.start(UITestApplication.java:210)
at org.eclipse.equinox.internal.app.EclipseAppHandle.run(EclipseAppHandle.java:194)
at
org.eclipse.core.runtime.internal.adaptor.EclipseAppLauncher.runApplication(EclipseAppLauncher.java:110)
at
org.eclipse.core.runtime.internal.adaptor.EclipseAppLauncher.start(EclipseAppLauncher.java:79)
at org.eclipse.core.runtime.adaptor.EclipseStarter.run(EclipseStarter.java:368)
at org.eclipse.core.runtime.adaptor.EclipseStarter.run(EclipseStarter.java:179)
at org.eclipse.equinox.launcher.Main.invokeFramework(Main.java:559)
at org.eclipse.equinox.launcher.Main.basicRun(Main.java:514)
at org.eclipse.equinox.launcher.Main.run(Main.java:1311)
at org.eclipse.equinox.launcher.Main.main(Main.java:1287)
at org.eclipse.core.launcher.Main.main(Main.java:34)
FAILED: JBossWSCoreAllTests
Error Message:
null
Stack Trace:
junit.framework.AssertionFailedError
at
org.jboss.tools.ws.core.test.command.AbstractJBossWSCommandTest.createServer(AbstractJBossWSCommandTest.java:174)
at
org.jboss.tools.ws.core.test.command.AbstractJBossWSCommandTest.setUp(AbstractJBossWSCommandTest.java:117)
at
org.jboss.tools.ws.core.test.command.JBossWSClientCommandTest.setUp(JBossWSClientCommandTest.java:63)
at org.eclipse.test.EclipseTestRunner.run(EclipseTestRunner.java:354)
at org.eclipse.test.EclipseTestRunner.run(EclipseTestRunner.java:206)
at org.eclipse.test.UITestApplication$3.run(UITestApplication.java:195)
at org.eclipse.swt.widgets.RunnableLock.run(RunnableLock.java:35)
at org.eclipse.swt.widgets.Synchronizer.runAsyncMessages(Synchronizer.java:134)
at org.eclipse.swt.widgets.Display.runAsyncMessages(Display.java:3468)
at org.eclipse.swt.widgets.Display.readAndDispatch(Display.java:3115)
at org.eclipse.ui.internal.Workbench.runEventLoop(Workbench.java:2405)
at org.eclipse.ui.internal.Workbench.runUI(Workbench.java:2369)
at org.eclipse.ui.internal.Workbench.access$4(Workbench.java:2221)
at org.eclipse.ui.internal.Workbench$5.run(Workbench.java:500)
at org.eclipse.core.databinding.observable.Realm.runWithDefault(Realm.java:332)
at org.eclipse.ui.internal.Workbench.createAndRunWorkbench(Workbench.java:493)
at org.eclipse.ui.PlatformUI.createAndRunWorkbench(PlatformUI.java:149)
at org.eclipse.ui.internal.ide.application.IDEApplication.start(IDEApplication.java:113)
at org.eclipse.test.UITestApplication.runApplication(UITestApplication.java:138)
at org.eclipse.test.UITestApplication.run(UITestApplication.java:60)
at org.eclipse.test.UITestApplication.start(UITestApplication.java:210)
at org.eclipse.equinox.internal.app.EclipseAppHandle.run(EclipseAppHandle.java:194)
at
org.eclipse.core.runtime.internal.adaptor.EclipseAppLauncher.runApplication(EclipseAppLauncher.java:110)
at
org.eclipse.core.runtime.internal.adaptor.EclipseAppLauncher.start(EclipseAppLauncher.java:79)
at org.eclipse.core.runtime.adaptor.EclipseStarter.run(EclipseStarter.java:368)
at org.eclipse.core.runtime.adaptor.EclipseStarter.run(EclipseStarter.java:179)
at org.eclipse.equinox.launcher.Main.invokeFramework(Main.java:559)
at org.eclipse.equinox.launcher.Main.basicRun(Main.java:514)
at org.eclipse.equinox.launcher.Main.run(Main.java:1311)
at org.eclipse.equinox.launcher.Main.main(Main.java:1287)
at org.eclipse.core.launcher.Main.main(Main.java:34)
FAILED: JBossWSCoreAllTests
Error Message:
null
Stack Trace:
junit.framework.AssertionFailedError
at
org.jboss.tools.ws.core.test.command.AbstractJBossWSCommandTest.createServer(AbstractJBossWSCommandTest.java:174)
at
org.jboss.tools.ws.core.test.command.AbstractJBossWSCommandTest.setUp(AbstractJBossWSCommandTest.java:117)
at
org.jboss.tools.ws.core.test.command.JBossWSTopDownCommandTest.setUp(JBossWSTopDownCommandTest.java:75)
at org.eclipse.test.EclipseTestRunner.run(EclipseTestRunner.java:354)
at org.eclipse.test.EclipseTestRunner.run(EclipseTestRunner.java:206)
at org.eclipse.test.UITestApplication$3.run(UITestApplication.java:195)
at org.eclipse.swt.widgets.RunnableLock.run(RunnableLock.java:35)
at org.eclipse.swt.widgets.Synchronizer.runAsyncMessages(Synchronizer.java:134)
at org.eclipse.swt.widgets.Display.runAsyncMessages(Display.java:3468)
at org.eclipse.swt.widgets.Display.readAndDispatch(Display.java:3115)
at org.eclipse.ui.internal.Workbench.runEventLoop(Workbench.java:2405)
at org.eclipse.ui.internal.Workbench.runUI(Workbench.java:2369)
at org.eclipse.ui.internal.Workbench.access$4(Workbench.java:2221)
at org.eclipse.ui.internal.Workbench$5.run(Workbench.java:500)
at org.eclipse.core.databinding.observable.Realm.runWithDefault(Realm.java:332)
at org.eclipse.ui.internal.Workbench.createAndRunWorkbench(Workbench.java:493)
at org.eclipse.ui.PlatformUI.createAndRunWorkbench(PlatformUI.java:149)
at org.eclipse.ui.internal.ide.application.IDEApplication.start(IDEApplication.java:113)
at org.eclipse.test.UITestApplication.runApplication(UITestApplication.java:138)
at org.eclipse.test.UITestApplication.run(UITestApplication.java:60)
at org.eclipse.test.UITestApplication.start(UITestApplication.java:210)
at org.eclipse.equinox.internal.app.EclipseAppHandle.run(EclipseAppHandle.java:194)
at
org.eclipse.core.runtime.internal.adaptor.EclipseAppLauncher.runApplication(EclipseAppLauncher.java:110)
at
org.eclipse.core.runtime.internal.adaptor.EclipseAppLauncher.start(EclipseAppLauncher.java:79)
at org.eclipse.core.runtime.adaptor.EclipseStarter.run(EclipseStarter.java:368)
at org.eclipse.core.runtime.adaptor.EclipseStarter.run(EclipseStarter.java:179)
at org.eclipse.equinox.launcher.Main.invokeFramework(Main.java:559)
at org.eclipse.equinox.launcher.Main.basicRun(Main.java:514)
at org.eclipse.equinox.launcher.Main.run(Main.java:1311)
at org.eclipse.equinox.launcher.Main.main(Main.java:1287)
at org.eclipse.core.launcher.Main.main(Main.java:34)
FAILED: JBossWSCoreAllTests
Error Message:
null
Stack Trace:
junit.framework.AssertionFailedError
at
org.jboss.tools.ws.core.test.command.AbstractJBossWSCommandTest.createServer(AbstractJBossWSCommandTest.java:174)
at
org.jboss.tools.ws.core.test.command.AbstractJBossWSCommandTest.setUp(AbstractJBossWSCommandTest.java:117)
at
org.jboss.tools.ws.core.test.command.JBossWSTopDownCommandTest.setUp(JBossWSTopDownCommandTest.java:75)
at org.eclipse.test.EclipseTestRunner.run(EclipseTestRunner.java:354)
at org.eclipse.test.EclipseTestRunner.run(EclipseTestRunner.java:206)
at org.eclipse.test.UITestApplication$3.run(UITestApplication.java:195)
at org.eclipse.swt.widgets.RunnableLock.run(RunnableLock.java:35)
at org.eclipse.swt.widgets.Synchronizer.runAsyncMessages(Synchronizer.java:134)
at org.eclipse.swt.widgets.Display.runAsyncMessages(Display.java:3468)
at org.eclipse.swt.widgets.Display.readAndDispatch(Display.java:3115)
at org.eclipse.ui.internal.Workbench.runEventLoop(Workbench.java:2405)
at org.eclipse.ui.internal.Workbench.runUI(Workbench.java:2369)
at org.eclipse.ui.internal.Workbench.access$4(Workbench.java:2221)
at org.eclipse.ui.internal.Workbench$5.run(Workbench.java:500)
at org.eclipse.core.databinding.observable.Realm.runWithDefault(Realm.java:332)
at org.eclipse.ui.internal.Workbench.createAndRunWorkbench(Workbench.java:493)
at org.eclipse.ui.PlatformUI.createAndRunWorkbench(PlatformUI.java:149)
at org.eclipse.ui.internal.ide.application.IDEApplication.start(IDEApplication.java:113)
at org.eclipse.test.UITestApplication.runApplication(UITestApplication.java:138)
at org.eclipse.test.UITestApplication.run(UITestApplication.java:60)
at org.eclipse.test.UITestApplication.start(UITestApplication.java:210)
at org.eclipse.equinox.internal.app.EclipseAppHandle.run(EclipseAppHandle.java:194)
at
org.eclipse.core.runtime.internal.adaptor.EclipseAppLauncher.runApplication(EclipseAppLauncher.java:110)
at
org.eclipse.core.runtime.internal.adaptor.EclipseAppLauncher.start(EclipseAppLauncher.java:79)
at org.eclipse.core.runtime.adaptor.EclipseStarter.run(EclipseStarter.java:368)
at org.eclipse.core.runtime.adaptor.EclipseStarter.run(EclipseStarter.java:179)
at org.eclipse.equinox.launcher.Main.invokeFramework(Main.java:559)
at org.eclipse.equinox.launcher.Main.basicRun(Main.java:514)
at org.eclipse.equinox.launcher.Main.run(Main.java:1311)
at org.eclipse.equinox.launcher.Main.main(Main.java:1287)
at org.eclipse.core.launcher.Main.main(Main.java:34)
FAILED: JBossWSCoreAllTests
Error Message:
null
Stack Trace:
junit.framework.AssertionFailedError
at
org.jboss.tools.ws.core.test.command.AbstractJBossWSCommandTest.createServer(AbstractJBossWSCommandTest.java:174)
at
org.jboss.tools.ws.core.test.command.AbstractJBossWSCommandTest.setUp(AbstractJBossWSCommandTest.java:117)
at
org.jboss.tools.ws.core.test.command.JBossWSTopDownCommandTest.setUp(JBossWSTopDownCommandTest.java:75)
at org.eclipse.test.EclipseTestRunner.run(EclipseTestRunner.java:354)
at org.eclipse.test.EclipseTestRunner.run(EclipseTestRunner.java:206)
at org.eclipse.test.UITestApplication$3.run(UITestApplication.java:195)
at org.eclipse.swt.widgets.RunnableLock.run(RunnableLock.java:35)
at org.eclipse.swt.widgets.Synchronizer.runAsyncMessages(Synchronizer.java:134)
at org.eclipse.swt.widgets.Display.runAsyncMessages(Display.java:3468)
at org.eclipse.swt.widgets.Display.readAndDispatch(Display.java:3115)
at org.eclipse.ui.internal.Workbench.runEventLoop(Workbench.java:2405)
at org.eclipse.ui.internal.Workbench.runUI(Workbench.java:2369)
at org.eclipse.ui.internal.Workbench.access$4(Workbench.java:2221)
at org.eclipse.ui.internal.Workbench$5.run(Workbench.java:500)
at org.eclipse.core.databinding.observable.Realm.runWithDefault(Realm.java:332)
at org.eclipse.ui.internal.Workbench.createAndRunWorkbench(Workbench.java:493)
at org.eclipse.ui.PlatformUI.createAndRunWorkbench(PlatformUI.java:149)
at org.eclipse.ui.internal.ide.application.IDEApplication.start(IDEApplication.java:113)
at org.eclipse.test.UITestApplication.runApplication(UITestApplication.java:138)
at org.eclipse.test.UITestApplication.run(UITestApplication.java:60)
at org.eclipse.test.UITestApplication.start(UITestApplication.java:210)
at org.eclipse.equinox.internal.app.EclipseAppHandle.run(EclipseAppHandle.java:194)
at
org.eclipse.core.runtime.internal.adaptor.EclipseAppLauncher.runApplication(EclipseAppLauncher.java:110)
at
org.eclipse.core.runtime.internal.adaptor.EclipseAppLauncher.start(EclipseAppLauncher.java:79)
at org.eclipse.core.runtime.adaptor.EclipseStarter.run(EclipseStarter.java:368)
at org.eclipse.core.runtime.adaptor.EclipseStarter.run(EclipseStarter.java:179)
at org.eclipse.equinox.launcher.Main.invokeFramework(Main.java:559)
at org.eclipse.equinox.launcher.Main.basicRun(Main.java:514)
at org.eclipse.equinox.launcher.Main.run(Main.java:1311)
at org.eclipse.equinox.launcher.Main.main(Main.java:1287)
at org.eclipse.core.launcher.Main.main(Main.java:34)
FAILED: JBossWSCoreAllTests
Error Message:
null
Stack Trace:
junit.framework.AssertionFailedError
at
org.jboss.tools.ws.core.test.command.AbstractJBossWSCommandTest.createServer(AbstractJBossWSCommandTest.java:174)
at
org.jboss.tools.ws.core.test.command.AbstractJBossWSCommandTest.setUp(AbstractJBossWSCommandTest.java:117)
at
org.jboss.tools.ws.core.test.command.JBossWSTopDownCommandTest.setUp(JBossWSTopDownCommandTest.java:75)
at org.eclipse.test.EclipseTestRunner.run(EclipseTestRunner.java:354)
at org.eclipse.test.EclipseTestRunner.run(EclipseTestRunner.java:206)
at org.eclipse.test.UITestApplication$3.run(UITestApplication.java:195)
at org.eclipse.swt.widgets.RunnableLock.run(RunnableLock.java:35)
at org.eclipse.swt.widgets.Synchronizer.runAsyncMessages(Synchronizer.java:134)
at org.eclipse.swt.widgets.Display.runAsyncMessages(Display.java:3468)
at org.eclipse.swt.widgets.Display.readAndDispatch(Display.java:3115)
at org.eclipse.ui.internal.Workbench.runEventLoop(Workbench.java:2405)
at org.eclipse.ui.internal.Workbench.runUI(Workbench.java:2369)
at org.eclipse.ui.internal.Workbench.access$4(Workbench.java:2221)
at org.eclipse.ui.internal.Workbench$5.run(Workbench.java:500)
at org.eclipse.core.databinding.observable.Realm.runWithDefault(Realm.java:332)
at org.eclipse.ui.internal.Workbench.createAndRunWorkbench(Workbench.java:493)
at org.eclipse.ui.PlatformUI.createAndRunWorkbench(PlatformUI.java:149)
at org.eclipse.ui.internal.ide.application.IDEApplication.start(IDEApplication.java:113)
at org.eclipse.test.UITestApplication.runApplication(UITestApplication.java:138)
at org.eclipse.test.UITestApplication.run(UITestApplication.java:60)
at org.eclipse.test.UITestApplication.start(UITestApplication.java:210)
at org.eclipse.equinox.internal.app.EclipseAppHandle.run(EclipseAppHandle.java:194)
at
org.eclipse.core.runtime.internal.adaptor.EclipseAppLauncher.runApplication(EclipseAppLauncher.java:110)
at
org.eclipse.core.runtime.internal.adaptor.EclipseAppLauncher.start(EclipseAppLauncher.java:79)
at org.eclipse.core.runtime.adaptor.EclipseStarter.run(EclipseStarter.java:368)
at org.eclipse.core.runtime.adaptor.EclipseStarter.run(EclipseStarter.java:179)
at org.eclipse.equinox.launcher.Main.invokeFramework(Main.java:559)
at org.eclipse.equinox.launcher.Main.basicRun(Main.java:514)
at org.eclipse.equinox.launcher.Main.run(Main.java:1311)
at org.eclipse.equinox.launcher.Main.main(Main.java:1287)
at org.eclipse.core.launcher.Main.main(Main.java:34)
--------------------------------------------------
Changes:
--------------------------------------------------
Console log:
[...truncated 178771 lines...]
[echo]
[echo] jbds-drools-ide-filename=DroolsIDE-5.1.0.trunk-N200907061943-H341.zip
[echo]
jbds-drools-ide-nodeps-filename=DroolsIDE-nodeps-5.1.0.trunk-N200907061943-H341.zip
[echo]
[echo] Getting version for 'archives' builder to property
'archives.versionTag' from
/qa/services/hudson/hudson_workspace/workspace/jbosstools-nightly-3.1.0.M2/org.jboss.ide.eclipse.releng/builders/product/versionTags/jbosstools/3.1.0.M2.tags
[echo]
[echo] jbds-archives-filename=JBossTools-Archives-3.1.0.M2-N200907061943-H341.zip
[echo]
jbds-archives-nodeps-filename=JBossTools-Archives-nodeps-3.1.0.M2-N200907061943-H341.zip
[echo]
[echo] Getting version for 'xulrunner' builder to property
'xulrunner.versionTag' from
/qa/services/hudson/hudson_workspace/workspace/jbosstools-nightly-3.1.0.M2/org.jboss.ide.eclipse.releng/builders/product/versionTags/jbosstools/3.1.0.M2.tags
[echo]
[echo]
jbds-xulrunner-win32-filename=XulRunner-win32-1.0.0.GA-N200907061943-H341.zip
[echo]
jbds-xulrunner-win32-nodeps-filename=XulRunner-win32-nodeps-1.0.0.GA-N200907061943-H341.zip
[echo]
[echo] Getting version for 'xulrunner' builder to property
'xulrunner.versionTag' from
/qa/services/hudson/hudson_workspace/workspace/jbosstools-nightly-3.1.0.M2/org.jboss.ide.eclipse.releng/builders/product/versionTags/jbosstools/3.1.0.M2.tags
[echo]
[echo]
jbds-xulrunner-linux-gtk-filename=XulRunner-linux-gtk-1.0.0.GA-N200907061943-H341.zip
[echo]
jbds-xulrunner-linux-gtk-nodeps-filename=XulRunner-linux-gtk-nodeps-1.0.0.GA-N200907061943-H341.zip
[echo]
[echo] Getting version for 'richfaces' builder to property
'richfaces.versionTag' from
/qa/services/hudson/hudson_workspace/workspace/jbosstools-nightly-3.1.0.M2/org.jboss.ide.eclipse.releng/builders/product/versionTags/jbosstools/3.1.0.M2.tags
[echo]
[echo]
jbds-richfaces-win32-filename=RichFaces-VPE-win32-3.1.0.M2-N200907061943-H341.zip
[echo]
jbds-richfaces-win32-nodeps-filename=RichFaces-VPE-win32-nodeps-3.1.0.M2-N200907061943-H341.zip
[echo]
[echo] Getting version for 'richfaces' builder to property
'richfaces.versionTag' from
/qa/services/hudson/hudson_workspace/workspace/jbosstools-nightly-3.1.0.M2/org.jboss.ide.eclipse.releng/builders/product/versionTags/jbosstools/3.1.0.M2.tags
[echo]
[echo]
jbds-richfaces-linux-gtk-filename=RichFaces-VPE-linux-gtk-3.1.0.M2-N200907061943-H341.zip
[echo]
jbds-richfaces-linux-gtk-nodeps-filename=RichFaces-VPE-linux-gtk-nodeps-3.1.0.M2-N200907061943-H341.zip
[echo]
[echo] Getting version for 'jbpm-convert' builder to property
'jbpm-convert.versionTag' from
/qa/services/hudson/hudson_workspace/workspace/jbosstools-nightly-3.1.0.M2/org.jboss.ide.eclipse.releng/builders/product/versionTags/jbosstools/3.1.0.M2.tags
[echo]
[echo] jbds-jbpm-convert-filename=jBPM-Convert-1.1.0.M2-N200907061943-H341.zip
[echo]
jbds-jbpm-convert-nodeps-filename=jBPM-Convert-nodeps-1.1.0.M2-N200907061943-H341.zip
[echo]
[echo] Getting version for 'freemarker' builder to property
'freemarker.versionTag' from
/qa/services/hudson/hudson_workspace/workspace/jbosstools-nightly-3.1.0.M2/org.jboss.ide.eclipse.releng/builders/product/versionTags/jbosstools/3.1.0.M2.tags
[echo]
[echo] jbds-freemarker-filename=FreeMarkerIDE-1.1.0.M2-N200907061943-H341.zip
[echo]
jbds-freemarker-nodeps-filename=FreeMarkerIDE-nodeps-1.1.0.M2-N200907061943-H341.zip
[echo]
[echo] Getting version for 'hibernate-tools' builder to property
'hibernate-tools.versionTag' from
/qa/services/hudson/hudson_workspace/workspace/jbosstools-nightly-3.1.0.M2/org.jboss.ide.eclipse.releng/builders/product/versionTags/jbosstools/3.1.0.M2.tags
[echo]
[echo]
jbds-hibernate-tools-filename=HibernateTools-3.3.0.M2-N200907061943-H341.zip
[echo]
jbds-hibernate-tools-nodeps-filename=HibernateTools-nodeps-3.3.0.M2-N200907061943-H341.zip
[echo]
[echo] Getting version for 'struts' builder to property
'struts.versionTag' from
/qa/services/hudson/hudson_workspace/workspace/jbosstools-nightly-3.1.0.M2/org.jboss.ide.eclipse.releng/builders/product/versionTags/jbosstools/3.1.0.M2.tags
[echo]
[echo] jbds-struts-filename=StrutsTools-3.1.0.M2-N200907061943-H341.zip
[echo]
jbds-struts-nodeps-filename=StrutsTools-nodeps-3.1.0.M2-N200907061943-H341.zip
[echo]
[echo] Getting version for 'jbpm' builder to property
'jbpm.versionTag' from
/qa/services/hudson/hudson_workspace/workspace/jbosstools-nightly-3.1.0.M2/org.jboss.ide.eclipse.releng/builders/product/versionTags/jbosstools/3.1.0.M2.tags
[echo]
[echo] jbds-jbpm-filename=jBPM-Designer-3.2.0.M2-N200907061943-H341.zip
[echo]
jbds-jbpm-nodeps-filename=jBPM-Designer-nodeps-3.2.0.M2-N200907061943-H341.zip
[echo]
[echo] Getting version for 'jbpm4' builder to property
'jbpm4.versionTag' from
/qa/services/hudson/hudson_workspace/workspace/jbosstools-nightly-3.1.0.M2/org.jboss.ide.eclipse.releng/builders/product/versionTags/jbosstools/3.1.0.M2.tags
[echo]
[echo] jbds-jbpm4-filename=jBPM4-Designer-4.0.0.M2-N200907061943-H341.zip
[echo]
jbds-jbpm4-nodeps-filename=jBPM4-Designer-nodeps-4.0.0.M2-N200907061943-H341.zip
[echo]
[echo] Getting version for 'as' builder to property 'as.versionTag'
from
/qa/services/hudson/hudson_workspace/workspace/jbosstools-nightly-3.1.0.M2/org.jboss.ide.eclipse.releng/builders/product/versionTags/jbosstools/3.1.0.M2.tags
[echo]
[echo] jbds-as-filename=JBossAS-Tools-2.1.0.M2-N200907061943-H341.zip
[echo]
jbds-as-nodeps-filename=JBossAS-Tools-nodeps-2.1.0.M2-N200907061943-H341.zip
[echo]
[echo] Getting version for 'seam' builder to property
'seam.versionTag' from
/qa/services/hudson/hudson_workspace/workspace/jbosstools-nightly-3.1.0.M2/org.jboss.ide.eclipse.releng/builders/product/versionTags/jbosstools/3.1.0.M2.tags
[echo]
[echo] jbds-seam-filename=SeamTools-3.1.0.M2-N200907061943-H341.zip
[echo] jbds-seam-nodeps-filename=SeamTools-nodeps-3.1.0.M2-N200907061943-H341.zip
[echo]
[echo] Getting version for 'maven' builder to property
'maven.versionTag' from
/qa/services/hudson/hudson_workspace/workspace/jbosstools-nightly-3.1.0.M2/org.jboss.ide.eclipse.releng/builders/product/versionTags/jbosstools/3.1.0.M2.tags
[echo]
[echo] jbds-maven-filename=JBoss-Maven-Tools-1.0.0.M2-N200907061943-H341.zip
[echo]
jbds-maven-nodeps-filename=JBoss-Maven-Tools-nodeps-1.0.0.M2-N200907061943-H341.zip
[echo]
[echo] Getting version for 'examples' builder to property
'examples.versionTag' from
/qa/services/hudson/hudson_workspace/workspace/jbosstools-nightly-3.1.0.M2/org.jboss.ide.eclipse.releng/builders/product/versionTags/jbosstools/3.1.0.M2.tags
[echo]
[echo] jbds-examples-filename=JBossTools-Examples-1.1.0.M2-N200907061943-H341.zip
[echo]
jbds-examples-nodeps-filename=JBossTools-Examples-nodeps-1.1.0.M2-N200907061943-H341.zip
[echo]
[echo] Getting version for 'esb' builder to property 'esb.versionTag'
from
/qa/services/hudson/hudson_workspace/workspace/jbosstools-nightly-3.1.0.M2/org.jboss.ide.eclipse.releng/builders/product/versionTags/jbosstools/3.1.0.M2.tags
[echo]
[echo] jbds-esb-filename=JBossTools-ESB-1.3.0.M2-N200907061943-H341.zip
[echo]
jbds-esb-nodeps-filename=JBossTools-ESB-nodeps-1.3.0.M2-N200907061943-H341.zip
[echo]
[echo] Getting version for 'ws' builder to property 'ws.versionTag'
from
/qa/services/hudson/hudson_workspace/workspace/jbosstools-nightly-3.1.0.M2/org.jboss.ide.eclipse.releng/builders/product/versionTags/jbosstools/3.1.0.M2.tags
[echo]
[echo] jbds-ws-filename=JBossWS-Tools-1.1.0.M2-N200907061943-H341.zip
[echo]
jbds-ws-nodeps-filename=JBossWS-Tools-nodeps-1.1.0.M2-N200907061943-H341.zip
[echo]
[echo] Getting version for 'birt' builder to property
'birt.versionTag' from
/qa/services/hudson/hudson_workspace/workspace/jbosstools-nightly-3.1.0.M2/org.jboss.ide.eclipse.releng/builders/product/versionTags/jbosstools/3.1.0.M2.tags
[echo]
[echo] jbds-birt-filename=JBossTools-BIRT-1.1.0.M2-N200907061943-H341.zip
[echo]
jbds-birt-nodeps-filename=JBossTools-BIRT-nodeps-1.1.0.M2-N200907061943-H341.zip
[echo]
[echo] Getting version for 'portlet' builder to property
'portlet.versionTag' from
/qa/services/hudson/hudson_workspace/workspace/jbosstools-nightly-3.1.0.M2/org.jboss.ide.eclipse.releng/builders/product/versionTags/jbosstools/3.1.0.M2.tags
[echo]
[echo] jbds-portlet-filename=JBoss-Portlet-Tools-1.1.0.M2-N200907061943-H341.zip
[echo]
jbds-portlet-nodeps-filename=JBoss-Portlet-Tools-nodeps-1.1.0.M2-N200907061943-H341.zip
[echo]
[echo] Getting version for 'smooks' builder to property
'smooks.versionTag' from
/qa/services/hudson/hudson_workspace/workspace/jbosstools-nightly-3.1.0.M2/org.jboss.ide.eclipse.releng/builders/product/versionTags/jbosstools/3.1.0.M2.tags
[echo]
[echo] jbds-smooks-filename=JBossTools-Smooks-1.1.0.M2-N200907061943-H341.zip
[echo]
jbds-smooks-nodeps-filename=JBossTools-Smooks-nodeps-1.1.0.M2-N200907061943-H341.zip
[echo]
[echo] Getting version for 'tptp' builder to property
'tptp.versionTag' from
/qa/services/hudson/hudson_workspace/workspace/jbosstools-nightly-3.1.0.M2/org.jboss.ide.eclipse.releng/builders/product/versionTags/jbosstools/3.1.0.M2.tags
[echo]
[echo] jbds-tptp-filename=JBoss-TPTP-Tools-1.1.0.M2-N200907061943-H341.zip
[echo]
jbds-tptp-nodeps-filename=JBoss-TPTP-Tools-nodeps-1.1.0.M2-N200907061943-H341.zip
[echo]
pack200:
[echo] Using /qa/tools/opt/jdk1.5.0_15/jre/bin/pack200 to pack update site jars...
[mkdir] Created dir:
/qa/services/hudson/hudson_workspace/workspace/jbosstools-nightly-3.1.0.M2/org.jboss.ide.eclipse.releng/builders/product/updateSite/updateSitePackTmp/output
[mkdir] Created dir:
/qa/services/hudson/hudson_workspace/workspace/jbosstools-nightly-3.1.0.M2/org.jboss.ide.eclipse.releng/builders/product/updateSite/updateSitePackTmp/input
[echo] Zip update jars in
/home/hudson/hudson_workspace/workspace/jbosstools-nightly-3.1.0.M2/jbds-build/site to
temporary Master zip (to avoid packing nested jars) ...
[zip] Building zip:
/qa/services/hudson/hudson_workspace/workspace/jbosstools-nightly-3.1.0.M2/org.jboss.ide.eclipse.releng/builders/product/updateSite/updateSitePackTmp/input/Master.zip
[exec] 63M updateSite/updateSitePackTmp/input/Master.zip
[echo] Pack jars ...
[echo] Run jarprocessor.pack200 using launcherjar =
/home/hudson/hudson_workspace/workspace/jbosstools-nightly-3.1.0.M2/jbds-build/clean-eclipse/eclipse/plugins/org.eclipse.equinox.launcher_1.0.200.v20090520.jar
[exec] 175M updateSite/updateSitePackTmp/output/Master.zip
[unzip] Expanding:
/qa/services/hudson/hudson_workspace/workspace/jbosstools-nightly-3.1.0.M2/org.jboss.ide.eclipse.releng/builders/product/updateSite/updateSitePackTmp/output/Master.zip
into /home/hudson/hudson_workspace/workspace/jbosstools-nightly-3.1.0.M2/jbds-build/site
[delete] Deleting directory
/qa/services/hudson/hudson_workspace/workspace/jbosstools-nightly-3.1.0.M2/org.jboss.ide.eclipse.releng/builders/product/updateSite/updateSitePackTmp
copy.site.rootfiles:
[echo] Build development jbosstools update site...
[copy] Copying 4 files to
/home/hudson/hudson_workspace/workspace/jbosstools-nightly-3.1.0.M2/jbds-build/site/eclipse
p2:
[echo] Run p2 metadata generator using launcherjar =
/home/hudson/hudson_workspace/workspace/jbosstools-nightly-3.1.0.M2/jbds-build/clean-eclipse/eclipse/plugins/org.eclipse.equinox.launcher_1.0.200.v20090520.jar
[p2] Generating metadata for
/home/hudson/hudson_workspace/workspace/jbosstools-nightly-3.1.0.M2/jbds-build/site/eclipse.
[p2] Generation completed with success [11 seconds].
build.metadata:
publish.site:
post-build:
publish.results:
send.notification.email:
[mail] Failed to initialise MIME mail: javax/mail/MessagingException
publish.log:
init:
clean.all.subfolders:
BUILD SUCCESSFUL
Total time: 158 minutes 42 seconds
++ buildResult=0
++ cd ../configs/jbds
++ zip build.log.zip build.log
updating: build.log (deflated 95%)
++ cd ../..
+++ date +%s
++ endtime=1246933753
+++ echo 'scale=2; (1246933753 - 1246924219)/60'
+++ bc -l
++ elapsed=158.90
++ echo 'Elapsed time: 158.90mins.'
Elapsed time: 158.90mins.
++ [[ 0 != 0 ]]
++ [[ '' == \l\o\c\a\l ]]
+++ cat
/home/hudson/hudson_workspace/workspace/jbosstools-nightly-3.1.0.M2/jbds-build/buildData.properties
+++ grep product.releaseNumber
+++ perl -ne 's/[\s\t]+product.releaseNumber=//g;print;'
++ version=3.1.0.M2
+++ cat
/home/hudson/hudson_workspace/workspace/jbosstools-nightly-3.1.0.M2/jbds-build/buildData.properties
+++ grep upload.to
+++ perl -ne 's/[\s\t]+upload.to=//g;print;'
++ builddir=nightly/3.1.0.M2/200907061943
+++ grep product.buildDesc
+++ perl -ne 's/[\s\t]+product.buildDesc=//g; print;'
+++ cat
/home/hudson/hudson_workspace/workspace/jbosstools-nightly-3.1.0.M2/jbds-build/buildData.properties
++ buildtype=nightly
+++ cat
/home/hudson/hudson_workspace/workspace/jbosstools-nightly-3.1.0.M2/jbds-build/buildData.properties
+++ grep product.buildTimestamp
+++ perl -ne 's/[\s\t]+product.buildTimestamp=//g; print;'
++ timestamp=200907061943
++ [[ '' == '' ]]
++ DESTINATION=jbossqa@download.jboss.org:/htdocs/jbosstools
++ echo 'Destination to publish build results is
jbossqa@download.jboss.org:/htdocs/jbosstools'
Destination to publish build results is jbossqa@download.jboss.org:/htdocs/jbosstools
++ scp -r
/home/hudson/hudson_workspace/workspace/jbosstools-nightly-3.1.0.M2/jbds-build/3.1.0.M2
jbossqa@download.jboss.org:/htdocs/jbosstools/builds/nightly/
++ scp configs/jbds/build.log.zip
jbossqa@download.jboss.org:/htdocs/jbosstools/builds/nightly/3.1.0.M2/200907061943/
++ scp
/home/hudson/hudson_workspace/workspace/jbosstools-nightly-3.1.0.M2/jbds-build/latestBuild.html
jbossqa@download.jboss.org:/htdocs/jbosstools/builds/nightly/3.1.0.M2/
++ scp
/home/hudson/hudson_workspace/workspace/jbosstools-nightly-3.1.0.M2/jbds-build/latestBuildFailures.html
jbossqa@download.jboss.org:/htdocs/jbosstools/builds/nightly/3.1.0.M2/
+++ date +%s
++ endtime=1246935514
+++ echo 'scale=2; (1246935514 - 1246924219)/60'
+++ bc -l
++ elapsed=188.25
++ echo 'Elapsed time: 188.25mins.'
Elapsed time: 188.25mins.
++ [[ -d
/home/hudson/hudson_workspace/workspace/jbosstools-nightly-3.1.0.M2/jbds-build/site/eclipse
]]
++ mkdir -p
/home/hudson/hudson_workspace/workspace/jbosstools-nightly-3.1.0.M2/jbds-build/site/nightly/3.1.0.M2
++ mv
/home/hudson/hudson_workspace/workspace/jbosstools-nightly-3.1.0.M2/jbds-build/site/eclipse/artifacts.jar
/home/hudson/hudson_workspace/workspace/jbosstools-nightly-3.1.0.M2/jbds-build/site/eclipse/associateSites.xml
/home/hudson/hudson_workspace/workspace/jbosstools-nightly-3.1.0.M2/jbds-build/site/eclipse/content.jar
/home/hudson/hudson_workspace/workspace/jbosstools-nightly-3.1.0.M2/jbds-build/site/eclipse/features
/home/hudson/hudson_workspace/workspace/jbosstools-nightly-3.1.0.M2/jbds-build/site/eclipse/index.html
/home/hudson/hudson_workspace/workspace/jbosstools-nightly-3.1.0.M2/jbds-build/site/eclipse/plugins
/home/hudson/hudson_workspace/workspace/jbosstools-nightly-3.1.0.M2/jbds-build/site/eclipse/site.xml
/home/hudson/hudson_workspace/workspace/jbosstools-nightly-3.1.0.M2/jbds-build/site/eclipse/web
/home/hudson/hudson_workspace/workspace/jbosstools-nightly-3.1.0.M2/jbds-build/site/nightly/3.1.0.M2
+++ find
/home/hudson/hudson_workspace/workspace/jbosstools-nightly-3.1.0.M2/jbds-build/site/nightly/3.1.0.M2/features
-name '*.jar'
++ [[ -n
/home/hudson/hudson_workspace/workspace/jbosstools-nightly-3.1.0.M2/jbds-build/site/nightly/3.1.0.M2/features/org.jboss.tools.richfaces.feature_3.1.0.M2-N200907061943-H341.jar
/home/hudson/hudson_workspace/workspace/jbosstools-nightly-3.1.0.M2/jbds-build/site/nightly/3.1.0.M2/features/org.jboss.tools.seam.feature_3.1.0.M2-N200907061943-H341.jar
/home/hudson/hudson_workspace/workspace/jbosstools-nightly-3.1.0.M2/jbds-build/site/nightly/3.1.0.M2/features/org.jboss.tools.jbpm4.feature_4.0.0.M2-N200907061943-H341.jar
/home/hudson/hudson_workspace/workspace/jbosstools-nightly-3.1.0.M2/jbds-build/site/nightly/3.1.0.M2/features/org.jboss.tools.esb.feature_1.3.0.M2-N200907061943-H341.jar
/home/hudson/hudson_workspace/workspace/jbosstools-nightly-3.1.0.M2/jbds-build/site/nightly/3.1.0.M2/features/org.jboss.tools.xulrunner.feature_1.8.1.3-20070904.jar
/home/hudson/hudson_workspace/workspace/jbosstools-nightly-3.1.0.M2/jbds-build/site/nightly/3.1.0.M2/features/org.jboss.tools.tptp.feature_1.1.0.M2-N200907061943-H341.jar
/home/hudson/hudson_workspace/workspace/jbosstools-nightly-3.1.0.M2/jbds-build/site/nightly/3.1.0.M2/features/org.jboss.tools.profiler.feature_1.0.0.M2-N200907061943-H341.jar
/home/hudson/hudson_workspace/workspace/jbosstools-nightly-3.1.0.M2/jbds-build/site/nightly/3.1.0.M2/features/org.jboss.tools.jmx.feature_1.1.0.M2-N200907061943-H341.jar
/home/hudson/hudson_workspace/workspace/jbosstools-nightly-3.1.0.M2/jbds-build/site/nightly/3.1.0.M2/features/org.jboss.tools.birt.feature_1.1.0.M2-N200907061943-H341.jar
/home/hudson/hudson_workspace/workspace/jbosstools-nightly-3.1.0.M2/jbds-build/site/nightly/3.1.0.M2/features/org.jboss.tools.portlet.feature_1.1.0.M2-N200907061943-H341.jar
/home/hudson/hudson_workspace/workspace/jbosstools-nightly-3.1.0.M2/jbds-build/site/nightly/3.1.0.M2/features/org.jboss.tools.maven.feature_1.0.0.M2-N200907061943-H341.jar
/home/hudson/hudson_workspace/workspace/jbosstools-nightly-3.1.0.M2/jbds-build/site/nightly/3.1.0.M2/features/org.jbpm.gd.jpdl.feature_3.2.0.M2-N200907061943-H341.jar
/home/hudson/hudson_workspace/workspace/jbosstools-nightly-3.1.0.M2/jbds-build/site/nightly/3.1.0.M2/features/org.jboss.tools.smooks.feature_1.1.0.M2-N200907061943-H341.jar
/home/hudson/hudson_workspace/workspace/jbosstools-nightly-3.1.0.M2/jbds-build/site/nightly/3.1.0.M2/features/org.jboss.tools.struts_feature_3.1.0.M2-N200907061943-H341.jar
/home/hudson/hudson_workspace/workspace/jbosstools-nightly-3.1.0.M2/jbds-build/site/nightly/3.1.0.M2/features/org.jboss.tools.ws.feature_1.1.0.M2-N200907061943-H341.jar
/home/hudson/hudson_workspace/workspace/jbosstools-nightly-3.1.0.M2/jbds-build/site/nightly/3.1.0.M2/features/org.jboss.ide.eclipse.as.feature_2.1.0.M2-N200907061943-H341.jar
/home/hudson/hudson_workspace/workspace/jbosstools-nightly-3.1.0.M2/jbds-build/site/nightly/3.1.0.M2/features/org.guvnor.tools.feature_5.1.0.trunk-N200907061943-H341.jar
/home/hudson/hudson_workspace/workspace/jbosstools-nightly-3.1.0.M2/jbds-build/site/nightly/3.1.0.M2/features/org.hibernate.eclipse.feature_3.3.0.M2-N200907061943-H341.jar
/home/hudson/hudson_workspace/workspace/jbosstools-nightly-3.1.0.M2/jbds-build/site/nightly/3.1.0.M2/features/org.drools.eclipse.feature_5.1.0.trunk-N200907061943-H341.jar
/home/hudson/hudson_workspace/workspace/jbosstools-nightly-3.1.0.M2/jbds-build/site/nightly/3.1.0.M2/features/org.drools.eclipse.task.feature_5.1.0.trunk-N200907061943-H341.jar
/home/hudson/hudson_workspace/workspace/jbosstools-nightly-3.1.0.M2/jbds-build/site/nightly/3.1.0.M2/features/org.jboss.ide.eclipse.archives.feature_3.1.0.M2-N200907061943-H341.jar
/home/hudson/hudson_workspace/workspace/jbosstools-nightly-3.1.0.M2/jbds-build/site/nightly/3.1.0.M2/features/org.jboss.ide.eclipse.freemarker.feature_1.1.0.M2-N200907061943-H341.jar
/home/hudson/hudson_workspace/workspace/jbosstools-nightly-3.1.0.M2/jbds-build/site/nightly/3.1.0.M2/features/org.jboss.tools.flow.common.feature_4.0.0.M2-N200907061943-H341.jar
/home/hudson/hudson_workspace/workspace/jbosstools-nightly-3.1.0.M2/jbds-build/site/nightly/3.1.0.M2/features/org.jboss.tools.flow.jpdl4.feature_4.0.0.M2-N200907061943-H341.jar
/home/hudson/hudson_workspace/workspace/jbosstools-nightly-3.1.0.M2/jbds-build/site/nightly/3.1.0.M2/features/org.jboss.tools.jbpm.common.feature_4.0.0.M2-N200907061943-H341.jar
/home/hudson/hudson_workspace/workspace/jbosstools-nightly-3.1.0.M2/jbds-build/site/nightly/3.1.0.M2/features/org.jboss.tools.jbpm.convert.feature_1.1.0.M2-N200907061943-H341.jar
/home/hudson/hudson_workspace/workspace/jbosstools-nightly-3.1.0.M2/jbds-build/site/nightly/3.1.0.M2/features/org.jboss.tools.project.examples.feature_1.1.0.M2-N200907061943-H341.jar
]]
+++ echo jbossqa@download.jboss.org:/htdocs/jbosstools
+++ perl -ne 's/[^@]//g; print;'
++ atSign=@
++ [[ @ != \@ ]]
++ rsync -arz --delete
/home/hudson/hudson_workspace/workspace/jbosstools-nightly-3.1.0.M2/jbds-build/site/nightly/3.1.0.M2
jbossqa@download.jboss.org:/htdocs/jbosstools/updates/nightly/
+++ date +%s
++ endtime=1246935671
+++ echo 'scale=2; (1246935671 - 1246924219)/60'
+++ bc -l
++ elapsed=190.86
++ echo 'Elapsed time: 190.86mins.'
Elapsed time: 190.86mins.
Terminating xvnc
[jbosstools-nightly-3.1.0.M2] $ vncserver -kill :14
Killing Xvnc process ID 17506
[jbosstools-nightly-3.1.0.M2] $ bash -xe /tmp/hudson5727267402455192863.sh
+ kill 17485
Recording test results
Build was marked for publishing on
https://hudson.jboss.org/hudson/
Email was triggered for: Unstable
There are 1 triggered emails.
Sending email for trigger: Unstable
--------------------------------------------------