Public:
https://hudson.jboss.org/hudson//job/jbosstools-nightly-3.1.0.M3/8
https://hudson.jboss.org/hudson//job/jbosstools-nightly-3.1.0.M3/8/testRe...
https://hudson.jboss.org/hudson//job/jbosstools-nightly-3.1.0.M3/8/changes
https://hudson.jboss.org/hudson//job/jbosstools-nightly-3.1.0.M3/8/console
Internal:
http://hudson.qa.jboss.com/hudson/job/jbosstools-nightly-3.1.0.M3/8/
http://hudson.qa.jboss.com/hudson/job/jbosstools-nightly-3.1.0.M3/8//test...
http://hudson.qa.jboss.com/hudson/job/jbosstools-nightly-3.1.0.M3/8//changes
http://hudson.qa.jboss.com/hudson/job/jbosstools-nightly-3.1.0.M3/8//console
--------------------------------------------------
Failed Tests:
51 tests failed.
FAILED: org.hibernate.eclipse.console.test.ConsolePluginAllTests
Error Message:
java.lang.Exception: Could not find plugin "org.hibernate.eclipse.console.test"
Stack Trace:
org.eclipse.test.EclipseTestRunner$TestFailedException: java.lang.Exception: Could not
find plugin "org.hibernate.eclipse.console.test"
at org.eclipse.test.EclipseTestRunner.runFailed(EclipseTestRunner.java:288)
at org.eclipse.test.EclipseTestRunner.getTest(EclipseTestRunner.java:240)
at org.eclipse.test.EclipseTestRunner.<init>(EclipseTestRunner.java:220)
at org.eclipse.test.EclipseTestRunner.run(EclipseTestRunner.java:204)
at org.eclipse.test.UITestApplication$3.run(UITestApplication.java:195)
at org.eclipse.swt.widgets.RunnableLock.run(RunnableLock.java:35)
at org.eclipse.swt.widgets.Synchronizer.runAsyncMessages(Synchronizer.java:134)
at org.eclipse.swt.widgets.Display.runAsyncMessages(Display.java:3468)
at org.eclipse.swt.widgets.Display.readAndDispatch(Display.java:3115)
at org.eclipse.ui.internal.Workbench.runEventLoop(Workbench.java:2405)
at org.eclipse.ui.internal.Workbench.runUI(Workbench.java:2369)
at org.eclipse.ui.internal.Workbench.access$4(Workbench.java:2221)
at org.eclipse.ui.internal.Workbench$5.run(Workbench.java:500)
at org.eclipse.core.databinding.observable.Realm.runWithDefault(Realm.java:332)
at org.eclipse.ui.internal.Workbench.createAndRunWorkbench(Workbench.java:493)
at org.eclipse.ui.PlatformUI.createAndRunWorkbench(PlatformUI.java:149)
at org.eclipse.ui.internal.ide.application.IDEApplication.start(IDEApplication.java:113)
at org.eclipse.test.UITestApplication.runApplication(UITestApplication.java:138)
at org.eclipse.test.UITestApplication.run(UITestApplication.java:60)
at org.eclipse.test.UITestApplication.start(UITestApplication.java:210)
at org.eclipse.equinox.internal.app.EclipseAppHandle.run(EclipseAppHandle.java:194)
at
org.eclipse.core.runtime.internal.adaptor.EclipseAppLauncher.runApplication(EclipseAppLauncher.java:110)
at
org.eclipse.core.runtime.internal.adaptor.EclipseAppLauncher.start(EclipseAppLauncher.java:79)
at org.eclipse.core.runtime.adaptor.EclipseStarter.run(EclipseStarter.java:368)
at org.eclipse.core.runtime.adaptor.EclipseStarter.run(EclipseStarter.java:179)
at org.eclipse.equinox.launcher.Main.invokeFramework(Main.java:559)
at org.eclipse.equinox.launcher.Main.basicRun(Main.java:514)
at org.eclipse.equinox.launcher.Main.run(Main.java:1311)
at org.eclipse.equinox.launcher.Main.main(Main.java:1287)
at org.eclipse.core.launcher.Main.main(Main.java:34)
Caused by: java.lang.Exception: Could not find plugin
"org.hibernate.eclipse.console.test"
at org.eclipse.test.EclipseTestRunner.loadSuiteClass(EclipseTestRunner.java:304)
at org.eclipse.test.EclipseTestRunner.getTest(EclipseTestRunner.java:237)
FAILED: org.hibernate.eclipse.jdt.ui.test.JDTuiAllTests
Error Message:
java.lang.Exception: Could not find plugin "org.hibernate.eclipse.jdt.ui.test"
Stack Trace:
org.eclipse.test.EclipseTestRunner$TestFailedException: java.lang.Exception: Could not
find plugin "org.hibernate.eclipse.jdt.ui.test"
at org.eclipse.test.EclipseTestRunner.runFailed(EclipseTestRunner.java:288)
at org.eclipse.test.EclipseTestRunner.getTest(EclipseTestRunner.java:240)
at org.eclipse.test.EclipseTestRunner.<init>(EclipseTestRunner.java:220)
at org.eclipse.test.EclipseTestRunner.run(EclipseTestRunner.java:204)
at org.eclipse.test.UITestApplication$3.run(UITestApplication.java:195)
at org.eclipse.swt.widgets.RunnableLock.run(RunnableLock.java:35)
at org.eclipse.swt.widgets.Synchronizer.runAsyncMessages(Synchronizer.java:134)
at org.eclipse.swt.widgets.Display.runAsyncMessages(Display.java:3468)
at org.eclipse.swt.widgets.Display.readAndDispatch(Display.java:3115)
at org.eclipse.ui.internal.Workbench.runEventLoop(Workbench.java:2405)
at org.eclipse.ui.internal.Workbench.runUI(Workbench.java:2369)
at org.eclipse.ui.internal.Workbench.access$4(Workbench.java:2221)
at org.eclipse.ui.internal.Workbench$5.run(Workbench.java:500)
at org.eclipse.core.databinding.observable.Realm.runWithDefault(Realm.java:332)
at org.eclipse.ui.internal.Workbench.createAndRunWorkbench(Workbench.java:493)
at org.eclipse.ui.PlatformUI.createAndRunWorkbench(PlatformUI.java:149)
at org.eclipse.ui.internal.ide.application.IDEApplication.start(IDEApplication.java:113)
at org.eclipse.test.UITestApplication.runApplication(UITestApplication.java:138)
at org.eclipse.test.UITestApplication.run(UITestApplication.java:60)
at org.eclipse.test.UITestApplication.start(UITestApplication.java:210)
at org.eclipse.equinox.internal.app.EclipseAppHandle.run(EclipseAppHandle.java:194)
at
org.eclipse.core.runtime.internal.adaptor.EclipseAppLauncher.runApplication(EclipseAppLauncher.java:110)
at
org.eclipse.core.runtime.internal.adaptor.EclipseAppLauncher.start(EclipseAppLauncher.java:79)
at org.eclipse.core.runtime.adaptor.EclipseStarter.run(EclipseStarter.java:368)
at org.eclipse.core.runtime.adaptor.EclipseStarter.run(EclipseStarter.java:179)
at org.eclipse.equinox.launcher.Main.invokeFramework(Main.java:559)
at org.eclipse.equinox.launcher.Main.basicRun(Main.java:514)
at org.eclipse.equinox.launcher.Main.run(Main.java:1311)
at org.eclipse.equinox.launcher.Main.main(Main.java:1287)
at org.eclipse.core.launcher.Main.main(Main.java:34)
Caused by: java.lang.Exception: Could not find plugin
"org.hibernate.eclipse.jdt.ui.test"
at org.eclipse.test.EclipseTestRunner.loadSuiteClass(EclipseTestRunner.java:304)
at org.eclipse.test.EclipseTestRunner.getTest(EclipseTestRunner.java:237)
FAILED: org.jboss.ide.eclipse.archives.test.ArchivesTestSuite
Error Message:
java.lang.Exception: Could not find plugin
"org.jboss.ide.eclipse.archives.test"
Stack Trace:
org.eclipse.test.EclipseTestRunner$TestFailedException: java.lang.Exception: Could not
find plugin "org.jboss.ide.eclipse.archives.test"
at org.eclipse.test.EclipseTestRunner.runFailed(EclipseTestRunner.java:288)
at org.eclipse.test.EclipseTestRunner.getTest(EclipseTestRunner.java:240)
at org.eclipse.test.EclipseTestRunner.<init>(EclipseTestRunner.java:220)
at org.eclipse.test.EclipseTestRunner.run(EclipseTestRunner.java:204)
at org.eclipse.test.UITestApplication$3.run(UITestApplication.java:195)
at org.eclipse.swt.widgets.RunnableLock.run(RunnableLock.java:35)
at org.eclipse.swt.widgets.Synchronizer.runAsyncMessages(Synchronizer.java:134)
at org.eclipse.swt.widgets.Display.runAsyncMessages(Display.java:3468)
at org.eclipse.swt.widgets.Display.readAndDispatch(Display.java:3115)
at org.eclipse.ui.internal.Workbench.runEventLoop(Workbench.java:2405)
at org.eclipse.ui.internal.Workbench.runUI(Workbench.java:2369)
at org.eclipse.ui.internal.Workbench.access$4(Workbench.java:2221)
at org.eclipse.ui.internal.Workbench$5.run(Workbench.java:500)
at org.eclipse.core.databinding.observable.Realm.runWithDefault(Realm.java:332)
at org.eclipse.ui.internal.Workbench.createAndRunWorkbench(Workbench.java:493)
at org.eclipse.ui.PlatformUI.createAndRunWorkbench(PlatformUI.java:149)
at org.eclipse.ui.internal.ide.application.IDEApplication.start(IDEApplication.java:113)
at org.eclipse.test.UITestApplication.runApplication(UITestApplication.java:138)
at org.eclipse.test.UITestApplication.run(UITestApplication.java:60)
at org.eclipse.test.UITestApplication.start(UITestApplication.java:210)
at org.eclipse.equinox.internal.app.EclipseAppHandle.run(EclipseAppHandle.java:194)
at
org.eclipse.core.runtime.internal.adaptor.EclipseAppLauncher.runApplication(EclipseAppLauncher.java:110)
at
org.eclipse.core.runtime.internal.adaptor.EclipseAppLauncher.start(EclipseAppLauncher.java:79)
at org.eclipse.core.runtime.adaptor.EclipseStarter.run(EclipseStarter.java:368)
at org.eclipse.core.runtime.adaptor.EclipseStarter.run(EclipseStarter.java:179)
at org.eclipse.equinox.launcher.Main.invokeFramework(Main.java:559)
at org.eclipse.equinox.launcher.Main.basicRun(Main.java:514)
at org.eclipse.equinox.launcher.Main.run(Main.java:1311)
at org.eclipse.equinox.launcher.Main.main(Main.java:1287)
at org.eclipse.core.launcher.Main.main(Main.java:34)
Caused by: java.lang.Exception: Could not find plugin
"org.jboss.ide.eclipse.archives.test"
at org.eclipse.test.EclipseTestRunner.loadSuiteClass(EclipseTestRunner.java:304)
at org.eclipse.test.EclipseTestRunner.getTest(EclipseTestRunner.java:237)
FAILED: org.jboss.ide.eclipse.as.test.ASTestSuite
Error Message:
java.lang.Exception: Could not find plugin "org.jboss.ide.eclipse.as.test"
Stack Trace:
org.eclipse.test.EclipseTestRunner$TestFailedException: java.lang.Exception: Could not
find plugin "org.jboss.ide.eclipse.as.test"
at org.eclipse.test.EclipseTestRunner.runFailed(EclipseTestRunner.java:288)
at org.eclipse.test.EclipseTestRunner.getTest(EclipseTestRunner.java:240)
at org.eclipse.test.EclipseTestRunner.<init>(EclipseTestRunner.java:220)
at org.eclipse.test.EclipseTestRunner.run(EclipseTestRunner.java:204)
at org.eclipse.test.UITestApplication$3.run(UITestApplication.java:195)
at org.eclipse.swt.widgets.RunnableLock.run(RunnableLock.java:35)
at org.eclipse.swt.widgets.Synchronizer.runAsyncMessages(Synchronizer.java:134)
at org.eclipse.swt.widgets.Display.runAsyncMessages(Display.java:3468)
at org.eclipse.swt.widgets.Display.readAndDispatch(Display.java:3115)
at org.eclipse.ui.internal.Workbench.runEventLoop(Workbench.java:2405)
at org.eclipse.ui.internal.Workbench.runUI(Workbench.java:2369)
at org.eclipse.ui.internal.Workbench.access$4(Workbench.java:2221)
at org.eclipse.ui.internal.Workbench$5.run(Workbench.java:500)
at org.eclipse.core.databinding.observable.Realm.runWithDefault(Realm.java:332)
at org.eclipse.ui.internal.Workbench.createAndRunWorkbench(Workbench.java:493)
at org.eclipse.ui.PlatformUI.createAndRunWorkbench(PlatformUI.java:149)
at org.eclipse.ui.internal.ide.application.IDEApplication.start(IDEApplication.java:113)
at org.eclipse.test.UITestApplication.runApplication(UITestApplication.java:138)
at org.eclipse.test.UITestApplication.run(UITestApplication.java:60)
at org.eclipse.test.UITestApplication.start(UITestApplication.java:210)
at org.eclipse.equinox.internal.app.EclipseAppHandle.run(EclipseAppHandle.java:194)
at
org.eclipse.core.runtime.internal.adaptor.EclipseAppLauncher.runApplication(EclipseAppLauncher.java:110)
at
org.eclipse.core.runtime.internal.adaptor.EclipseAppLauncher.start(EclipseAppLauncher.java:79)
at org.eclipse.core.runtime.adaptor.EclipseStarter.run(EclipseStarter.java:368)
at org.eclipse.core.runtime.adaptor.EclipseStarter.run(EclipseStarter.java:179)
at org.eclipse.equinox.launcher.Main.invokeFramework(Main.java:559)
at org.eclipse.equinox.launcher.Main.basicRun(Main.java:514)
at org.eclipse.equinox.launcher.Main.run(Main.java:1311)
at org.eclipse.equinox.launcher.Main.main(Main.java:1287)
at org.eclipse.core.launcher.Main.main(Main.java:34)
Caused by: java.lang.Exception: Could not find plugin
"org.jboss.ide.eclipse.as.test"
at org.eclipse.test.EclipseTestRunner.loadSuiteClass(EclipseTestRunner.java:304)
at org.eclipse.test.EclipseTestRunner.getTest(EclipseTestRunner.java:237)
FAILED: org.jboss.ide.eclipse.as.ui.test.AllAsUiTests
Error Message:
java.lang.Exception: Could not find plugin "org.jboss.ide.eclipse.as.ui.test"
Stack Trace:
org.eclipse.test.EclipseTestRunner$TestFailedException: java.lang.Exception: Could not
find plugin "org.jboss.ide.eclipse.as.ui.test"
at org.eclipse.test.EclipseTestRunner.runFailed(EclipseTestRunner.java:288)
at org.eclipse.test.EclipseTestRunner.getTest(EclipseTestRunner.java:240)
at org.eclipse.test.EclipseTestRunner.<init>(EclipseTestRunner.java:220)
at org.eclipse.test.EclipseTestRunner.run(EclipseTestRunner.java:204)
at org.eclipse.test.UITestApplication$3.run(UITestApplication.java:195)
at org.eclipse.swt.widgets.RunnableLock.run(RunnableLock.java:35)
at org.eclipse.swt.widgets.Synchronizer.runAsyncMessages(Synchronizer.java:134)
at org.eclipse.swt.widgets.Display.runAsyncMessages(Display.java:3468)
at org.eclipse.swt.widgets.Display.readAndDispatch(Display.java:3115)
at org.eclipse.ui.internal.Workbench.runEventLoop(Workbench.java:2405)
at org.eclipse.ui.internal.Workbench.runUI(Workbench.java:2369)
at org.eclipse.ui.internal.Workbench.access$4(Workbench.java:2221)
at org.eclipse.ui.internal.Workbench$5.run(Workbench.java:500)
at org.eclipse.core.databinding.observable.Realm.runWithDefault(Realm.java:332)
at org.eclipse.ui.internal.Workbench.createAndRunWorkbench(Workbench.java:493)
at org.eclipse.ui.PlatformUI.createAndRunWorkbench(PlatformUI.java:149)
at org.eclipse.ui.internal.ide.application.IDEApplication.start(IDEApplication.java:113)
at org.eclipse.test.UITestApplication.runApplication(UITestApplication.java:138)
at org.eclipse.test.UITestApplication.run(UITestApplication.java:60)
at org.eclipse.test.UITestApplication.start(UITestApplication.java:210)
at org.eclipse.equinox.internal.app.EclipseAppHandle.run(EclipseAppHandle.java:194)
at
org.eclipse.core.runtime.internal.adaptor.EclipseAppLauncher.runApplication(EclipseAppLauncher.java:110)
at
org.eclipse.core.runtime.internal.adaptor.EclipseAppLauncher.start(EclipseAppLauncher.java:79)
at org.eclipse.core.runtime.adaptor.EclipseStarter.run(EclipseStarter.java:368)
at org.eclipse.core.runtime.adaptor.EclipseStarter.run(EclipseStarter.java:179)
at org.eclipse.equinox.launcher.Main.invokeFramework(Main.java:559)
at org.eclipse.equinox.launcher.Main.basicRun(Main.java:514)
at org.eclipse.equinox.launcher.Main.run(Main.java:1311)
at org.eclipse.equinox.launcher.Main.main(Main.java:1287)
at org.eclipse.core.launcher.Main.main(Main.java:34)
Caused by: java.lang.Exception: Could not find plugin
"org.jboss.ide.eclipse.as.ui.test"
at org.eclipse.test.EclipseTestRunner.loadSuiteClass(EclipseTestRunner.java:304)
at org.eclipse.test.EclipseTestRunner.getTest(EclipseTestRunner.java:237)
FAILED: org.jboss.tools.common.el.core.test.CommonELAllTests
Error Message:
java.lang.Exception: Could not find plugin
"org.jboss.tools.common.el.core.test"
Stack Trace:
org.eclipse.test.EclipseTestRunner$TestFailedException: java.lang.Exception: Could not
find plugin "org.jboss.tools.common.el.core.test"
at org.eclipse.test.EclipseTestRunner.runFailed(EclipseTestRunner.java:288)
at org.eclipse.test.EclipseTestRunner.getTest(EclipseTestRunner.java:240)
at org.eclipse.test.EclipseTestRunner.<init>(EclipseTestRunner.java:220)
at org.eclipse.test.EclipseTestRunner.run(EclipseTestRunner.java:204)
at org.eclipse.test.CoreTestApplication.runTests(CoreTestApplication.java:35)
at org.eclipse.test.CoreTestApplication.run(CoreTestApplication.java:31)
at
org.eclipse.equinox.internal.app.EclipseAppContainer.callMethodWithException(EclipseAppContainer.java:574)
at org.eclipse.equinox.internal.app.EclipseAppHandle.run(EclipseAppHandle.java:196)
at
org.eclipse.equinox.internal.app.MainApplicationLauncher.run(MainApplicationLauncher.java:32)
at
org.eclipse.core.runtime.internal.adaptor.EclipseAppLauncher.runApplication(EclipseAppLauncher.java:110)
at
org.eclipse.core.runtime.internal.adaptor.EclipseAppLauncher.start(EclipseAppLauncher.java:79)
at org.eclipse.core.runtime.adaptor.EclipseStarter.run(EclipseStarter.java:368)
at org.eclipse.core.runtime.adaptor.EclipseStarter.run(EclipseStarter.java:179)
at org.eclipse.equinox.launcher.Main.invokeFramework(Main.java:559)
at org.eclipse.equinox.launcher.Main.basicRun(Main.java:514)
at org.eclipse.equinox.launcher.Main.run(Main.java:1311)
at org.eclipse.equinox.launcher.Main.main(Main.java:1287)
at org.eclipse.core.launcher.Main.main(Main.java:34)
Caused by: java.lang.Exception: Could not find plugin
"org.jboss.tools.common.el.core.test"
at org.eclipse.test.EclipseTestRunner.loadSuiteClass(EclipseTestRunner.java:304)
at org.eclipse.test.EclipseTestRunner.getTest(EclipseTestRunner.java:237)
FAILED: org.jboss.tools.common.kb.test.CommonKbAllTests
Error Message:
java.lang.Exception: Could not find plugin "org.jboss.tools.common.kb.test"
Stack Trace:
org.eclipse.test.EclipseTestRunner$TestFailedException: java.lang.Exception: Could not
find plugin "org.jboss.tools.common.kb.test"
at org.eclipse.test.EclipseTestRunner.runFailed(EclipseTestRunner.java:288)
at org.eclipse.test.EclipseTestRunner.getTest(EclipseTestRunner.java:240)
at org.eclipse.test.EclipseTestRunner.<init>(EclipseTestRunner.java:220)
at org.eclipse.test.EclipseTestRunner.run(EclipseTestRunner.java:204)
at org.eclipse.test.CoreTestApplication.runTests(CoreTestApplication.java:35)
at org.eclipse.test.CoreTestApplication.run(CoreTestApplication.java:31)
at
org.eclipse.equinox.internal.app.EclipseAppContainer.callMethodWithException(EclipseAppContainer.java:574)
at org.eclipse.equinox.internal.app.EclipseAppHandle.run(EclipseAppHandle.java:196)
at
org.eclipse.core.runtime.internal.adaptor.EclipseAppLauncher.runApplication(EclipseAppLauncher.java:110)
at
org.eclipse.core.runtime.internal.adaptor.EclipseAppLauncher.start(EclipseAppLauncher.java:79)
at org.eclipse.core.runtime.adaptor.EclipseStarter.run(EclipseStarter.java:368)
at org.eclipse.core.runtime.adaptor.EclipseStarter.run(EclipseStarter.java:179)
at org.eclipse.equinox.launcher.Main.invokeFramework(Main.java:559)
at org.eclipse.equinox.launcher.Main.basicRun(Main.java:514)
at org.eclipse.equinox.launcher.Main.run(Main.java:1311)
at org.eclipse.equinox.launcher.Main.main(Main.java:1287)
at org.eclipse.core.launcher.Main.main(Main.java:34)
Caused by: java.lang.Exception: Could not find plugin
"org.jboss.tools.common.kb.test"
at org.eclipse.test.EclipseTestRunner.loadSuiteClass(EclipseTestRunner.java:304)
at org.eclipse.test.EclipseTestRunner.getTest(EclipseTestRunner.java:237)
FAILED: org.jboss.tools.common.model.test.CommonModelAllTests
Error Message:
java.lang.Exception: Could not find plugin "org.jboss.tools.common.model.test"
Stack Trace:
org.eclipse.test.EclipseTestRunner$TestFailedException: java.lang.Exception: Could not
find plugin "org.jboss.tools.common.model.test"
at org.eclipse.test.EclipseTestRunner.runFailed(EclipseTestRunner.java:288)
at org.eclipse.test.EclipseTestRunner.getTest(EclipseTestRunner.java:240)
at org.eclipse.test.EclipseTestRunner.<init>(EclipseTestRunner.java:220)
at org.eclipse.test.EclipseTestRunner.run(EclipseTestRunner.java:204)
at org.eclipse.test.UITestApplication$3.run(UITestApplication.java:195)
at org.eclipse.swt.widgets.RunnableLock.run(RunnableLock.java:35)
at org.eclipse.swt.widgets.Synchronizer.runAsyncMessages(Synchronizer.java:134)
at org.eclipse.swt.widgets.Display.runAsyncMessages(Display.java:3468)
at org.eclipse.swt.widgets.Display.readAndDispatch(Display.java:3115)
at org.eclipse.ui.internal.Workbench.runEventLoop(Workbench.java:2405)
at org.eclipse.ui.internal.Workbench.runUI(Workbench.java:2369)
at org.eclipse.ui.internal.Workbench.access$4(Workbench.java:2221)
at org.eclipse.ui.internal.Workbench$5.run(Workbench.java:500)
at org.eclipse.core.databinding.observable.Realm.runWithDefault(Realm.java:332)
at org.eclipse.ui.internal.Workbench.createAndRunWorkbench(Workbench.java:493)
at org.eclipse.ui.PlatformUI.createAndRunWorkbench(PlatformUI.java:149)
at org.eclipse.ui.internal.ide.application.IDEApplication.start(IDEApplication.java:113)
at org.eclipse.test.UITestApplication.runApplication(UITestApplication.java:138)
at org.eclipse.test.UITestApplication.run(UITestApplication.java:60)
at org.eclipse.test.UITestApplication.start(UITestApplication.java:210)
at org.eclipse.equinox.internal.app.EclipseAppHandle.run(EclipseAppHandle.java:194)
at
org.eclipse.core.runtime.internal.adaptor.EclipseAppLauncher.runApplication(EclipseAppLauncher.java:110)
at
org.eclipse.core.runtime.internal.adaptor.EclipseAppLauncher.start(EclipseAppLauncher.java:79)
at org.eclipse.core.runtime.adaptor.EclipseStarter.run(EclipseStarter.java:368)
at org.eclipse.core.runtime.adaptor.EclipseStarter.run(EclipseStarter.java:179)
at org.eclipse.equinox.launcher.Main.invokeFramework(Main.java:559)
at org.eclipse.equinox.launcher.Main.basicRun(Main.java:514)
at org.eclipse.equinox.launcher.Main.run(Main.java:1311)
at org.eclipse.equinox.launcher.Main.main(Main.java:1287)
at org.eclipse.core.launcher.Main.main(Main.java:34)
Caused by: java.lang.Exception: Could not find plugin
"org.jboss.tools.common.model.test"
at org.eclipse.test.EclipseTestRunner.loadSuiteClass(EclipseTestRunner.java:304)
at org.eclipse.test.EclipseTestRunner.getTest(EclipseTestRunner.java:237)
FAILED: org.jboss.tools.common.model.ui.test.ModelUiAllTests
Error Message:
java.lang.Exception: Could not find plugin
"org.jboss.tools.common.model.ui.test"
Stack Trace:
org.eclipse.test.EclipseTestRunner$TestFailedException: java.lang.Exception: Could not
find plugin "org.jboss.tools.common.model.ui.test"
at org.eclipse.test.EclipseTestRunner.runFailed(EclipseTestRunner.java:288)
at org.eclipse.test.EclipseTestRunner.getTest(EclipseTestRunner.java:240)
at org.eclipse.test.EclipseTestRunner.<init>(EclipseTestRunner.java:220)
at org.eclipse.test.EclipseTestRunner.run(EclipseTestRunner.java:204)
at org.eclipse.test.UITestApplication$3.run(UITestApplication.java:195)
at org.eclipse.swt.widgets.RunnableLock.run(RunnableLock.java:35)
at org.eclipse.swt.widgets.Synchronizer.runAsyncMessages(Synchronizer.java:134)
at org.eclipse.swt.widgets.Display.runAsyncMessages(Display.java:3468)
at org.eclipse.swt.widgets.Display.readAndDispatch(Display.java:3115)
at org.eclipse.ui.internal.Workbench.runEventLoop(Workbench.java:2405)
at org.eclipse.ui.internal.Workbench.runUI(Workbench.java:2369)
at org.eclipse.ui.internal.Workbench.access$4(Workbench.java:2221)
at org.eclipse.ui.internal.Workbench$5.run(Workbench.java:500)
at org.eclipse.core.databinding.observable.Realm.runWithDefault(Realm.java:332)
at org.eclipse.ui.internal.Workbench.createAndRunWorkbench(Workbench.java:493)
at org.eclipse.ui.PlatformUI.createAndRunWorkbench(PlatformUI.java:149)
at org.eclipse.ui.internal.ide.application.IDEApplication.start(IDEApplication.java:113)
at org.eclipse.test.UITestApplication.runApplication(UITestApplication.java:138)
at org.eclipse.test.UITestApplication.run(UITestApplication.java:60)
at org.eclipse.test.UITestApplication.start(UITestApplication.java:210)
at org.eclipse.equinox.internal.app.EclipseAppHandle.run(EclipseAppHandle.java:194)
at
org.eclipse.core.runtime.internal.adaptor.EclipseAppLauncher.runApplication(EclipseAppLauncher.java:110)
at
org.eclipse.core.runtime.internal.adaptor.EclipseAppLauncher.start(EclipseAppLauncher.java:79)
at org.eclipse.core.runtime.adaptor.EclipseStarter.run(EclipseStarter.java:368)
at org.eclipse.core.runtime.adaptor.EclipseStarter.run(EclipseStarter.java:179)
at org.eclipse.equinox.launcher.Main.invokeFramework(Main.java:559)
at org.eclipse.equinox.launcher.Main.basicRun(Main.java:514)
at org.eclipse.equinox.launcher.Main.run(Main.java:1311)
at org.eclipse.equinox.launcher.Main.main(Main.java:1287)
at org.eclipse.core.launcher.Main.main(Main.java:34)
Caused by: java.lang.Exception: Could not find plugin
"org.jboss.tools.common.model.ui.test"
at org.eclipse.test.EclipseTestRunner.loadSuiteClass(EclipseTestRunner.java:304)
at org.eclipse.test.EclipseTestRunner.getTest(EclipseTestRunner.java:237)
FAILED: org.jboss.tools.common.test.CommonAllTests
Error Message:
java.lang.Exception: Could not find plugin "org.jboss.tools.common.test"
Stack Trace:
org.eclipse.test.EclipseTestRunner$TestFailedException: java.lang.Exception: Could not
find plugin "org.jboss.tools.common.test"
at org.eclipse.test.EclipseTestRunner.runFailed(EclipseTestRunner.java:288)
at org.eclipse.test.EclipseTestRunner.getTest(EclipseTestRunner.java:240)
at org.eclipse.test.EclipseTestRunner.<init>(EclipseTestRunner.java:220)
at org.eclipse.test.EclipseTestRunner.run(EclipseTestRunner.java:204)
at org.eclipse.test.CoreTestApplication.runTests(CoreTestApplication.java:35)
at org.eclipse.test.CoreTestApplication.run(CoreTestApplication.java:31)
at
org.eclipse.equinox.internal.app.EclipseAppContainer.callMethodWithException(EclipseAppContainer.java:574)
at org.eclipse.equinox.internal.app.EclipseAppHandle.run(EclipseAppHandle.java:196)
at
org.eclipse.core.runtime.internal.adaptor.EclipseAppLauncher.runApplication(EclipseAppLauncher.java:110)
at
org.eclipse.core.runtime.internal.adaptor.EclipseAppLauncher.start(EclipseAppLauncher.java:79)
at org.eclipse.core.runtime.adaptor.EclipseStarter.run(EclipseStarter.java:368)
at org.eclipse.core.runtime.adaptor.EclipseStarter.run(EclipseStarter.java:179)
at org.eclipse.equinox.launcher.Main.invokeFramework(Main.java:559)
at org.eclipse.equinox.launcher.Main.basicRun(Main.java:514)
at org.eclipse.equinox.launcher.Main.run(Main.java:1311)
at org.eclipse.equinox.launcher.Main.main(Main.java:1287)
at org.eclipse.core.launcher.Main.main(Main.java:34)
Caused by: java.lang.Exception: Could not find plugin
"org.jboss.tools.common.test"
at org.eclipse.test.EclipseTestRunner.loadSuiteClass(EclipseTestRunner.java:304)
at org.eclipse.test.EclipseTestRunner.getTest(EclipseTestRunner.java:237)
FAILED: org.jboss.tools.common.text.ext.test.CommonExtAllTests
Error Message:
java.lang.Exception: Could not find plugin
"org.jboss.tools.common.text.ext.test"
Stack Trace:
org.eclipse.test.EclipseTestRunner$TestFailedException: java.lang.Exception: Could not
find plugin "org.jboss.tools.common.text.ext.test"
at org.eclipse.test.EclipseTestRunner.runFailed(EclipseTestRunner.java:288)
at org.eclipse.test.EclipseTestRunner.getTest(EclipseTestRunner.java:240)
at org.eclipse.test.EclipseTestRunner.<init>(EclipseTestRunner.java:220)
at org.eclipse.test.EclipseTestRunner.run(EclipseTestRunner.java:204)
at org.eclipse.test.UITestApplication$3.run(UITestApplication.java:195)
at org.eclipse.swt.widgets.RunnableLock.run(RunnableLock.java:35)
at org.eclipse.swt.widgets.Synchronizer.runAsyncMessages(Synchronizer.java:134)
at org.eclipse.swt.widgets.Display.runAsyncMessages(Display.java:3468)
at org.eclipse.swt.widgets.Display.readAndDispatch(Display.java:3115)
at org.eclipse.ui.internal.Workbench.runEventLoop(Workbench.java:2405)
at org.eclipse.ui.internal.Workbench.runUI(Workbench.java:2369)
at org.eclipse.ui.internal.Workbench.access$4(Workbench.java:2221)
at org.eclipse.ui.internal.Workbench$5.run(Workbench.java:500)
at org.eclipse.core.databinding.observable.Realm.runWithDefault(Realm.java:332)
at org.eclipse.ui.internal.Workbench.createAndRunWorkbench(Workbench.java:493)
at org.eclipse.ui.PlatformUI.createAndRunWorkbench(PlatformUI.java:149)
at org.eclipse.ui.internal.ide.application.IDEApplication.start(IDEApplication.java:113)
at org.eclipse.test.UITestApplication.runApplication(UITestApplication.java:138)
at org.eclipse.test.UITestApplication.run(UITestApplication.java:60)
at org.eclipse.test.UITestApplication.start(UITestApplication.java:210)
at org.eclipse.equinox.internal.app.EclipseAppHandle.run(EclipseAppHandle.java:194)
at
org.eclipse.core.runtime.internal.adaptor.EclipseAppLauncher.runApplication(EclipseAppLauncher.java:110)
at
org.eclipse.core.runtime.internal.adaptor.EclipseAppLauncher.start(EclipseAppLauncher.java:79)
at org.eclipse.core.runtime.adaptor.EclipseStarter.run(EclipseStarter.java:368)
at org.eclipse.core.runtime.adaptor.EclipseStarter.run(EclipseStarter.java:179)
at org.eclipse.equinox.launcher.Main.invokeFramework(Main.java:559)
at org.eclipse.equinox.launcher.Main.basicRun(Main.java:514)
at org.eclipse.equinox.launcher.Main.run(Main.java:1311)
at org.eclipse.equinox.launcher.Main.main(Main.java:1287)
at org.eclipse.core.launcher.Main.main(Main.java:34)
Caused by: java.lang.Exception: Could not find plugin
"org.jboss.tools.common.text.ext.test"
at org.eclipse.test.EclipseTestRunner.loadSuiteClass(EclipseTestRunner.java:304)
at org.eclipse.test.EclipseTestRunner.getTest(EclipseTestRunner.java:237)
FAILED: org.jboss.tools.common.verification.test.CommonVerificationAllTests
Error Message:
java.lang.Exception: Could not find plugin
"org.jboss.tools.common.verification.test"
Stack Trace:
org.eclipse.test.EclipseTestRunner$TestFailedException: java.lang.Exception: Could not
find plugin "org.jboss.tools.common.verification.test"
at org.eclipse.test.EclipseTestRunner.runFailed(EclipseTestRunner.java:288)
at org.eclipse.test.EclipseTestRunner.getTest(EclipseTestRunner.java:240)
at org.eclipse.test.EclipseTestRunner.<init>(EclipseTestRunner.java:220)
at org.eclipse.test.EclipseTestRunner.run(EclipseTestRunner.java:204)
at org.eclipse.test.UITestApplication$3.run(UITestApplication.java:195)
at org.eclipse.swt.widgets.RunnableLock.run(RunnableLock.java:35)
at org.eclipse.swt.widgets.Synchronizer.runAsyncMessages(Synchronizer.java:134)
at org.eclipse.swt.widgets.Display.runAsyncMessages(Display.java:3468)
at org.eclipse.swt.widgets.Display.readAndDispatch(Display.java:3115)
at org.eclipse.ui.internal.Workbench.runEventLoop(Workbench.java:2405)
at org.eclipse.ui.internal.Workbench.runUI(Workbench.java:2369)
at org.eclipse.ui.internal.Workbench.access$4(Workbench.java:2221)
at org.eclipse.ui.internal.Workbench$5.run(Workbench.java:500)
at org.eclipse.core.databinding.observable.Realm.runWithDefault(Realm.java:332)
at org.eclipse.ui.internal.Workbench.createAndRunWorkbench(Workbench.java:493)
at org.eclipse.ui.PlatformUI.createAndRunWorkbench(PlatformUI.java:149)
at org.eclipse.ui.internal.ide.application.IDEApplication.start(IDEApplication.java:113)
at org.eclipse.test.UITestApplication.runApplication(UITestApplication.java:138)
at org.eclipse.test.UITestApplication.run(UITestApplication.java:60)
at org.eclipse.test.UITestApplication.start(UITestApplication.java:210)
at org.eclipse.equinox.internal.app.EclipseAppHandle.run(EclipseAppHandle.java:194)
at
org.eclipse.core.runtime.internal.adaptor.EclipseAppLauncher.runApplication(EclipseAppLauncher.java:110)
at
org.eclipse.core.runtime.internal.adaptor.EclipseAppLauncher.start(EclipseAppLauncher.java:79)
at org.eclipse.core.runtime.adaptor.EclipseStarter.run(EclipseStarter.java:368)
at org.eclipse.core.runtime.adaptor.EclipseStarter.run(EclipseStarter.java:179)
at org.eclipse.equinox.launcher.Main.invokeFramework(Main.java:559)
at org.eclipse.equinox.launcher.Main.basicRun(Main.java:514)
at org.eclipse.equinox.launcher.Main.run(Main.java:1311)
at org.eclipse.equinox.launcher.Main.main(Main.java:1287)
at org.eclipse.core.launcher.Main.main(Main.java:34)
Caused by: java.lang.Exception: Could not find plugin
"org.jboss.tools.common.verification.test"
at org.eclipse.test.EclipseTestRunner.loadSuiteClass(EclipseTestRunner.java:304)
at org.eclipse.test.EclipseTestRunner.getTest(EclipseTestRunner.java:237)
FAILED: org.jboss.tools.common.verification.ui.test.VerificationUiAllTests
Error Message:
java.lang.Exception: Could not find plugin
"org.jboss.tools.common.verification.ui.test"
Stack Trace:
org.eclipse.test.EclipseTestRunner$TestFailedException: java.lang.Exception: Could not
find plugin "org.jboss.tools.common.verification.ui.test"
at org.eclipse.test.EclipseTestRunner.runFailed(EclipseTestRunner.java:288)
at org.eclipse.test.EclipseTestRunner.getTest(EclipseTestRunner.java:240)
at org.eclipse.test.EclipseTestRunner.<init>(EclipseTestRunner.java:220)
at org.eclipse.test.EclipseTestRunner.run(EclipseTestRunner.java:204)
at org.eclipse.test.UITestApplication$3.run(UITestApplication.java:195)
at org.eclipse.swt.widgets.RunnableLock.run(RunnableLock.java:35)
at org.eclipse.swt.widgets.Synchronizer.runAsyncMessages(Synchronizer.java:134)
at org.eclipse.swt.widgets.Display.runAsyncMessages(Display.java:3468)
at org.eclipse.swt.widgets.Display.readAndDispatch(Display.java:3115)
at org.eclipse.ui.internal.Workbench.runEventLoop(Workbench.java:2405)
at org.eclipse.ui.internal.Workbench.runUI(Workbench.java:2369)
at org.eclipse.ui.internal.Workbench.access$4(Workbench.java:2221)
at org.eclipse.ui.internal.Workbench$5.run(Workbench.java:500)
at org.eclipse.core.databinding.observable.Realm.runWithDefault(Realm.java:332)
at org.eclipse.ui.internal.Workbench.createAndRunWorkbench(Workbench.java:493)
at org.eclipse.ui.PlatformUI.createAndRunWorkbench(PlatformUI.java:149)
at org.eclipse.ui.internal.ide.application.IDEApplication.start(IDEApplication.java:113)
at org.eclipse.test.UITestApplication.runApplication(UITestApplication.java:138)
at org.eclipse.test.UITestApplication.run(UITestApplication.java:60)
at org.eclipse.test.UITestApplication.start(UITestApplication.java:210)
at org.eclipse.equinox.internal.app.EclipseAppHandle.run(EclipseAppHandle.java:194)
at
org.eclipse.core.runtime.internal.adaptor.EclipseAppLauncher.runApplication(EclipseAppLauncher.java:110)
at
org.eclipse.core.runtime.internal.adaptor.EclipseAppLauncher.start(EclipseAppLauncher.java:79)
at org.eclipse.core.runtime.adaptor.EclipseStarter.run(EclipseStarter.java:368)
at org.eclipse.core.runtime.adaptor.EclipseStarter.run(EclipseStarter.java:179)
at org.eclipse.equinox.launcher.Main.invokeFramework(Main.java:559)
at org.eclipse.equinox.launcher.Main.basicRun(Main.java:514)
at org.eclipse.equinox.launcher.Main.run(Main.java:1311)
at org.eclipse.equinox.launcher.Main.main(Main.java:1287)
at org.eclipse.core.launcher.Main.main(Main.java:34)
Caused by: java.lang.Exception: Could not find plugin
"org.jboss.tools.common.verification.ui.test"
at org.eclipse.test.EclipseTestRunner.loadSuiteClass(EclipseTestRunner.java:304)
at org.eclipse.test.EclipseTestRunner.getTest(EclipseTestRunner.java:237)
FAILED: org.jboss.tools.hibernate.ui.test.HibernateUiTestSuite
Error Message:
java.lang.Exception: Could not find plugin "org.jboss.tools.hibernate.ui.test"
Stack Trace:
org.eclipse.test.EclipseTestRunner$TestFailedException: java.lang.Exception: Could not
find plugin "org.jboss.tools.hibernate.ui.test"
at org.eclipse.test.EclipseTestRunner.runFailed(EclipseTestRunner.java:288)
at org.eclipse.test.EclipseTestRunner.getTest(EclipseTestRunner.java:240)
at org.eclipse.test.EclipseTestRunner.<init>(EclipseTestRunner.java:220)
at org.eclipse.test.EclipseTestRunner.run(EclipseTestRunner.java:204)
at org.eclipse.test.UITestApplication$3.run(UITestApplication.java:195)
at org.eclipse.swt.widgets.RunnableLock.run(RunnableLock.java:35)
at org.eclipse.swt.widgets.Synchronizer.runAsyncMessages(Synchronizer.java:134)
at org.eclipse.swt.widgets.Display.runAsyncMessages(Display.java:3468)
at org.eclipse.swt.widgets.Display.readAndDispatch(Display.java:3115)
at org.eclipse.ui.internal.Workbench.runEventLoop(Workbench.java:2405)
at org.eclipse.ui.internal.Workbench.runUI(Workbench.java:2369)
at org.eclipse.ui.internal.Workbench.access$4(Workbench.java:2221)
at org.eclipse.ui.internal.Workbench$5.run(Workbench.java:500)
at org.eclipse.core.databinding.observable.Realm.runWithDefault(Realm.java:332)
at org.eclipse.ui.internal.Workbench.createAndRunWorkbench(Workbench.java:493)
at org.eclipse.ui.PlatformUI.createAndRunWorkbench(PlatformUI.java:149)
at org.eclipse.ui.internal.ide.application.IDEApplication.start(IDEApplication.java:113)
at org.eclipse.test.UITestApplication.runApplication(UITestApplication.java:138)
at org.eclipse.test.UITestApplication.run(UITestApplication.java:60)
at org.eclipse.test.UITestApplication.start(UITestApplication.java:210)
at org.eclipse.equinox.internal.app.EclipseAppHandle.run(EclipseAppHandle.java:194)
at
org.eclipse.core.runtime.internal.adaptor.EclipseAppLauncher.runApplication(EclipseAppLauncher.java:110)
at
org.eclipse.core.runtime.internal.adaptor.EclipseAppLauncher.start(EclipseAppLauncher.java:79)
at org.eclipse.core.runtime.adaptor.EclipseStarter.run(EclipseStarter.java:368)
at org.eclipse.core.runtime.adaptor.EclipseStarter.run(EclipseStarter.java:179)
at org.eclipse.equinox.launcher.Main.invokeFramework(Main.java:559)
at org.eclipse.equinox.launcher.Main.basicRun(Main.java:514)
at org.eclipse.equinox.launcher.Main.run(Main.java:1311)
at org.eclipse.equinox.launcher.Main.main(Main.java:1287)
at org.eclipse.core.launcher.Main.main(Main.java:34)
Caused by: java.lang.Exception: Could not find plugin
"org.jboss.tools.hibernate.ui.test"
at org.eclipse.test.EclipseTestRunner.loadSuiteClass(EclipseTestRunner.java:304)
at org.eclipse.test.EclipseTestRunner.getTest(EclipseTestRunner.java:237)
FAILED: org.jboss.tools.jbpm.convert.JBPMConvertAllTests
Error Message:
java.lang.Exception: Could not find plugin "org.jboss.tools.jbpm.convert.test"
Stack Trace:
org.eclipse.test.EclipseTestRunner$TestFailedException: java.lang.Exception: Could not
find plugin "org.jboss.tools.jbpm.convert.test"
at org.eclipse.test.EclipseTestRunner.runFailed(EclipseTestRunner.java:288)
at org.eclipse.test.EclipseTestRunner.getTest(EclipseTestRunner.java:240)
at org.eclipse.test.EclipseTestRunner.<init>(EclipseTestRunner.java:220)
at org.eclipse.test.EclipseTestRunner.run(EclipseTestRunner.java:204)
at org.eclipse.test.UITestApplication$3.run(UITestApplication.java:195)
at org.eclipse.swt.widgets.RunnableLock.run(RunnableLock.java:35)
at org.eclipse.swt.widgets.Synchronizer.runAsyncMessages(Synchronizer.java:134)
at org.eclipse.swt.widgets.Display.runAsyncMessages(Display.java:3468)
at org.eclipse.swt.widgets.Display.readAndDispatch(Display.java:3115)
at org.eclipse.ui.internal.Workbench.runEventLoop(Workbench.java:2405)
at org.eclipse.ui.internal.Workbench.runUI(Workbench.java:2369)
at org.eclipse.ui.internal.Workbench.access$4(Workbench.java:2221)
at org.eclipse.ui.internal.Workbench$5.run(Workbench.java:500)
at org.eclipse.core.databinding.observable.Realm.runWithDefault(Realm.java:332)
at org.eclipse.ui.internal.Workbench.createAndRunWorkbench(Workbench.java:493)
at org.eclipse.ui.PlatformUI.createAndRunWorkbench(PlatformUI.java:149)
at org.eclipse.ui.internal.ide.application.IDEApplication.start(IDEApplication.java:113)
at org.eclipse.test.UITestApplication.runApplication(UITestApplication.java:138)
at org.eclipse.test.UITestApplication.run(UITestApplication.java:60)
at org.eclipse.test.UITestApplication.start(UITestApplication.java:210)
at org.eclipse.equinox.internal.app.EclipseAppHandle.run(EclipseAppHandle.java:194)
at
org.eclipse.core.runtime.internal.adaptor.EclipseAppLauncher.runApplication(EclipseAppLauncher.java:110)
at
org.eclipse.core.runtime.internal.adaptor.EclipseAppLauncher.start(EclipseAppLauncher.java:79)
at org.eclipse.core.runtime.adaptor.EclipseStarter.run(EclipseStarter.java:368)
at org.eclipse.core.runtime.adaptor.EclipseStarter.run(EclipseStarter.java:179)
at org.eclipse.equinox.launcher.Main.invokeFramework(Main.java:559)
at org.eclipse.equinox.launcher.Main.basicRun(Main.java:514)
at org.eclipse.equinox.launcher.Main.run(Main.java:1311)
at org.eclipse.equinox.launcher.Main.main(Main.java:1287)
at org.eclipse.core.launcher.Main.main(Main.java:34)
Caused by: java.lang.Exception: Could not find plugin
"org.jboss.tools.jbpm.convert.test"
at org.eclipse.test.EclipseTestRunner.loadSuiteClass(EclipseTestRunner.java:304)
at org.eclipse.test.EclipseTestRunner.getTest(EclipseTestRunner.java:237)
FAILED: org.jboss.tools.jmx.core.JMXCoreAllTests
Error Message:
java.lang.Exception: Could not find plugin "org.jboss.tools.jmx.core.test"
Stack Trace:
org.eclipse.test.EclipseTestRunner$TestFailedException: java.lang.Exception: Could not
find plugin "org.jboss.tools.jmx.core.test"
at org.eclipse.test.EclipseTestRunner.runFailed(EclipseTestRunner.java:288)
at org.eclipse.test.EclipseTestRunner.getTest(EclipseTestRunner.java:240)
at org.eclipse.test.EclipseTestRunner.<init>(EclipseTestRunner.java:220)
at org.eclipse.test.EclipseTestRunner.run(EclipseTestRunner.java:204)
at org.eclipse.test.UITestApplication$3.run(UITestApplication.java:195)
at org.eclipse.swt.widgets.RunnableLock.run(RunnableLock.java:35)
at org.eclipse.swt.widgets.Synchronizer.runAsyncMessages(Synchronizer.java:134)
at org.eclipse.swt.widgets.Display.runAsyncMessages(Display.java:3468)
at org.eclipse.swt.widgets.Display.readAndDispatch(Display.java:3115)
at org.eclipse.ui.internal.Workbench.runEventLoop(Workbench.java:2405)
at org.eclipse.ui.internal.Workbench.runUI(Workbench.java:2369)
at org.eclipse.ui.internal.Workbench.access$4(Workbench.java:2221)
at org.eclipse.ui.internal.Workbench$5.run(Workbench.java:500)
at org.eclipse.core.databinding.observable.Realm.runWithDefault(Realm.java:332)
at org.eclipse.ui.internal.Workbench.createAndRunWorkbench(Workbench.java:493)
at org.eclipse.ui.PlatformUI.createAndRunWorkbench(PlatformUI.java:149)
at org.eclipse.ui.internal.ide.application.IDEApplication.start(IDEApplication.java:113)
at org.eclipse.test.UITestApplication.runApplication(UITestApplication.java:138)
at org.eclipse.test.UITestApplication.run(UITestApplication.java:60)
at org.eclipse.test.UITestApplication.start(UITestApplication.java:210)
at org.eclipse.equinox.internal.app.EclipseAppHandle.run(EclipseAppHandle.java:194)
at
org.eclipse.core.runtime.internal.adaptor.EclipseAppLauncher.runApplication(EclipseAppLauncher.java:110)
at
org.eclipse.core.runtime.internal.adaptor.EclipseAppLauncher.start(EclipseAppLauncher.java:79)
at org.eclipse.core.runtime.adaptor.EclipseStarter.run(EclipseStarter.java:368)
at org.eclipse.core.runtime.adaptor.EclipseStarter.run(EclipseStarter.java:179)
at org.eclipse.equinox.launcher.Main.invokeFramework(Main.java:559)
at org.eclipse.equinox.launcher.Main.basicRun(Main.java:514)
at org.eclipse.equinox.launcher.Main.run(Main.java:1311)
at org.eclipse.equinox.launcher.Main.main(Main.java:1287)
at org.eclipse.core.launcher.Main.main(Main.java:34)
Caused by: java.lang.Exception: Could not find plugin
"org.jboss.tools.jmx.core.test"
at org.eclipse.test.EclipseTestRunner.loadSuiteClass(EclipseTestRunner.java:304)
at org.eclipse.test.EclipseTestRunner.getTest(EclipseTestRunner.java:237)
FAILED: org.jboss.tools.jmx.ui.JMXUIAllTests
Error Message:
java.lang.Exception: Could not find plugin "org.jboss.tools.jmx.ui.test"
Stack Trace:
org.eclipse.test.EclipseTestRunner$TestFailedException: java.lang.Exception: Could not
find plugin "org.jboss.tools.jmx.ui.test"
at org.eclipse.test.EclipseTestRunner.runFailed(EclipseTestRunner.java:288)
at org.eclipse.test.EclipseTestRunner.getTest(EclipseTestRunner.java:240)
at org.eclipse.test.EclipseTestRunner.<init>(EclipseTestRunner.java:220)
at org.eclipse.test.EclipseTestRunner.run(EclipseTestRunner.java:204)
at org.eclipse.test.UITestApplication$3.run(UITestApplication.java:195)
at org.eclipse.swt.widgets.RunnableLock.run(RunnableLock.java:35)
at org.eclipse.swt.widgets.Synchronizer.runAsyncMessages(Synchronizer.java:134)
at org.eclipse.swt.widgets.Display.runAsyncMessages(Display.java:3468)
at org.eclipse.swt.widgets.Display.readAndDispatch(Display.java:3115)
at org.eclipse.ui.internal.Workbench.runEventLoop(Workbench.java:2405)
at org.eclipse.ui.internal.Workbench.runUI(Workbench.java:2369)
at org.eclipse.ui.internal.Workbench.access$4(Workbench.java:2221)
at org.eclipse.ui.internal.Workbench$5.run(Workbench.java:500)
at org.eclipse.core.databinding.observable.Realm.runWithDefault(Realm.java:332)
at org.eclipse.ui.internal.Workbench.createAndRunWorkbench(Workbench.java:493)
at org.eclipse.ui.PlatformUI.createAndRunWorkbench(PlatformUI.java:149)
at org.eclipse.ui.internal.ide.application.IDEApplication.start(IDEApplication.java:113)
at org.eclipse.test.UITestApplication.runApplication(UITestApplication.java:138)
at org.eclipse.test.UITestApplication.run(UITestApplication.java:60)
at org.eclipse.test.UITestApplication.start(UITestApplication.java:210)
at org.eclipse.equinox.internal.app.EclipseAppHandle.run(EclipseAppHandle.java:194)
at
org.eclipse.core.runtime.internal.adaptor.EclipseAppLauncher.runApplication(EclipseAppLauncher.java:110)
at
org.eclipse.core.runtime.internal.adaptor.EclipseAppLauncher.start(EclipseAppLauncher.java:79)
at org.eclipse.core.runtime.adaptor.EclipseStarter.run(EclipseStarter.java:368)
at org.eclipse.core.runtime.adaptor.EclipseStarter.run(EclipseStarter.java:179)
at org.eclipse.equinox.launcher.Main.invokeFramework(Main.java:559)
at org.eclipse.equinox.launcher.Main.basicRun(Main.java:514)
at org.eclipse.equinox.launcher.Main.run(Main.java:1311)
at org.eclipse.equinox.launcher.Main.main(Main.java:1287)
at org.eclipse.core.launcher.Main.main(Main.java:34)
Caused by: java.lang.Exception: Could not find plugin
"org.jboss.tools.jmx.ui.test"
at org.eclipse.test.EclipseTestRunner.loadSuiteClass(EclipseTestRunner.java:304)
at org.eclipse.test.EclipseTestRunner.getTest(EclipseTestRunner.java:237)
FAILED: org.jboss.tools.jsf.test.JsfAllTests
Error Message:
java.lang.Exception: Could not find plugin "org.jboss.tools.jsf.test"
Stack Trace:
org.eclipse.test.EclipseTestRunner$TestFailedException: java.lang.Exception: Could not
find plugin "org.jboss.tools.jsf.test"
at org.eclipse.test.EclipseTestRunner.runFailed(EclipseTestRunner.java:288)
at org.eclipse.test.EclipseTestRunner.getTest(EclipseTestRunner.java:240)
at org.eclipse.test.EclipseTestRunner.<init>(EclipseTestRunner.java:220)
at org.eclipse.test.EclipseTestRunner.run(EclipseTestRunner.java:204)
at org.eclipse.test.UITestApplication$3.run(UITestApplication.java:195)
at org.eclipse.swt.widgets.RunnableLock.run(RunnableLock.java:35)
at org.eclipse.swt.widgets.Synchronizer.runAsyncMessages(Synchronizer.java:134)
at org.eclipse.swt.widgets.Display.runAsyncMessages(Display.java:3468)
at org.eclipse.swt.widgets.Display.readAndDispatch(Display.java:3115)
at org.eclipse.ui.internal.Workbench.runEventLoop(Workbench.java:2405)
at org.eclipse.ui.internal.Workbench.runUI(Workbench.java:2369)
at org.eclipse.ui.internal.Workbench.access$4(Workbench.java:2221)
at org.eclipse.ui.internal.Workbench$5.run(Workbench.java:500)
at org.eclipse.core.databinding.observable.Realm.runWithDefault(Realm.java:332)
at org.eclipse.ui.internal.Workbench.createAndRunWorkbench(Workbench.java:493)
at org.eclipse.ui.PlatformUI.createAndRunWorkbench(PlatformUI.java:149)
at org.eclipse.ui.internal.ide.application.IDEApplication.start(IDEApplication.java:113)
at org.eclipse.test.UITestApplication.runApplication(UITestApplication.java:138)
at org.eclipse.test.UITestApplication.run(UITestApplication.java:60)
at org.eclipse.test.UITestApplication.start(UITestApplication.java:210)
at org.eclipse.equinox.internal.app.EclipseAppHandle.run(EclipseAppHandle.java:194)
at
org.eclipse.core.runtime.internal.adaptor.EclipseAppLauncher.runApplication(EclipseAppLauncher.java:110)
at
org.eclipse.core.runtime.internal.adaptor.EclipseAppLauncher.start(EclipseAppLauncher.java:79)
at org.eclipse.core.runtime.adaptor.EclipseStarter.run(EclipseStarter.java:368)
at org.eclipse.core.runtime.adaptor.EclipseStarter.run(EclipseStarter.java:179)
at org.eclipse.equinox.launcher.Main.invokeFramework(Main.java:559)
at org.eclipse.equinox.launcher.Main.basicRun(Main.java:514)
at org.eclipse.equinox.launcher.Main.run(Main.java:1311)
at org.eclipse.equinox.launcher.Main.main(Main.java:1287)
at org.eclipse.core.launcher.Main.main(Main.java:34)
Caused by: java.lang.Exception: Could not find plugin
"org.jboss.tools.jsf.test"
at org.eclipse.test.EclipseTestRunner.loadSuiteClass(EclipseTestRunner.java:304)
at org.eclipse.test.EclipseTestRunner.getTest(EclipseTestRunner.java:237)
FAILED: org.jboss.tools.jsf.text.ext.test.JsfTextExtAllTests
Error Message:
java.lang.Exception: Could not find plugin "org.jboss.tools.jsf.text.ext.test"
Stack Trace:
org.eclipse.test.EclipseTestRunner$TestFailedException: java.lang.Exception: Could not
find plugin "org.jboss.tools.jsf.text.ext.test"
at org.eclipse.test.EclipseTestRunner.runFailed(EclipseTestRunner.java:288)
at org.eclipse.test.EclipseTestRunner.getTest(EclipseTestRunner.java:240)
at org.eclipse.test.EclipseTestRunner.<init>(EclipseTestRunner.java:220)
at org.eclipse.test.EclipseTestRunner.run(EclipseTestRunner.java:204)
at org.eclipse.test.UITestApplication$3.run(UITestApplication.java:195)
at org.eclipse.swt.widgets.RunnableLock.run(RunnableLock.java:35)
at org.eclipse.swt.widgets.Synchronizer.runAsyncMessages(Synchronizer.java:134)
at org.eclipse.swt.widgets.Display.runAsyncMessages(Display.java:3468)
at org.eclipse.swt.widgets.Display.readAndDispatch(Display.java:3115)
at org.eclipse.ui.internal.Workbench.runEventLoop(Workbench.java:2405)
at org.eclipse.ui.internal.Workbench.runUI(Workbench.java:2369)
at org.eclipse.ui.internal.Workbench.access$4(Workbench.java:2221)
at org.eclipse.ui.internal.Workbench$5.run(Workbench.java:500)
at org.eclipse.core.databinding.observable.Realm.runWithDefault(Realm.java:332)
at org.eclipse.ui.internal.Workbench.createAndRunWorkbench(Workbench.java:493)
at org.eclipse.ui.PlatformUI.createAndRunWorkbench(PlatformUI.java:149)
at org.eclipse.ui.internal.ide.application.IDEApplication.start(IDEApplication.java:113)
at org.eclipse.test.UITestApplication.runApplication(UITestApplication.java:138)
at org.eclipse.test.UITestApplication.run(UITestApplication.java:60)
at org.eclipse.test.UITestApplication.start(UITestApplication.java:210)
at org.eclipse.equinox.internal.app.EclipseAppHandle.run(EclipseAppHandle.java:194)
at
org.eclipse.core.runtime.internal.adaptor.EclipseAppLauncher.runApplication(EclipseAppLauncher.java:110)
at
org.eclipse.core.runtime.internal.adaptor.EclipseAppLauncher.start(EclipseAppLauncher.java:79)
at org.eclipse.core.runtime.adaptor.EclipseStarter.run(EclipseStarter.java:368)
at org.eclipse.core.runtime.adaptor.EclipseStarter.run(EclipseStarter.java:179)
at org.eclipse.equinox.launcher.Main.invokeFramework(Main.java:559)
at org.eclipse.equinox.launcher.Main.basicRun(Main.java:514)
at org.eclipse.equinox.launcher.Main.run(Main.java:1311)
at org.eclipse.equinox.launcher.Main.main(Main.java:1287)
at org.eclipse.core.launcher.Main.main(Main.java:34)
Caused by: java.lang.Exception: Could not find plugin
"org.jboss.tools.jsf.text.ext.test"
at org.eclipse.test.EclipseTestRunner.loadSuiteClass(EclipseTestRunner.java:304)
at org.eclipse.test.EclipseTestRunner.getTest(EclipseTestRunner.java:237)
FAILED: org.jboss.tools.jsf.ui.test.JsfUiAllTests
Error Message:
java.lang.Exception: Could not find plugin "org.jboss.tools.jsf.ui.test"
Stack Trace:
org.eclipse.test.EclipseTestRunner$TestFailedException: java.lang.Exception: Could not
find plugin "org.jboss.tools.jsf.ui.test"
at org.eclipse.test.EclipseTestRunner.runFailed(EclipseTestRunner.java:288)
at org.eclipse.test.EclipseTestRunner.getTest(EclipseTestRunner.java:240)
at org.eclipse.test.EclipseTestRunner.<init>(EclipseTestRunner.java:220)
at org.eclipse.test.EclipseTestRunner.run(EclipseTestRunner.java:204)
at org.eclipse.test.UITestApplication$3.run(UITestApplication.java:195)
at org.eclipse.swt.widgets.RunnableLock.run(RunnableLock.java:35)
at org.eclipse.swt.widgets.Synchronizer.runAsyncMessages(Synchronizer.java:134)
at org.eclipse.swt.widgets.Display.runAsyncMessages(Display.java:3468)
at org.eclipse.swt.widgets.Display.readAndDispatch(Display.java:3115)
at org.eclipse.ui.internal.Workbench.runEventLoop(Workbench.java:2405)
at org.eclipse.ui.internal.Workbench.runUI(Workbench.java:2369)
at org.eclipse.ui.internal.Workbench.access$4(Workbench.java:2221)
at org.eclipse.ui.internal.Workbench$5.run(Workbench.java:500)
at org.eclipse.core.databinding.observable.Realm.runWithDefault(Realm.java:332)
at org.eclipse.ui.internal.Workbench.createAndRunWorkbench(Workbench.java:493)
at org.eclipse.ui.PlatformUI.createAndRunWorkbench(PlatformUI.java:149)
at org.eclipse.ui.internal.ide.application.IDEApplication.start(IDEApplication.java:113)
at org.eclipse.test.UITestApplication.runApplication(UITestApplication.java:138)
at org.eclipse.test.UITestApplication.run(UITestApplication.java:60)
at org.eclipse.test.UITestApplication.start(UITestApplication.java:210)
at org.eclipse.equinox.internal.app.EclipseAppHandle.run(EclipseAppHandle.java:194)
at
org.eclipse.core.runtime.internal.adaptor.EclipseAppLauncher.runApplication(EclipseAppLauncher.java:110)
at
org.eclipse.core.runtime.internal.adaptor.EclipseAppLauncher.start(EclipseAppLauncher.java:79)
at org.eclipse.core.runtime.adaptor.EclipseStarter.run(EclipseStarter.java:368)
at org.eclipse.core.runtime.adaptor.EclipseStarter.run(EclipseStarter.java:179)
at org.eclipse.equinox.launcher.Main.invokeFramework(Main.java:559)
at org.eclipse.equinox.launcher.Main.basicRun(Main.java:514)
at org.eclipse.equinox.launcher.Main.run(Main.java:1311)
at org.eclipse.equinox.launcher.Main.main(Main.java:1287)
at org.eclipse.core.launcher.Main.main(Main.java:34)
Caused by: java.lang.Exception: Could not find plugin
"org.jboss.tools.jsf.ui.test"
at org.eclipse.test.EclipseTestRunner.loadSuiteClass(EclipseTestRunner.java:304)
at org.eclipse.test.EclipseTestRunner.getTest(EclipseTestRunner.java:237)
FAILED: org.jboss.tools.jsf.verification.test.JsfVerificationAllTests
Error Message:
java.lang.Exception: Could not find plugin
"org.jboss.tools.jsf.verification.test"
Stack Trace:
org.eclipse.test.EclipseTestRunner$TestFailedException: java.lang.Exception: Could not
find plugin "org.jboss.tools.jsf.verification.test"
at org.eclipse.test.EclipseTestRunner.runFailed(EclipseTestRunner.java:288)
at org.eclipse.test.EclipseTestRunner.getTest(EclipseTestRunner.java:240)
at org.eclipse.test.EclipseTestRunner.<init>(EclipseTestRunner.java:220)
at org.eclipse.test.EclipseTestRunner.run(EclipseTestRunner.java:204)
at org.eclipse.test.UITestApplication$3.run(UITestApplication.java:195)
at org.eclipse.swt.widgets.RunnableLock.run(RunnableLock.java:35)
at org.eclipse.swt.widgets.Synchronizer.runAsyncMessages(Synchronizer.java:134)
at org.eclipse.swt.widgets.Display.runAsyncMessages(Display.java:3468)
at org.eclipse.swt.widgets.Display.readAndDispatch(Display.java:3115)
at org.eclipse.ui.internal.Workbench.runEventLoop(Workbench.java:2405)
at org.eclipse.ui.internal.Workbench.runUI(Workbench.java:2369)
at org.eclipse.ui.internal.Workbench.access$4(Workbench.java:2221)
at org.eclipse.ui.internal.Workbench$5.run(Workbench.java:500)
at org.eclipse.core.databinding.observable.Realm.runWithDefault(Realm.java:332)
at org.eclipse.ui.internal.Workbench.createAndRunWorkbench(Workbench.java:493)
at org.eclipse.ui.PlatformUI.createAndRunWorkbench(PlatformUI.java:149)
at org.eclipse.ui.internal.ide.application.IDEApplication.start(IDEApplication.java:113)
at org.eclipse.test.UITestApplication.runApplication(UITestApplication.java:138)
at org.eclipse.test.UITestApplication.run(UITestApplication.java:60)
at org.eclipse.test.UITestApplication.start(UITestApplication.java:210)
at org.eclipse.equinox.internal.app.EclipseAppHandle.run(EclipseAppHandle.java:194)
at
org.eclipse.core.runtime.internal.adaptor.EclipseAppLauncher.runApplication(EclipseAppLauncher.java:110)
at
org.eclipse.core.runtime.internal.adaptor.EclipseAppLauncher.start(EclipseAppLauncher.java:79)
at org.eclipse.core.runtime.adaptor.EclipseStarter.run(EclipseStarter.java:368)
at org.eclipse.core.runtime.adaptor.EclipseStarter.run(EclipseStarter.java:179)
at org.eclipse.equinox.launcher.Main.invokeFramework(Main.java:559)
at org.eclipse.equinox.launcher.Main.basicRun(Main.java:514)
at org.eclipse.equinox.launcher.Main.run(Main.java:1311)
at org.eclipse.equinox.launcher.Main.main(Main.java:1287)
at org.eclipse.core.launcher.Main.main(Main.java:34)
Caused by: java.lang.Exception: Could not find plugin
"org.jboss.tools.jsf.verification.test"
at org.eclipse.test.EclipseTestRunner.loadSuiteClass(EclipseTestRunner.java:304)
at org.eclipse.test.EclipseTestRunner.getTest(EclipseTestRunner.java:237)
FAILED: org.jboss.tools.jsf.vpe.facelets.test.FaceletsAllTests
Error Message:
java.lang.Exception: Could not find plugin
"org.jboss.tools.jsf.vpe.facelets.test"
Stack Trace:
org.eclipse.test.EclipseTestRunner$TestFailedException: java.lang.Exception: Could not
find plugin "org.jboss.tools.jsf.vpe.facelets.test"
at org.eclipse.test.EclipseTestRunner.runFailed(EclipseTestRunner.java:288)
at org.eclipse.test.EclipseTestRunner.getTest(EclipseTestRunner.java:240)
at org.eclipse.test.EclipseTestRunner.<init>(EclipseTestRunner.java:220)
at org.eclipse.test.EclipseTestRunner.run(EclipseTestRunner.java:204)
at org.eclipse.test.UITestApplication$3.run(UITestApplication.java:195)
at org.eclipse.swt.widgets.RunnableLock.run(RunnableLock.java:35)
at org.eclipse.swt.widgets.Synchronizer.runAsyncMessages(Synchronizer.java:134)
at org.eclipse.swt.widgets.Display.runAsyncMessages(Display.java:3468)
at org.eclipse.swt.widgets.Display.readAndDispatch(Display.java:3115)
at org.eclipse.ui.internal.Workbench.runEventLoop(Workbench.java:2405)
at org.eclipse.ui.internal.Workbench.runUI(Workbench.java:2369)
at org.eclipse.ui.internal.Workbench.access$4(Workbench.java:2221)
at org.eclipse.ui.internal.Workbench$5.run(Workbench.java:500)
at org.eclipse.core.databinding.observable.Realm.runWithDefault(Realm.java:332)
at org.eclipse.ui.internal.Workbench.createAndRunWorkbench(Workbench.java:493)
at org.eclipse.ui.PlatformUI.createAndRunWorkbench(PlatformUI.java:149)
at org.eclipse.ui.internal.ide.application.IDEApplication.start(IDEApplication.java:113)
at org.eclipse.test.UITestApplication.runApplication(UITestApplication.java:138)
at org.eclipse.test.UITestApplication.run(UITestApplication.java:60)
at org.eclipse.test.UITestApplication.start(UITestApplication.java:210)
at org.eclipse.equinox.internal.app.EclipseAppHandle.run(EclipseAppHandle.java:194)
at
org.eclipse.core.runtime.internal.adaptor.EclipseAppLauncher.runApplication(EclipseAppLauncher.java:110)
at
org.eclipse.core.runtime.internal.adaptor.EclipseAppLauncher.start(EclipseAppLauncher.java:79)
at org.eclipse.core.runtime.adaptor.EclipseStarter.run(EclipseStarter.java:368)
at org.eclipse.core.runtime.adaptor.EclipseStarter.run(EclipseStarter.java:179)
at org.eclipse.equinox.launcher.Main.invokeFramework(Main.java:559)
at org.eclipse.equinox.launcher.Main.basicRun(Main.java:514)
at org.eclipse.equinox.launcher.Main.run(Main.java:1311)
at org.eclipse.equinox.launcher.Main.main(Main.java:1287)
at org.eclipse.core.launcher.Main.main(Main.java:34)
Caused by: java.lang.Exception: Could not find plugin
"org.jboss.tools.jsf.vpe.facelets.test"
at org.eclipse.test.EclipseTestRunner.loadSuiteClass(EclipseTestRunner.java:304)
at org.eclipse.test.EclipseTestRunner.getTest(EclipseTestRunner.java:237)
FAILED: org.jboss.tools.jsf.vpe.jsf.test.JsfAllTests
Error Message:
java.lang.Exception: Could not find plugin "org.jboss.tools.jsf.vpe.jsf.test"
Stack Trace:
org.eclipse.test.EclipseTestRunner$TestFailedException: java.lang.Exception: Could not
find plugin "org.jboss.tools.jsf.vpe.jsf.test"
at org.eclipse.test.EclipseTestRunner.runFailed(EclipseTestRunner.java:288)
at org.eclipse.test.EclipseTestRunner.getTest(EclipseTestRunner.java:240)
at org.eclipse.test.EclipseTestRunner.<init>(EclipseTestRunner.java:220)
at org.eclipse.test.EclipseTestRunner.run(EclipseTestRunner.java:204)
at org.eclipse.test.UITestApplication$3.run(UITestApplication.java:195)
at org.eclipse.swt.widgets.RunnableLock.run(RunnableLock.java:35)
at org.eclipse.swt.widgets.Synchronizer.runAsyncMessages(Synchronizer.java:134)
at org.eclipse.swt.widgets.Display.runAsyncMessages(Display.java:3468)
at org.eclipse.swt.widgets.Display.readAndDispatch(Display.java:3115)
at org.eclipse.ui.internal.Workbench.runEventLoop(Workbench.java:2405)
at org.eclipse.ui.internal.Workbench.runUI(Workbench.java:2369)
at org.eclipse.ui.internal.Workbench.access$4(Workbench.java:2221)
at org.eclipse.ui.internal.Workbench$5.run(Workbench.java:500)
at org.eclipse.core.databinding.observable.Realm.runWithDefault(Realm.java:332)
at org.eclipse.ui.internal.Workbench.createAndRunWorkbench(Workbench.java:493)
at org.eclipse.ui.PlatformUI.createAndRunWorkbench(PlatformUI.java:149)
at org.eclipse.ui.internal.ide.application.IDEApplication.start(IDEApplication.java:113)
at org.eclipse.test.UITestApplication.runApplication(UITestApplication.java:138)
at org.eclipse.test.UITestApplication.run(UITestApplication.java:60)
at org.eclipse.test.UITestApplication.start(UITestApplication.java:210)
at org.eclipse.equinox.internal.app.EclipseAppHandle.run(EclipseAppHandle.java:194)
at
org.eclipse.core.runtime.internal.adaptor.EclipseAppLauncher.runApplication(EclipseAppLauncher.java:110)
at
org.eclipse.core.runtime.internal.adaptor.EclipseAppLauncher.start(EclipseAppLauncher.java:79)
at org.eclipse.core.runtime.adaptor.EclipseStarter.run(EclipseStarter.java:368)
at org.eclipse.core.runtime.adaptor.EclipseStarter.run(EclipseStarter.java:179)
at org.eclipse.equinox.launcher.Main.invokeFramework(Main.java:559)
at org.eclipse.equinox.launcher.Main.basicRun(Main.java:514)
at org.eclipse.equinox.launcher.Main.run(Main.java:1311)
at org.eclipse.equinox.launcher.Main.main(Main.java:1287)
at org.eclipse.core.launcher.Main.main(Main.java:34)
Caused by: java.lang.Exception: Could not find plugin
"org.jboss.tools.jsf.vpe.jsf.test"
at org.eclipse.test.EclipseTestRunner.loadSuiteClass(EclipseTestRunner.java:304)
at org.eclipse.test.EclipseTestRunner.getTest(EclipseTestRunner.java:237)
FAILED: org.jboss.tools.jsf.vpe.jstl.test.JstlAllTests
Error Message:
java.lang.Exception: Could not find plugin "org.jboss.tools.jsf.vpe.jstl.test"
Stack Trace:
org.eclipse.test.EclipseTestRunner$TestFailedException: java.lang.Exception: Could not
find plugin "org.jboss.tools.jsf.vpe.jstl.test"
at org.eclipse.test.EclipseTestRunner.runFailed(EclipseTestRunner.java:288)
at org.eclipse.test.EclipseTestRunner.getTest(EclipseTestRunner.java:240)
at org.eclipse.test.EclipseTestRunner.<init>(EclipseTestRunner.java:220)
at org.eclipse.test.EclipseTestRunner.run(EclipseTestRunner.java:204)
at org.eclipse.test.UITestApplication$3.run(UITestApplication.java:195)
at org.eclipse.swt.widgets.RunnableLock.run(RunnableLock.java:35)
at org.eclipse.swt.widgets.Synchronizer.runAsyncMessages(Synchronizer.java:134)
at org.eclipse.swt.widgets.Display.runAsyncMessages(Display.java:3468)
at org.eclipse.swt.widgets.Display.readAndDispatch(Display.java:3115)
at org.eclipse.ui.internal.Workbench.runEventLoop(Workbench.java:2405)
at org.eclipse.ui.internal.Workbench.runUI(Workbench.java:2369)
at org.eclipse.ui.internal.Workbench.access$4(Workbench.java:2221)
at org.eclipse.ui.internal.Workbench$5.run(Workbench.java:500)
at org.eclipse.core.databinding.observable.Realm.runWithDefault(Realm.java:332)
at org.eclipse.ui.internal.Workbench.createAndRunWorkbench(Workbench.java:493)
at org.eclipse.ui.PlatformUI.createAndRunWorkbench(PlatformUI.java:149)
at org.eclipse.ui.internal.ide.application.IDEApplication.start(IDEApplication.java:113)
at org.eclipse.test.UITestApplication.runApplication(UITestApplication.java:138)
at org.eclipse.test.UITestApplication.run(UITestApplication.java:60)
at org.eclipse.test.UITestApplication.start(UITestApplication.java:210)
at org.eclipse.equinox.internal.app.EclipseAppHandle.run(EclipseAppHandle.java:194)
at
org.eclipse.core.runtime.internal.adaptor.EclipseAppLauncher.runApplication(EclipseAppLauncher.java:110)
at
org.eclipse.core.runtime.internal.adaptor.EclipseAppLauncher.start(EclipseAppLauncher.java:79)
at org.eclipse.core.runtime.adaptor.EclipseStarter.run(EclipseStarter.java:368)
at org.eclipse.core.runtime.adaptor.EclipseStarter.run(EclipseStarter.java:179)
at org.eclipse.equinox.launcher.Main.invokeFramework(Main.java:559)
at org.eclipse.equinox.launcher.Main.basicRun(Main.java:514)
at org.eclipse.equinox.launcher.Main.run(Main.java:1311)
at org.eclipse.equinox.launcher.Main.main(Main.java:1287)
at org.eclipse.core.launcher.Main.main(Main.java:34)
Caused by: java.lang.Exception: Could not find plugin
"org.jboss.tools.jsf.vpe.jstl.test"
at org.eclipse.test.EclipseTestRunner.loadSuiteClass(EclipseTestRunner.java:304)
at org.eclipse.test.EclipseTestRunner.getTest(EclipseTestRunner.java:237)
FAILED: org.jboss.tools.jsf.vpe.richfaces.test.RichFacesAllTests
Error Message:
java.lang.Exception: Could not find plugin
"org.jboss.tools.jsf.vpe.richfaces.test"
Stack Trace:
org.eclipse.test.EclipseTestRunner$TestFailedException: java.lang.Exception: Could not
find plugin "org.jboss.tools.jsf.vpe.richfaces.test"
at org.eclipse.test.EclipseTestRunner.runFailed(EclipseTestRunner.java:288)
at org.eclipse.test.EclipseTestRunner.getTest(EclipseTestRunner.java:240)
at org.eclipse.test.EclipseTestRunner.<init>(EclipseTestRunner.java:220)
at org.eclipse.test.EclipseTestRunner.run(EclipseTestRunner.java:204)
at org.eclipse.test.UITestApplication$3.run(UITestApplication.java:195)
at org.eclipse.swt.widgets.RunnableLock.run(RunnableLock.java:35)
at org.eclipse.swt.widgets.Synchronizer.runAsyncMessages(Synchronizer.java:134)
at org.eclipse.swt.widgets.Display.runAsyncMessages(Display.java:3468)
at org.eclipse.swt.widgets.Display.readAndDispatch(Display.java:3115)
at org.eclipse.ui.internal.Workbench.runEventLoop(Workbench.java:2405)
at org.eclipse.ui.internal.Workbench.runUI(Workbench.java:2369)
at org.eclipse.ui.internal.Workbench.access$4(Workbench.java:2221)
at org.eclipse.ui.internal.Workbench$5.run(Workbench.java:500)
at org.eclipse.core.databinding.observable.Realm.runWithDefault(Realm.java:332)
at org.eclipse.ui.internal.Workbench.createAndRunWorkbench(Workbench.java:493)
at org.eclipse.ui.PlatformUI.createAndRunWorkbench(PlatformUI.java:149)
at org.eclipse.ui.internal.ide.application.IDEApplication.start(IDEApplication.java:113)
at org.eclipse.test.UITestApplication.runApplication(UITestApplication.java:138)
at org.eclipse.test.UITestApplication.run(UITestApplication.java:60)
at org.eclipse.test.UITestApplication.start(UITestApplication.java:210)
at org.eclipse.equinox.internal.app.EclipseAppHandle.run(EclipseAppHandle.java:194)
at
org.eclipse.core.runtime.internal.adaptor.EclipseAppLauncher.runApplication(EclipseAppLauncher.java:110)
at
org.eclipse.core.runtime.internal.adaptor.EclipseAppLauncher.start(EclipseAppLauncher.java:79)
at org.eclipse.core.runtime.adaptor.EclipseStarter.run(EclipseStarter.java:368)
at org.eclipse.core.runtime.adaptor.EclipseStarter.run(EclipseStarter.java:179)
at org.eclipse.equinox.launcher.Main.invokeFramework(Main.java:559)
at org.eclipse.equinox.launcher.Main.basicRun(Main.java:514)
at org.eclipse.equinox.launcher.Main.run(Main.java:1311)
at org.eclipse.equinox.launcher.Main.main(Main.java:1287)
at org.eclipse.core.launcher.Main.main(Main.java:34)
Caused by: java.lang.Exception: Could not find plugin
"org.jboss.tools.jsf.vpe.richfaces.test"
at org.eclipse.test.EclipseTestRunner.loadSuiteClass(EclipseTestRunner.java:304)
at org.eclipse.test.EclipseTestRunner.getTest(EclipseTestRunner.java:237)
FAILED: org.jboss.tools.jsf.vpe.seam.test.SeamAllTests
Error Message:
java.lang.Exception: Could not find plugin "org.jboss.tools.jsf.vpe.seam.test"
Stack Trace:
org.eclipse.test.EclipseTestRunner$TestFailedException: java.lang.Exception: Could not
find plugin "org.jboss.tools.jsf.vpe.seam.test"
at org.eclipse.test.EclipseTestRunner.runFailed(EclipseTestRunner.java:288)
at org.eclipse.test.EclipseTestRunner.getTest(EclipseTestRunner.java:240)
at org.eclipse.test.EclipseTestRunner.<init>(EclipseTestRunner.java:220)
at org.eclipse.test.EclipseTestRunner.run(EclipseTestRunner.java:204)
at org.eclipse.test.UITestApplication$3.run(UITestApplication.java:195)
at org.eclipse.swt.widgets.RunnableLock.run(RunnableLock.java:35)
at org.eclipse.swt.widgets.Synchronizer.runAsyncMessages(Synchronizer.java:134)
at org.eclipse.swt.widgets.Display.runAsyncMessages(Display.java:3468)
at org.eclipse.swt.widgets.Display.readAndDispatch(Display.java:3115)
at org.eclipse.ui.internal.Workbench.runEventLoop(Workbench.java:2405)
at org.eclipse.ui.internal.Workbench.runUI(Workbench.java:2369)
at org.eclipse.ui.internal.Workbench.access$4(Workbench.java:2221)
at org.eclipse.ui.internal.Workbench$5.run(Workbench.java:500)
at org.eclipse.core.databinding.observable.Realm.runWithDefault(Realm.java:332)
at org.eclipse.ui.internal.Workbench.createAndRunWorkbench(Workbench.java:493)
at org.eclipse.ui.PlatformUI.createAndRunWorkbench(PlatformUI.java:149)
at org.eclipse.ui.internal.ide.application.IDEApplication.start(IDEApplication.java:113)
at org.eclipse.test.UITestApplication.runApplication(UITestApplication.java:138)
at org.eclipse.test.UITestApplication.run(UITestApplication.java:60)
at org.eclipse.test.UITestApplication.start(UITestApplication.java:210)
at org.eclipse.equinox.internal.app.EclipseAppHandle.run(EclipseAppHandle.java:194)
at
org.eclipse.core.runtime.internal.adaptor.EclipseAppLauncher.runApplication(EclipseAppLauncher.java:110)
at
org.eclipse.core.runtime.internal.adaptor.EclipseAppLauncher.start(EclipseAppLauncher.java:79)
at org.eclipse.core.runtime.adaptor.EclipseStarter.run(EclipseStarter.java:368)
at org.eclipse.core.runtime.adaptor.EclipseStarter.run(EclipseStarter.java:179)
at org.eclipse.equinox.launcher.Main.invokeFramework(Main.java:559)
at org.eclipse.equinox.launcher.Main.basicRun(Main.java:514)
at org.eclipse.equinox.launcher.Main.run(Main.java:1311)
at org.eclipse.equinox.launcher.Main.main(Main.java:1287)
at org.eclipse.core.launcher.Main.main(Main.java:34)
Caused by: java.lang.Exception: Could not find plugin
"org.jboss.tools.jsf.vpe.seam.test"
at org.eclipse.test.EclipseTestRunner.loadSuiteClass(EclipseTestRunner.java:304)
at org.eclipse.test.EclipseTestRunner.getTest(EclipseTestRunner.java:237)
FAILED: org.jboss.tools.jst.jsp.test.JstJspAllTests
Error Message:
java.lang.Exception: Could not find plugin "org.jboss.tools.jst.jsp.test"
Stack Trace:
org.eclipse.test.EclipseTestRunner$TestFailedException: java.lang.Exception: Could not
find plugin "org.jboss.tools.jst.jsp.test"
at org.eclipse.test.EclipseTestRunner.runFailed(EclipseTestRunner.java:288)
at org.eclipse.test.EclipseTestRunner.getTest(EclipseTestRunner.java:240)
at org.eclipse.test.EclipseTestRunner.<init>(EclipseTestRunner.java:220)
at org.eclipse.test.EclipseTestRunner.run(EclipseTestRunner.java:204)
at org.eclipse.test.UITestApplication$3.run(UITestApplication.java:195)
at org.eclipse.swt.widgets.RunnableLock.run(RunnableLock.java:35)
at org.eclipse.swt.widgets.Synchronizer.runAsyncMessages(Synchronizer.java:134)
at org.eclipse.swt.widgets.Display.runAsyncMessages(Display.java:3468)
at org.eclipse.swt.widgets.Display.readAndDispatch(Display.java:3115)
at org.eclipse.ui.internal.Workbench.runEventLoop(Workbench.java:2405)
at org.eclipse.ui.internal.Workbench.runUI(Workbench.java:2369)
at org.eclipse.ui.internal.Workbench.access$4(Workbench.java:2221)
at org.eclipse.ui.internal.Workbench$5.run(Workbench.java:500)
at org.eclipse.core.databinding.observable.Realm.runWithDefault(Realm.java:332)
at org.eclipse.ui.internal.Workbench.createAndRunWorkbench(Workbench.java:493)
at org.eclipse.ui.PlatformUI.createAndRunWorkbench(PlatformUI.java:149)
at org.eclipse.ui.internal.ide.application.IDEApplication.start(IDEApplication.java:113)
at org.eclipse.test.UITestApplication.runApplication(UITestApplication.java:138)
at org.eclipse.test.UITestApplication.run(UITestApplication.java:60)
at org.eclipse.test.UITestApplication.start(UITestApplication.java:210)
at org.eclipse.equinox.internal.app.EclipseAppHandle.run(EclipseAppHandle.java:194)
at
org.eclipse.core.runtime.internal.adaptor.EclipseAppLauncher.runApplication(EclipseAppLauncher.java:110)
at
org.eclipse.core.runtime.internal.adaptor.EclipseAppLauncher.start(EclipseAppLauncher.java:79)
at org.eclipse.core.runtime.adaptor.EclipseStarter.run(EclipseStarter.java:368)
at org.eclipse.core.runtime.adaptor.EclipseStarter.run(EclipseStarter.java:179)
at org.eclipse.equinox.launcher.Main.invokeFramework(Main.java:559)
at org.eclipse.equinox.launcher.Main.basicRun(Main.java:514)
at org.eclipse.equinox.launcher.Main.run(Main.java:1311)
at org.eclipse.equinox.launcher.Main.main(Main.java:1287)
at org.eclipse.core.launcher.Main.main(Main.java:34)
Caused by: java.lang.Exception: Could not find plugin
"org.jboss.tools.jst.jsp.test"
at org.eclipse.test.EclipseTestRunner.loadSuiteClass(EclipseTestRunner.java:304)
at org.eclipse.test.EclipseTestRunner.getTest(EclipseTestRunner.java:237)
FAILED: org.jboss.tools.jst.web.test.JstWebAllTests
Error Message:
java.lang.Exception: Could not find plugin "org.jboss.tools.jst.web.test"
Stack Trace:
org.eclipse.test.EclipseTestRunner$TestFailedException: java.lang.Exception: Could not
find plugin "org.jboss.tools.jst.web.test"
at org.eclipse.test.EclipseTestRunner.runFailed(EclipseTestRunner.java:288)
at org.eclipse.test.EclipseTestRunner.getTest(EclipseTestRunner.java:240)
at org.eclipse.test.EclipseTestRunner.<init>(EclipseTestRunner.java:220)
at org.eclipse.test.EclipseTestRunner.run(EclipseTestRunner.java:204)
at org.eclipse.test.UITestApplication$3.run(UITestApplication.java:195)
at org.eclipse.swt.widgets.RunnableLock.run(RunnableLock.java:35)
at org.eclipse.swt.widgets.Synchronizer.runAsyncMessages(Synchronizer.java:134)
at org.eclipse.swt.widgets.Display.runAsyncMessages(Display.java:3468)
at org.eclipse.swt.widgets.Display.readAndDispatch(Display.java:3115)
at org.eclipse.ui.internal.Workbench.runEventLoop(Workbench.java:2405)
at org.eclipse.ui.internal.Workbench.runUI(Workbench.java:2369)
at org.eclipse.ui.internal.Workbench.access$4(Workbench.java:2221)
at org.eclipse.ui.internal.Workbench$5.run(Workbench.java:500)
at org.eclipse.core.databinding.observable.Realm.runWithDefault(Realm.java:332)
at org.eclipse.ui.internal.Workbench.createAndRunWorkbench(Workbench.java:493)
at org.eclipse.ui.PlatformUI.createAndRunWorkbench(PlatformUI.java:149)
at org.eclipse.ui.internal.ide.application.IDEApplication.start(IDEApplication.java:113)
at org.eclipse.test.UITestApplication.runApplication(UITestApplication.java:138)
at org.eclipse.test.UITestApplication.run(UITestApplication.java:60)
at org.eclipse.test.UITestApplication.start(UITestApplication.java:210)
at org.eclipse.equinox.internal.app.EclipseAppHandle.run(EclipseAppHandle.java:194)
at
org.eclipse.core.runtime.internal.adaptor.EclipseAppLauncher.runApplication(EclipseAppLauncher.java:110)
at
org.eclipse.core.runtime.internal.adaptor.EclipseAppLauncher.start(EclipseAppLauncher.java:79)
at org.eclipse.core.runtime.adaptor.EclipseStarter.run(EclipseStarter.java:368)
at org.eclipse.core.runtime.adaptor.EclipseStarter.run(EclipseStarter.java:179)
at org.eclipse.equinox.launcher.Main.invokeFramework(Main.java:559)
at org.eclipse.equinox.launcher.Main.basicRun(Main.java:514)
at org.eclipse.equinox.launcher.Main.run(Main.java:1311)
at org.eclipse.equinox.launcher.Main.main(Main.java:1287)
at org.eclipse.core.launcher.Main.main(Main.java:34)
Caused by: java.lang.Exception: Could not find plugin
"org.jboss.tools.jst.web.test"
at org.eclipse.test.EclipseTestRunner.loadSuiteClass(EclipseTestRunner.java:304)
at org.eclipse.test.EclipseTestRunner.getTest(EclipseTestRunner.java:237)
FAILED: org.jboss.tools.jst.web.ui.test.JstWebUiAllTests
Error Message:
java.lang.Exception: Could not find plugin "org.jboss.tools.jst.web.ui.test"
Stack Trace:
org.eclipse.test.EclipseTestRunner$TestFailedException: java.lang.Exception: Could not
find plugin "org.jboss.tools.jst.web.ui.test"
at org.eclipse.test.EclipseTestRunner.runFailed(EclipseTestRunner.java:288)
at org.eclipse.test.EclipseTestRunner.getTest(EclipseTestRunner.java:240)
at org.eclipse.test.EclipseTestRunner.<init>(EclipseTestRunner.java:220)
at org.eclipse.test.EclipseTestRunner.run(EclipseTestRunner.java:204)
at org.eclipse.test.UITestApplication$3.run(UITestApplication.java:195)
at org.eclipse.swt.widgets.RunnableLock.run(RunnableLock.java:35)
at org.eclipse.swt.widgets.Synchronizer.runAsyncMessages(Synchronizer.java:134)
at org.eclipse.swt.widgets.Display.runAsyncMessages(Display.java:3468)
at org.eclipse.swt.widgets.Display.readAndDispatch(Display.java:3115)
at org.eclipse.ui.internal.Workbench.runEventLoop(Workbench.java:2405)
at org.eclipse.ui.internal.Workbench.runUI(Workbench.java:2369)
at org.eclipse.ui.internal.Workbench.access$4(Workbench.java:2221)
at org.eclipse.ui.internal.Workbench$5.run(Workbench.java:500)
at org.eclipse.core.databinding.observable.Realm.runWithDefault(Realm.java:332)
at org.eclipse.ui.internal.Workbench.createAndRunWorkbench(Workbench.java:493)
at org.eclipse.ui.PlatformUI.createAndRunWorkbench(PlatformUI.java:149)
at org.eclipse.ui.internal.ide.application.IDEApplication.start(IDEApplication.java:113)
at org.eclipse.test.UITestApplication.runApplication(UITestApplication.java:138)
at org.eclipse.test.UITestApplication.run(UITestApplication.java:60)
at org.eclipse.test.UITestApplication.start(UITestApplication.java:210)
at org.eclipse.equinox.internal.app.EclipseAppHandle.run(EclipseAppHandle.java:194)
at
org.eclipse.core.runtime.internal.adaptor.EclipseAppLauncher.runApplication(EclipseAppLauncher.java:110)
at
org.eclipse.core.runtime.internal.adaptor.EclipseAppLauncher.start(EclipseAppLauncher.java:79)
at org.eclipse.core.runtime.adaptor.EclipseStarter.run(EclipseStarter.java:368)
at org.eclipse.core.runtime.adaptor.EclipseStarter.run(EclipseStarter.java:179)
at org.eclipse.equinox.launcher.Main.invokeFramework(Main.java:559)
at org.eclipse.equinox.launcher.Main.basicRun(Main.java:514)
at org.eclipse.equinox.launcher.Main.run(Main.java:1311)
at org.eclipse.equinox.launcher.Main.main(Main.java:1287)
at org.eclipse.core.launcher.Main.main(Main.java:34)
Caused by: java.lang.Exception: Could not find plugin
"org.jboss.tools.jst.web.ui.test"
at org.eclipse.test.EclipseTestRunner.loadSuiteClass(EclipseTestRunner.java:304)
at org.eclipse.test.EclipseTestRunner.getTest(EclipseTestRunner.java:237)
FAILED: org.jboss.tools.seam.core.test.project.facet.Seam12XFacetTestSuite121EAP
Error Message:
java.lang.Exception: Could not find plugin "org.jboss.tools.seam.core.test"
Stack Trace:
org.eclipse.test.EclipseTestRunner$TestFailedException: java.lang.Exception: Could not
find plugin "org.jboss.tools.seam.core.test"
at org.eclipse.test.EclipseTestRunner.runFailed(EclipseTestRunner.java:288)
at org.eclipse.test.EclipseTestRunner.getTest(EclipseTestRunner.java:240)
at org.eclipse.test.EclipseTestRunner.<init>(EclipseTestRunner.java:220)
at org.eclipse.test.EclipseTestRunner.run(EclipseTestRunner.java:204)
at org.eclipse.test.UITestApplication$3.run(UITestApplication.java:195)
at org.eclipse.swt.widgets.RunnableLock.run(RunnableLock.java:35)
at org.eclipse.swt.widgets.Synchronizer.runAsyncMessages(Synchronizer.java:134)
at org.eclipse.swt.widgets.Display.runAsyncMessages(Display.java:3468)
at org.eclipse.swt.widgets.Display.readAndDispatch(Display.java:3115)
at org.eclipse.ui.internal.Workbench.runEventLoop(Workbench.java:2405)
at org.eclipse.ui.internal.Workbench.runUI(Workbench.java:2369)
at org.eclipse.ui.internal.Workbench.access$4(Workbench.java:2221)
at org.eclipse.ui.internal.Workbench$5.run(Workbench.java:500)
at org.eclipse.core.databinding.observable.Realm.runWithDefault(Realm.java:332)
at org.eclipse.ui.internal.Workbench.createAndRunWorkbench(Workbench.java:493)
at org.eclipse.ui.PlatformUI.createAndRunWorkbench(PlatformUI.java:149)
at org.eclipse.ui.internal.ide.application.IDEApplication.start(IDEApplication.java:113)
at org.eclipse.test.UITestApplication.runApplication(UITestApplication.java:138)
at org.eclipse.test.UITestApplication.run(UITestApplication.java:60)
at org.eclipse.test.UITestApplication.start(UITestApplication.java:210)
at org.eclipse.equinox.internal.app.EclipseAppHandle.run(EclipseAppHandle.java:194)
at
org.eclipse.core.runtime.internal.adaptor.EclipseAppLauncher.runApplication(EclipseAppLauncher.java:110)
at
org.eclipse.core.runtime.internal.adaptor.EclipseAppLauncher.start(EclipseAppLauncher.java:79)
at org.eclipse.core.runtime.adaptor.EclipseStarter.run(EclipseStarter.java:368)
at org.eclipse.core.runtime.adaptor.EclipseStarter.run(EclipseStarter.java:179)
at org.eclipse.equinox.launcher.Main.invokeFramework(Main.java:559)
at org.eclipse.equinox.launcher.Main.basicRun(Main.java:514)
at org.eclipse.equinox.launcher.Main.run(Main.java:1311)
at org.eclipse.equinox.launcher.Main.main(Main.java:1287)
at org.eclipse.core.launcher.Main.main(Main.java:34)
Caused by: java.lang.Exception: Could not find plugin
"org.jboss.tools.seam.core.test"
at org.eclipse.test.EclipseTestRunner.loadSuiteClass(EclipseTestRunner.java:304)
at org.eclipse.test.EclipseTestRunner.getTest(EclipseTestRunner.java:237)
FAILED: org.jboss.tools.seam.core.test.project.facet.Seam20XFacetTestSuite201GA
Error Message:
java.lang.Exception: Could not find plugin "org.jboss.tools.seam.core.test"
Stack Trace:
org.eclipse.test.EclipseTestRunner$TestFailedException: java.lang.Exception: Could not
find plugin "org.jboss.tools.seam.core.test"
at org.eclipse.test.EclipseTestRunner.runFailed(EclipseTestRunner.java:288)
at org.eclipse.test.EclipseTestRunner.getTest(EclipseTestRunner.java:240)
at org.eclipse.test.EclipseTestRunner.<init>(EclipseTestRunner.java:220)
at org.eclipse.test.EclipseTestRunner.run(EclipseTestRunner.java:204)
at org.eclipse.test.UITestApplication$3.run(UITestApplication.java:195)
at org.eclipse.swt.widgets.RunnableLock.run(RunnableLock.java:35)
at org.eclipse.swt.widgets.Synchronizer.runAsyncMessages(Synchronizer.java:134)
at org.eclipse.swt.widgets.Display.runAsyncMessages(Display.java:3468)
at org.eclipse.swt.widgets.Display.readAndDispatch(Display.java:3115)
at org.eclipse.ui.internal.Workbench.runEventLoop(Workbench.java:2405)
at org.eclipse.ui.internal.Workbench.runUI(Workbench.java:2369)
at org.eclipse.ui.internal.Workbench.access$4(Workbench.java:2221)
at org.eclipse.ui.internal.Workbench$5.run(Workbench.java:500)
at org.eclipse.core.databinding.observable.Realm.runWithDefault(Realm.java:332)
at org.eclipse.ui.internal.Workbench.createAndRunWorkbench(Workbench.java:493)
at org.eclipse.ui.PlatformUI.createAndRunWorkbench(PlatformUI.java:149)
at org.eclipse.ui.internal.ide.application.IDEApplication.start(IDEApplication.java:113)
at org.eclipse.test.UITestApplication.runApplication(UITestApplication.java:138)
at org.eclipse.test.UITestApplication.run(UITestApplication.java:60)
at org.eclipse.test.UITestApplication.start(UITestApplication.java:210)
at org.eclipse.equinox.internal.app.EclipseAppHandle.run(EclipseAppHandle.java:194)
at
org.eclipse.core.runtime.internal.adaptor.EclipseAppLauncher.runApplication(EclipseAppLauncher.java:110)
at
org.eclipse.core.runtime.internal.adaptor.EclipseAppLauncher.start(EclipseAppLauncher.java:79)
at org.eclipse.core.runtime.adaptor.EclipseStarter.run(EclipseStarter.java:368)
at org.eclipse.core.runtime.adaptor.EclipseStarter.run(EclipseStarter.java:179)
at org.eclipse.equinox.launcher.Main.invokeFramework(Main.java:559)
at org.eclipse.equinox.launcher.Main.basicRun(Main.java:514)
at org.eclipse.equinox.launcher.Main.run(Main.java:1311)
at org.eclipse.equinox.launcher.Main.main(Main.java:1287)
at org.eclipse.core.launcher.Main.main(Main.java:34)
Caused by: java.lang.Exception: Could not find plugin
"org.jboss.tools.seam.core.test"
at org.eclipse.test.EclipseTestRunner.loadSuiteClass(EclipseTestRunner.java:304)
at org.eclipse.test.EclipseTestRunner.getTest(EclipseTestRunner.java:237)
FAILED: org.jboss.tools.seam.core.test.project.facet.Seam20XFacetTestSuite202SP1
Error Message:
java.lang.Exception: Could not find plugin "org.jboss.tools.seam.core.test"
Stack Trace:
org.eclipse.test.EclipseTestRunner$TestFailedException: java.lang.Exception: Could not
find plugin "org.jboss.tools.seam.core.test"
at org.eclipse.test.EclipseTestRunner.runFailed(EclipseTestRunner.java:288)
at org.eclipse.test.EclipseTestRunner.getTest(EclipseTestRunner.java:240)
at org.eclipse.test.EclipseTestRunner.<init>(EclipseTestRunner.java:220)
at org.eclipse.test.EclipseTestRunner.run(EclipseTestRunner.java:204)
at org.eclipse.test.UITestApplication$3.run(UITestApplication.java:195)
at org.eclipse.swt.widgets.RunnableLock.run(RunnableLock.java:35)
at org.eclipse.swt.widgets.Synchronizer.runAsyncMessages(Synchronizer.java:134)
at org.eclipse.swt.widgets.Display.runAsyncMessages(Display.java:3468)
at org.eclipse.swt.widgets.Display.readAndDispatch(Display.java:3115)
at org.eclipse.ui.internal.Workbench.runEventLoop(Workbench.java:2405)
at org.eclipse.ui.internal.Workbench.runUI(Workbench.java:2369)
at org.eclipse.ui.internal.Workbench.access$4(Workbench.java:2221)
at org.eclipse.ui.internal.Workbench$5.run(Workbench.java:500)
at org.eclipse.core.databinding.observable.Realm.runWithDefault(Realm.java:332)
at org.eclipse.ui.internal.Workbench.createAndRunWorkbench(Workbench.java:493)
at org.eclipse.ui.PlatformUI.createAndRunWorkbench(PlatformUI.java:149)
at org.eclipse.ui.internal.ide.application.IDEApplication.start(IDEApplication.java:113)
at org.eclipse.test.UITestApplication.runApplication(UITestApplication.java:138)
at org.eclipse.test.UITestApplication.run(UITestApplication.java:60)
at org.eclipse.test.UITestApplication.start(UITestApplication.java:210)
at org.eclipse.equinox.internal.app.EclipseAppHandle.run(EclipseAppHandle.java:194)
at
org.eclipse.core.runtime.internal.adaptor.EclipseAppLauncher.runApplication(EclipseAppLauncher.java:110)
at
org.eclipse.core.runtime.internal.adaptor.EclipseAppLauncher.start(EclipseAppLauncher.java:79)
at org.eclipse.core.runtime.adaptor.EclipseStarter.run(EclipseStarter.java:368)
at org.eclipse.core.runtime.adaptor.EclipseStarter.run(EclipseStarter.java:179)
at org.eclipse.equinox.launcher.Main.invokeFramework(Main.java:559)
at org.eclipse.equinox.launcher.Main.basicRun(Main.java:514)
at org.eclipse.equinox.launcher.Main.run(Main.java:1311)
at org.eclipse.equinox.launcher.Main.main(Main.java:1287)
at org.eclipse.core.launcher.Main.main(Main.java:34)
Caused by: java.lang.Exception: Could not find plugin
"org.jboss.tools.seam.core.test"
at org.eclipse.test.EclipseTestRunner.loadSuiteClass(EclipseTestRunner.java:304)
at org.eclipse.test.EclipseTestRunner.getTest(EclipseTestRunner.java:237)
FAILED: org.jboss.tools.seam.core.test.project.facet.Seam20XFacetTestSuite203CR1
Error Message:
java.lang.Exception: Could not find plugin "org.jboss.tools.seam.core.test"
Stack Trace:
org.eclipse.test.EclipseTestRunner$TestFailedException: java.lang.Exception: Could not
find plugin "org.jboss.tools.seam.core.test"
at org.eclipse.test.EclipseTestRunner.runFailed(EclipseTestRunner.java:288)
at org.eclipse.test.EclipseTestRunner.getTest(EclipseTestRunner.java:240)
at org.eclipse.test.EclipseTestRunner.<init>(EclipseTestRunner.java:220)
at org.eclipse.test.EclipseTestRunner.run(EclipseTestRunner.java:204)
at org.eclipse.test.UITestApplication$3.run(UITestApplication.java:195)
at org.eclipse.swt.widgets.RunnableLock.run(RunnableLock.java:35)
at org.eclipse.swt.widgets.Synchronizer.runAsyncMessages(Synchronizer.java:134)
at org.eclipse.swt.widgets.Display.runAsyncMessages(Display.java:3468)
at org.eclipse.swt.widgets.Display.readAndDispatch(Display.java:3115)
at org.eclipse.ui.internal.Workbench.runEventLoop(Workbench.java:2405)
at org.eclipse.ui.internal.Workbench.runUI(Workbench.java:2369)
at org.eclipse.ui.internal.Workbench.access$4(Workbench.java:2221)
at org.eclipse.ui.internal.Workbench$5.run(Workbench.java:500)
at org.eclipse.core.databinding.observable.Realm.runWithDefault(Realm.java:332)
at org.eclipse.ui.internal.Workbench.createAndRunWorkbench(Workbench.java:493)
at org.eclipse.ui.PlatformUI.createAndRunWorkbench(PlatformUI.java:149)
at org.eclipse.ui.internal.ide.application.IDEApplication.start(IDEApplication.java:113)
at org.eclipse.test.UITestApplication.runApplication(UITestApplication.java:138)
at org.eclipse.test.UITestApplication.run(UITestApplication.java:60)
at org.eclipse.test.UITestApplication.start(UITestApplication.java:210)
at org.eclipse.equinox.internal.app.EclipseAppHandle.run(EclipseAppHandle.java:194)
at
org.eclipse.core.runtime.internal.adaptor.EclipseAppLauncher.runApplication(EclipseAppLauncher.java:110)
at
org.eclipse.core.runtime.internal.adaptor.EclipseAppLauncher.start(EclipseAppLauncher.java:79)
at org.eclipse.core.runtime.adaptor.EclipseStarter.run(EclipseStarter.java:368)
at org.eclipse.core.runtime.adaptor.EclipseStarter.run(EclipseStarter.java:179)
at org.eclipse.equinox.launcher.Main.invokeFramework(Main.java:559)
at org.eclipse.equinox.launcher.Main.basicRun(Main.java:514)
at org.eclipse.equinox.launcher.Main.run(Main.java:1311)
at org.eclipse.equinox.launcher.Main.main(Main.java:1287)
at org.eclipse.core.launcher.Main.main(Main.java:34)
Caused by: java.lang.Exception: Could not find plugin
"org.jboss.tools.seam.core.test"
at org.eclipse.test.EclipseTestRunner.loadSuiteClass(EclipseTestRunner.java:304)
at org.eclipse.test.EclipseTestRunner.getTest(EclipseTestRunner.java:237)
FAILED: org.jboss.tools.seam.core.test.project.facet.Seam20XFacetTestSuiteFP
Error Message:
java.lang.Exception: Could not find plugin "org.jboss.tools.seam.core.test"
Stack Trace:
org.eclipse.test.EclipseTestRunner$TestFailedException: java.lang.Exception: Could not
find plugin "org.jboss.tools.seam.core.test"
at org.eclipse.test.EclipseTestRunner.runFailed(EclipseTestRunner.java:288)
at org.eclipse.test.EclipseTestRunner.getTest(EclipseTestRunner.java:240)
at org.eclipse.test.EclipseTestRunner.<init>(EclipseTestRunner.java:220)
at org.eclipse.test.EclipseTestRunner.run(EclipseTestRunner.java:204)
at org.eclipse.test.UITestApplication$3.run(UITestApplication.java:195)
at org.eclipse.swt.widgets.RunnableLock.run(RunnableLock.java:35)
at org.eclipse.swt.widgets.Synchronizer.runAsyncMessages(Synchronizer.java:134)
at org.eclipse.swt.widgets.Display.runAsyncMessages(Display.java:3468)
at org.eclipse.swt.widgets.Display.readAndDispatch(Display.java:3115)
at org.eclipse.ui.internal.Workbench.runEventLoop(Workbench.java:2405)
at org.eclipse.ui.internal.Workbench.runUI(Workbench.java:2369)
at org.eclipse.ui.internal.Workbench.access$4(Workbench.java:2221)
at org.eclipse.ui.internal.Workbench$5.run(Workbench.java:500)
at org.eclipse.core.databinding.observable.Realm.runWithDefault(Realm.java:332)
at org.eclipse.ui.internal.Workbench.createAndRunWorkbench(Workbench.java:493)
at org.eclipse.ui.PlatformUI.createAndRunWorkbench(PlatformUI.java:149)
at org.eclipse.ui.internal.ide.application.IDEApplication.start(IDEApplication.java:113)
at org.eclipse.test.UITestApplication.runApplication(UITestApplication.java:138)
at org.eclipse.test.UITestApplication.run(UITestApplication.java:60)
at org.eclipse.test.UITestApplication.start(UITestApplication.java:210)
at org.eclipse.equinox.internal.app.EclipseAppHandle.run(EclipseAppHandle.java:194)
at
org.eclipse.core.runtime.internal.adaptor.EclipseAppLauncher.runApplication(EclipseAppLauncher.java:110)
at
org.eclipse.core.runtime.internal.adaptor.EclipseAppLauncher.start(EclipseAppLauncher.java:79)
at org.eclipse.core.runtime.adaptor.EclipseStarter.run(EclipseStarter.java:368)
at org.eclipse.core.runtime.adaptor.EclipseStarter.run(EclipseStarter.java:179)
at org.eclipse.equinox.launcher.Main.invokeFramework(Main.java:559)
at org.eclipse.equinox.launcher.Main.basicRun(Main.java:514)
at org.eclipse.equinox.launcher.Main.run(Main.java:1311)
at org.eclipse.equinox.launcher.Main.main(Main.java:1287)
at org.eclipse.core.launcher.Main.main(Main.java:34)
Caused by: java.lang.Exception: Could not find plugin
"org.jboss.tools.seam.core.test"
at org.eclipse.test.EclipseTestRunner.loadSuiteClass(EclipseTestRunner.java:304)
at org.eclipse.test.EclipseTestRunner.getTest(EclipseTestRunner.java:237)
FAILED: org.jboss.tools.seam.core.test.refactoring.SeamRefactoringAllTests
Error Message:
java.lang.Exception: Could not find plugin "org.jboss.tools.seam.core.test"
Stack Trace:
org.eclipse.test.EclipseTestRunner$TestFailedException: java.lang.Exception: Could not
find plugin "org.jboss.tools.seam.core.test"
at org.eclipse.test.EclipseTestRunner.runFailed(EclipseTestRunner.java:288)
at org.eclipse.test.EclipseTestRunner.getTest(EclipseTestRunner.java:240)
at org.eclipse.test.EclipseTestRunner.<init>(EclipseTestRunner.java:220)
at org.eclipse.test.EclipseTestRunner.run(EclipseTestRunner.java:204)
at org.eclipse.test.UITestApplication$3.run(UITestApplication.java:195)
at org.eclipse.swt.widgets.RunnableLock.run(RunnableLock.java:35)
at org.eclipse.swt.widgets.Synchronizer.runAsyncMessages(Synchronizer.java:134)
at org.eclipse.swt.widgets.Display.runAsyncMessages(Display.java:3468)
at org.eclipse.swt.widgets.Display.readAndDispatch(Display.java:3115)
at org.eclipse.ui.internal.Workbench.runEventLoop(Workbench.java:2405)
at org.eclipse.ui.internal.Workbench.runUI(Workbench.java:2369)
at org.eclipse.ui.internal.Workbench.access$4(Workbench.java:2221)
at org.eclipse.ui.internal.Workbench$5.run(Workbench.java:500)
at org.eclipse.core.databinding.observable.Realm.runWithDefault(Realm.java:332)
at org.eclipse.ui.internal.Workbench.createAndRunWorkbench(Workbench.java:493)
at org.eclipse.ui.PlatformUI.createAndRunWorkbench(PlatformUI.java:149)
at org.eclipse.ui.internal.ide.application.IDEApplication.start(IDEApplication.java:113)
at org.eclipse.test.UITestApplication.runApplication(UITestApplication.java:138)
at org.eclipse.test.UITestApplication.run(UITestApplication.java:60)
at org.eclipse.test.UITestApplication.start(UITestApplication.java:210)
at org.eclipse.equinox.internal.app.EclipseAppHandle.run(EclipseAppHandle.java:194)
at
org.eclipse.core.runtime.internal.adaptor.EclipseAppLauncher.runApplication(EclipseAppLauncher.java:110)
at
org.eclipse.core.runtime.internal.adaptor.EclipseAppLauncher.start(EclipseAppLauncher.java:79)
at org.eclipse.core.runtime.adaptor.EclipseStarter.run(EclipseStarter.java:368)
at org.eclipse.core.runtime.adaptor.EclipseStarter.run(EclipseStarter.java:179)
at org.eclipse.equinox.launcher.Main.invokeFramework(Main.java:559)
at org.eclipse.equinox.launcher.Main.basicRun(Main.java:514)
at org.eclipse.equinox.launcher.Main.run(Main.java:1311)
at org.eclipse.equinox.launcher.Main.main(Main.java:1287)
at org.eclipse.core.launcher.Main.main(Main.java:34)
Caused by: java.lang.Exception: Could not find plugin
"org.jboss.tools.seam.core.test"
at org.eclipse.test.EclipseTestRunner.loadSuiteClass(EclipseTestRunner.java:304)
at org.eclipse.test.EclipseTestRunner.getTest(EclipseTestRunner.java:237)
FAILED: org.jboss.tools.seam.pages.xml.test.SeamPagesXMLAllTests
Error Message:
java.lang.Exception: Could not find plugin
"org.jboss.tools.seam.pages.xml.test"
Stack Trace:
org.eclipse.test.EclipseTestRunner$TestFailedException: java.lang.Exception: Could not
find plugin "org.jboss.tools.seam.pages.xml.test"
at org.eclipse.test.EclipseTestRunner.runFailed(EclipseTestRunner.java:288)
at org.eclipse.test.EclipseTestRunner.getTest(EclipseTestRunner.java:240)
at org.eclipse.test.EclipseTestRunner.<init>(EclipseTestRunner.java:220)
at org.eclipse.test.EclipseTestRunner.run(EclipseTestRunner.java:204)
at org.eclipse.test.UITestApplication$3.run(UITestApplication.java:195)
at org.eclipse.swt.widgets.RunnableLock.run(RunnableLock.java:35)
at org.eclipse.swt.widgets.Synchronizer.runAsyncMessages(Synchronizer.java:134)
at org.eclipse.swt.widgets.Display.runAsyncMessages(Display.java:3468)
at org.eclipse.swt.widgets.Display.readAndDispatch(Display.java:3115)
at org.eclipse.ui.internal.Workbench.runEventLoop(Workbench.java:2405)
at org.eclipse.ui.internal.Workbench.runUI(Workbench.java:2369)
at org.eclipse.ui.internal.Workbench.access$4(Workbench.java:2221)
at org.eclipse.ui.internal.Workbench$5.run(Workbench.java:500)
at org.eclipse.core.databinding.observable.Realm.runWithDefault(Realm.java:332)
at org.eclipse.ui.internal.Workbench.createAndRunWorkbench(Workbench.java:493)
at org.eclipse.ui.PlatformUI.createAndRunWorkbench(PlatformUI.java:149)
at org.eclipse.ui.internal.ide.application.IDEApplication.start(IDEApplication.java:113)
at org.eclipse.test.UITestApplication.runApplication(UITestApplication.java:138)
at org.eclipse.test.UITestApplication.run(UITestApplication.java:60)
at org.eclipse.test.UITestApplication.start(UITestApplication.java:210)
at org.eclipse.equinox.internal.app.EclipseAppHandle.run(EclipseAppHandle.java:194)
at
org.eclipse.core.runtime.internal.adaptor.EclipseAppLauncher.runApplication(EclipseAppLauncher.java:110)
at
org.eclipse.core.runtime.internal.adaptor.EclipseAppLauncher.start(EclipseAppLauncher.java:79)
at org.eclipse.core.runtime.adaptor.EclipseStarter.run(EclipseStarter.java:368)
at org.eclipse.core.runtime.adaptor.EclipseStarter.run(EclipseStarter.java:179)
at org.eclipse.equinox.launcher.Main.invokeFramework(Main.java:559)
at org.eclipse.equinox.launcher.Main.basicRun(Main.java:514)
at org.eclipse.equinox.launcher.Main.run(Main.java:1311)
at org.eclipse.equinox.launcher.Main.main(Main.java:1287)
at org.eclipse.core.launcher.Main.main(Main.java:34)
Caused by: java.lang.Exception: Could not find plugin
"org.jboss.tools.seam.pages.xml.test"
at org.eclipse.test.EclipseTestRunner.loadSuiteClass(EclipseTestRunner.java:304)
at org.eclipse.test.EclipseTestRunner.getTest(EclipseTestRunner.java:237)
FAILED: org.jboss.tools.seam.ui.test.SeamUiAllTests
Error Message:
java.lang.Exception: Could not find plugin "org.jboss.tools.seam.ui.test"
Stack Trace:
org.eclipse.test.EclipseTestRunner$TestFailedException: java.lang.Exception: Could not
find plugin "org.jboss.tools.seam.ui.test"
at org.eclipse.test.EclipseTestRunner.runFailed(EclipseTestRunner.java:288)
at org.eclipse.test.EclipseTestRunner.getTest(EclipseTestRunner.java:240)
at org.eclipse.test.EclipseTestRunner.<init>(EclipseTestRunner.java:220)
at org.eclipse.test.EclipseTestRunner.run(EclipseTestRunner.java:204)
at org.eclipse.test.UITestApplication$3.run(UITestApplication.java:195)
at org.eclipse.swt.widgets.RunnableLock.run(RunnableLock.java:35)
at org.eclipse.swt.widgets.Synchronizer.runAsyncMessages(Synchronizer.java:134)
at org.eclipse.swt.widgets.Display.runAsyncMessages(Display.java:3468)
at org.eclipse.swt.widgets.Display.readAndDispatch(Display.java:3115)
at org.eclipse.ui.internal.Workbench.runEventLoop(Workbench.java:2405)
at org.eclipse.ui.internal.Workbench.runUI(Workbench.java:2369)
at org.eclipse.ui.internal.Workbench.access$4(Workbench.java:2221)
at org.eclipse.ui.internal.Workbench$5.run(Workbench.java:500)
at org.eclipse.core.databinding.observable.Realm.runWithDefault(Realm.java:332)
at org.eclipse.ui.internal.Workbench.createAndRunWorkbench(Workbench.java:493)
at org.eclipse.ui.PlatformUI.createAndRunWorkbench(PlatformUI.java:149)
at org.eclipse.ui.internal.ide.application.IDEApplication.start(IDEApplication.java:113)
at org.eclipse.test.UITestApplication.runApplication(UITestApplication.java:138)
at org.eclipse.test.UITestApplication.run(UITestApplication.java:60)
at org.eclipse.test.UITestApplication.start(UITestApplication.java:210)
at org.eclipse.equinox.internal.app.EclipseAppHandle.run(EclipseAppHandle.java:194)
at
org.eclipse.core.runtime.internal.adaptor.EclipseAppLauncher.runApplication(EclipseAppLauncher.java:110)
at
org.eclipse.core.runtime.internal.adaptor.EclipseAppLauncher.start(EclipseAppLauncher.java:79)
at org.eclipse.core.runtime.adaptor.EclipseStarter.run(EclipseStarter.java:368)
at org.eclipse.core.runtime.adaptor.EclipseStarter.run(EclipseStarter.java:179)
at org.eclipse.equinox.launcher.Main.invokeFramework(Main.java:559)
at org.eclipse.equinox.launcher.Main.basicRun(Main.java:514)
at org.eclipse.equinox.launcher.Main.run(Main.java:1311)
at org.eclipse.equinox.launcher.Main.main(Main.java:1287)
at org.eclipse.core.launcher.Main.main(Main.java:34)
Caused by: java.lang.Exception: Could not find plugin
"org.jboss.tools.seam.ui.test"
at org.eclipse.test.EclipseTestRunner.loadSuiteClass(EclipseTestRunner.java:304)
at org.eclipse.test.EclipseTestRunner.getTest(EclipseTestRunner.java:237)
FAILED: org.jboss.tools.seam.ui.test.wizard.Seam12XOperationsTestSuite121EAP
Error Message:
java.lang.Exception: Could not find plugin "org.jboss.tools.seam.ui.test"
Stack Trace:
org.eclipse.test.EclipseTestRunner$TestFailedException: java.lang.Exception: Could not
find plugin "org.jboss.tools.seam.ui.test"
at org.eclipse.test.EclipseTestRunner.runFailed(EclipseTestRunner.java:288)
at org.eclipse.test.EclipseTestRunner.getTest(EclipseTestRunner.java:240)
at org.eclipse.test.EclipseTestRunner.<init>(EclipseTestRunner.java:220)
at org.eclipse.test.EclipseTestRunner.run(EclipseTestRunner.java:204)
at org.eclipse.test.UITestApplication$3.run(UITestApplication.java:195)
at org.eclipse.swt.widgets.RunnableLock.run(RunnableLock.java:35)
at org.eclipse.swt.widgets.Synchronizer.runAsyncMessages(Synchronizer.java:134)
at org.eclipse.swt.widgets.Display.runAsyncMessages(Display.java:3468)
at org.eclipse.swt.widgets.Display.readAndDispatch(Display.java:3115)
at org.eclipse.ui.internal.Workbench.runEventLoop(Workbench.java:2405)
at org.eclipse.ui.internal.Workbench.runUI(Workbench.java:2369)
at org.eclipse.ui.internal.Workbench.access$4(Workbench.java:2221)
at org.eclipse.ui.internal.Workbench$5.run(Workbench.java:500)
at org.eclipse.core.databinding.observable.Realm.runWithDefault(Realm.java:332)
at org.eclipse.ui.internal.Workbench.createAndRunWorkbench(Workbench.java:493)
at org.eclipse.ui.PlatformUI.createAndRunWorkbench(PlatformUI.java:149)
at org.eclipse.ui.internal.ide.application.IDEApplication.start(IDEApplication.java:113)
at org.eclipse.test.UITestApplication.runApplication(UITestApplication.java:138)
at org.eclipse.test.UITestApplication.run(UITestApplication.java:60)
at org.eclipse.test.UITestApplication.start(UITestApplication.java:210)
at org.eclipse.equinox.internal.app.EclipseAppHandle.run(EclipseAppHandle.java:194)
at
org.eclipse.core.runtime.internal.adaptor.EclipseAppLauncher.runApplication(EclipseAppLauncher.java:110)
at
org.eclipse.core.runtime.internal.adaptor.EclipseAppLauncher.start(EclipseAppLauncher.java:79)
at org.eclipse.core.runtime.adaptor.EclipseStarter.run(EclipseStarter.java:368)
at org.eclipse.core.runtime.adaptor.EclipseStarter.run(EclipseStarter.java:179)
at org.eclipse.equinox.launcher.Main.invokeFramework(Main.java:559)
at org.eclipse.equinox.launcher.Main.basicRun(Main.java:514)
at org.eclipse.equinox.launcher.Main.run(Main.java:1311)
at org.eclipse.equinox.launcher.Main.main(Main.java:1287)
at org.eclipse.core.launcher.Main.main(Main.java:34)
Caused by: java.lang.Exception: Could not find plugin
"org.jboss.tools.seam.ui.test"
at org.eclipse.test.EclipseTestRunner.loadSuiteClass(EclipseTestRunner.java:304)
at org.eclipse.test.EclipseTestRunner.getTest(EclipseTestRunner.java:237)
FAILED: org.jboss.tools.seam.ui.test.wizard.Seam20XOperationsTestSuite201GA
Error Message:
java.lang.Exception: Could not find plugin "org.jboss.tools.seam.ui.test"
Stack Trace:
org.eclipse.test.EclipseTestRunner$TestFailedException: java.lang.Exception: Could not
find plugin "org.jboss.tools.seam.ui.test"
at org.eclipse.test.EclipseTestRunner.runFailed(EclipseTestRunner.java:288)
at org.eclipse.test.EclipseTestRunner.getTest(EclipseTestRunner.java:240)
at org.eclipse.test.EclipseTestRunner.<init>(EclipseTestRunner.java:220)
at org.eclipse.test.EclipseTestRunner.run(EclipseTestRunner.java:204)
at org.eclipse.test.UITestApplication$3.run(UITestApplication.java:195)
at org.eclipse.swt.widgets.RunnableLock.run(RunnableLock.java:35)
at org.eclipse.swt.widgets.Synchronizer.runAsyncMessages(Synchronizer.java:134)
at org.eclipse.swt.widgets.Display.runAsyncMessages(Display.java:3468)
at org.eclipse.swt.widgets.Display.readAndDispatch(Display.java:3115)
at org.eclipse.ui.internal.Workbench.runEventLoop(Workbench.java:2405)
at org.eclipse.ui.internal.Workbench.runUI(Workbench.java:2369)
at org.eclipse.ui.internal.Workbench.access$4(Workbench.java:2221)
at org.eclipse.ui.internal.Workbench$5.run(Workbench.java:500)
at org.eclipse.core.databinding.observable.Realm.runWithDefault(Realm.java:332)
at org.eclipse.ui.internal.Workbench.createAndRunWorkbench(Workbench.java:493)
at org.eclipse.ui.PlatformUI.createAndRunWorkbench(PlatformUI.java:149)
at org.eclipse.ui.internal.ide.application.IDEApplication.start(IDEApplication.java:113)
at org.eclipse.test.UITestApplication.runApplication(UITestApplication.java:138)
at org.eclipse.test.UITestApplication.run(UITestApplication.java:60)
at org.eclipse.test.UITestApplication.start(UITestApplication.java:210)
at org.eclipse.equinox.internal.app.EclipseAppHandle.run(EclipseAppHandle.java:194)
at
org.eclipse.core.runtime.internal.adaptor.EclipseAppLauncher.runApplication(EclipseAppLauncher.java:110)
at
org.eclipse.core.runtime.internal.adaptor.EclipseAppLauncher.start(EclipseAppLauncher.java:79)
at org.eclipse.core.runtime.adaptor.EclipseStarter.run(EclipseStarter.java:368)
at org.eclipse.core.runtime.adaptor.EclipseStarter.run(EclipseStarter.java:179)
at org.eclipse.equinox.launcher.Main.invokeFramework(Main.java:559)
at org.eclipse.equinox.launcher.Main.basicRun(Main.java:514)
at org.eclipse.equinox.launcher.Main.run(Main.java:1311)
at org.eclipse.equinox.launcher.Main.main(Main.java:1287)
at org.eclipse.core.launcher.Main.main(Main.java:34)
Caused by: java.lang.Exception: Could not find plugin
"org.jboss.tools.seam.ui.test"
at org.eclipse.test.EclipseTestRunner.loadSuiteClass(EclipseTestRunner.java:304)
at org.eclipse.test.EclipseTestRunner.getTest(EclipseTestRunner.java:237)
FAILED: org.jboss.tools.seam.ui.test.wizard.Seam20XOperationsTestSuite202SP1
Error Message:
java.lang.Exception: Could not find plugin "org.jboss.tools.seam.ui.test"
Stack Trace:
org.eclipse.test.EclipseTestRunner$TestFailedException: java.lang.Exception: Could not
find plugin "org.jboss.tools.seam.ui.test"
at org.eclipse.test.EclipseTestRunner.runFailed(EclipseTestRunner.java:288)
at org.eclipse.test.EclipseTestRunner.getTest(EclipseTestRunner.java:240)
at org.eclipse.test.EclipseTestRunner.<init>(EclipseTestRunner.java:220)
at org.eclipse.test.EclipseTestRunner.run(EclipseTestRunner.java:204)
at org.eclipse.test.UITestApplication$3.run(UITestApplication.java:195)
at org.eclipse.swt.widgets.RunnableLock.run(RunnableLock.java:35)
at org.eclipse.swt.widgets.Synchronizer.runAsyncMessages(Synchronizer.java:134)
at org.eclipse.swt.widgets.Display.runAsyncMessages(Display.java:3468)
at org.eclipse.swt.widgets.Display.readAndDispatch(Display.java:3115)
at org.eclipse.ui.internal.Workbench.runEventLoop(Workbench.java:2405)
at org.eclipse.ui.internal.Workbench.runUI(Workbench.java:2369)
at org.eclipse.ui.internal.Workbench.access$4(Workbench.java:2221)
at org.eclipse.ui.internal.Workbench$5.run(Workbench.java:500)
at org.eclipse.core.databinding.observable.Realm.runWithDefault(Realm.java:332)
at org.eclipse.ui.internal.Workbench.createAndRunWorkbench(Workbench.java:493)
at org.eclipse.ui.PlatformUI.createAndRunWorkbench(PlatformUI.java:149)
at org.eclipse.ui.internal.ide.application.IDEApplication.start(IDEApplication.java:113)
at org.eclipse.test.UITestApplication.runApplication(UITestApplication.java:138)
at org.eclipse.test.UITestApplication.run(UITestApplication.java:60)
at org.eclipse.test.UITestApplication.start(UITestApplication.java:210)
at org.eclipse.equinox.internal.app.EclipseAppHandle.run(EclipseAppHandle.java:194)
at
org.eclipse.core.runtime.internal.adaptor.EclipseAppLauncher.runApplication(EclipseAppLauncher.java:110)
at
org.eclipse.core.runtime.internal.adaptor.EclipseAppLauncher.start(EclipseAppLauncher.java:79)
at org.eclipse.core.runtime.adaptor.EclipseStarter.run(EclipseStarter.java:368)
at org.eclipse.core.runtime.adaptor.EclipseStarter.run(EclipseStarter.java:179)
at org.eclipse.equinox.launcher.Main.invokeFramework(Main.java:559)
at org.eclipse.equinox.launcher.Main.basicRun(Main.java:514)
at org.eclipse.equinox.launcher.Main.run(Main.java:1311)
at org.eclipse.equinox.launcher.Main.main(Main.java:1287)
at org.eclipse.core.launcher.Main.main(Main.java:34)
Caused by: java.lang.Exception: Could not find plugin
"org.jboss.tools.seam.ui.test"
at org.eclipse.test.EclipseTestRunner.loadSuiteClass(EclipseTestRunner.java:304)
at org.eclipse.test.EclipseTestRunner.getTest(EclipseTestRunner.java:237)
FAILED: org.jboss.tools.seam.ui.test.wizard.Seam20XOperationsTestSuite203CR1
Error Message:
java.lang.Exception: Could not find plugin "org.jboss.tools.seam.ui.test"
Stack Trace:
org.eclipse.test.EclipseTestRunner$TestFailedException: java.lang.Exception: Could not
find plugin "org.jboss.tools.seam.ui.test"
at org.eclipse.test.EclipseTestRunner.runFailed(EclipseTestRunner.java:288)
at org.eclipse.test.EclipseTestRunner.getTest(EclipseTestRunner.java:240)
at org.eclipse.test.EclipseTestRunner.<init>(EclipseTestRunner.java:220)
at org.eclipse.test.EclipseTestRunner.run(EclipseTestRunner.java:204)
at org.eclipse.test.UITestApplication$3.run(UITestApplication.java:195)
at org.eclipse.swt.widgets.RunnableLock.run(RunnableLock.java:35)
at org.eclipse.swt.widgets.Synchronizer.runAsyncMessages(Synchronizer.java:134)
at org.eclipse.swt.widgets.Display.runAsyncMessages(Display.java:3468)
at org.eclipse.swt.widgets.Display.readAndDispatch(Display.java:3115)
at org.eclipse.ui.internal.Workbench.runEventLoop(Workbench.java:2405)
at org.eclipse.ui.internal.Workbench.runUI(Workbench.java:2369)
at org.eclipse.ui.internal.Workbench.access$4(Workbench.java:2221)
at org.eclipse.ui.internal.Workbench$5.run(Workbench.java:500)
at org.eclipse.core.databinding.observable.Realm.runWithDefault(Realm.java:332)
at org.eclipse.ui.internal.Workbench.createAndRunWorkbench(Workbench.java:493)
at org.eclipse.ui.PlatformUI.createAndRunWorkbench(PlatformUI.java:149)
at org.eclipse.ui.internal.ide.application.IDEApplication.start(IDEApplication.java:113)
at org.eclipse.test.UITestApplication.runApplication(UITestApplication.java:138)
at org.eclipse.test.UITestApplication.run(UITestApplication.java:60)
at org.eclipse.test.UITestApplication.start(UITestApplication.java:210)
at org.eclipse.equinox.internal.app.EclipseAppHandle.run(EclipseAppHandle.java:194)
at
org.eclipse.core.runtime.internal.adaptor.EclipseAppLauncher.runApplication(EclipseAppLauncher.java:110)
at
org.eclipse.core.runtime.internal.adaptor.EclipseAppLauncher.start(EclipseAppLauncher.java:79)
at org.eclipse.core.runtime.adaptor.EclipseStarter.run(EclipseStarter.java:368)
at org.eclipse.core.runtime.adaptor.EclipseStarter.run(EclipseStarter.java:179)
at org.eclipse.equinox.launcher.Main.invokeFramework(Main.java:559)
at org.eclipse.equinox.launcher.Main.basicRun(Main.java:514)
at org.eclipse.equinox.launcher.Main.run(Main.java:1311)
at org.eclipse.equinox.launcher.Main.main(Main.java:1287)
at org.eclipse.core.launcher.Main.main(Main.java:34)
Caused by: java.lang.Exception: Could not find plugin
"org.jboss.tools.seam.ui.test"
at org.eclipse.test.EclipseTestRunner.loadSuiteClass(EclipseTestRunner.java:304)
at org.eclipse.test.EclipseTestRunner.getTest(EclipseTestRunner.java:237)
FAILED: org.jboss.tools.seam.ui.test.wizard.Seam20XOperationsTestSuiteFP
Error Message:
java.lang.Exception: Could not find plugin "org.jboss.tools.seam.ui.test"
Stack Trace:
org.eclipse.test.EclipseTestRunner$TestFailedException: java.lang.Exception: Could not
find plugin "org.jboss.tools.seam.ui.test"
at org.eclipse.test.EclipseTestRunner.runFailed(EclipseTestRunner.java:288)
at org.eclipse.test.EclipseTestRunner.getTest(EclipseTestRunner.java:240)
at org.eclipse.test.EclipseTestRunner.<init>(EclipseTestRunner.java:220)
at org.eclipse.test.EclipseTestRunner.run(EclipseTestRunner.java:204)
at org.eclipse.test.UITestApplication$3.run(UITestApplication.java:195)
at org.eclipse.swt.widgets.RunnableLock.run(RunnableLock.java:35)
at org.eclipse.swt.widgets.Synchronizer.runAsyncMessages(Synchronizer.java:134)
at org.eclipse.swt.widgets.Display.runAsyncMessages(Display.java:3468)
at org.eclipse.swt.widgets.Display.readAndDispatch(Display.java:3115)
at org.eclipse.ui.internal.Workbench.runEventLoop(Workbench.java:2405)
at org.eclipse.ui.internal.Workbench.runUI(Workbench.java:2369)
at org.eclipse.ui.internal.Workbench.access$4(Workbench.java:2221)
at org.eclipse.ui.internal.Workbench$5.run(Workbench.java:500)
at org.eclipse.core.databinding.observable.Realm.runWithDefault(Realm.java:332)
at org.eclipse.ui.internal.Workbench.createAndRunWorkbench(Workbench.java:493)
at org.eclipse.ui.PlatformUI.createAndRunWorkbench(PlatformUI.java:149)
at org.eclipse.ui.internal.ide.application.IDEApplication.start(IDEApplication.java:113)
at org.eclipse.test.UITestApplication.runApplication(UITestApplication.java:138)
at org.eclipse.test.UITestApplication.run(UITestApplication.java:60)
at org.eclipse.test.UITestApplication.start(UITestApplication.java:210)
at org.eclipse.equinox.internal.app.EclipseAppHandle.run(EclipseAppHandle.java:194)
at
org.eclipse.core.runtime.internal.adaptor.EclipseAppLauncher.runApplication(EclipseAppLauncher.java:110)
at
org.eclipse.core.runtime.internal.adaptor.EclipseAppLauncher.start(EclipseAppLauncher.java:79)
at org.eclipse.core.runtime.adaptor.EclipseStarter.run(EclipseStarter.java:368)
at org.eclipse.core.runtime.adaptor.EclipseStarter.run(EclipseStarter.java:179)
at org.eclipse.equinox.launcher.Main.invokeFramework(Main.java:559)
at org.eclipse.equinox.launcher.Main.basicRun(Main.java:514)
at org.eclipse.equinox.launcher.Main.run(Main.java:1311)
at org.eclipse.equinox.launcher.Main.main(Main.java:1287)
at org.eclipse.core.launcher.Main.main(Main.java:34)
Caused by: java.lang.Exception: Could not find plugin
"org.jboss.tools.seam.ui.test"
at org.eclipse.test.EclipseTestRunner.loadSuiteClass(EclipseTestRunner.java:304)
at org.eclipse.test.EclipseTestRunner.getTest(EclipseTestRunner.java:237)
FAILED: org.jboss.tools.struts.vpe.struts.test.StrutsAllTests
Error Message:
java.lang.Exception: Could not find plugin
"org.jboss.tools.struts.vpe.struts.test"
Stack Trace:
org.eclipse.test.EclipseTestRunner$TestFailedException: java.lang.Exception: Could not
find plugin "org.jboss.tools.struts.vpe.struts.test"
at org.eclipse.test.EclipseTestRunner.runFailed(EclipseTestRunner.java:288)
at org.eclipse.test.EclipseTestRunner.getTest(EclipseTestRunner.java:240)
at org.eclipse.test.EclipseTestRunner.<init>(EclipseTestRunner.java:220)
at org.eclipse.test.EclipseTestRunner.run(EclipseTestRunner.java:204)
at org.eclipse.test.UITestApplication$3.run(UITestApplication.java:195)
at org.eclipse.swt.widgets.RunnableLock.run(RunnableLock.java:35)
at org.eclipse.swt.widgets.Synchronizer.runAsyncMessages(Synchronizer.java:134)
at org.eclipse.swt.widgets.Display.runAsyncMessages(Display.java:3468)
at org.eclipse.swt.widgets.Display.readAndDispatch(Display.java:3115)
at org.eclipse.ui.internal.Workbench.runEventLoop(Workbench.java:2405)
at org.eclipse.ui.internal.Workbench.runUI(Workbench.java:2369)
at org.eclipse.ui.internal.Workbench.access$4(Workbench.java:2221)
at org.eclipse.ui.internal.Workbench$5.run(Workbench.java:500)
at org.eclipse.core.databinding.observable.Realm.runWithDefault(Realm.java:332)
at org.eclipse.ui.internal.Workbench.createAndRunWorkbench(Workbench.java:493)
at org.eclipse.ui.PlatformUI.createAndRunWorkbench(PlatformUI.java:149)
at org.eclipse.ui.internal.ide.application.IDEApplication.start(IDEApplication.java:113)
at org.eclipse.test.UITestApplication.runApplication(UITestApplication.java:138)
at org.eclipse.test.UITestApplication.run(UITestApplication.java:60)
at org.eclipse.test.UITestApplication.start(UITestApplication.java:210)
at org.eclipse.equinox.internal.app.EclipseAppHandle.run(EclipseAppHandle.java:194)
at
org.eclipse.core.runtime.internal.adaptor.EclipseAppLauncher.runApplication(EclipseAppLauncher.java:110)
at
org.eclipse.core.runtime.internal.adaptor.EclipseAppLauncher.start(EclipseAppLauncher.java:79)
at org.eclipse.core.runtime.adaptor.EclipseStarter.run(EclipseStarter.java:368)
at org.eclipse.core.runtime.adaptor.EclipseStarter.run(EclipseStarter.java:179)
at org.eclipse.equinox.launcher.Main.invokeFramework(Main.java:559)
at org.eclipse.equinox.launcher.Main.basicRun(Main.java:514)
at org.eclipse.equinox.launcher.Main.run(Main.java:1311)
at org.eclipse.equinox.launcher.Main.main(Main.java:1287)
at org.eclipse.core.launcher.Main.main(Main.java:34)
Caused by: java.lang.Exception: Could not find plugin
"org.jboss.tools.struts.vpe.struts.test"
at org.eclipse.test.EclipseTestRunner.loadSuiteClass(EclipseTestRunner.java:304)
at org.eclipse.test.EclipseTestRunner.getTest(EclipseTestRunner.java:237)
FAILED: org.jboss.tools.tests.ToolsAllTests
Error Message:
java.lang.Exception: Could not find plugin "org.jboss.tools.tests"
Stack Trace:
org.eclipse.test.EclipseTestRunner$TestFailedException: java.lang.Exception: Could not
find plugin "org.jboss.tools.tests"
at org.eclipse.test.EclipseTestRunner.runFailed(EclipseTestRunner.java:288)
at org.eclipse.test.EclipseTestRunner.getTest(EclipseTestRunner.java:240)
at org.eclipse.test.EclipseTestRunner.<init>(EclipseTestRunner.java:220)
at org.eclipse.test.EclipseTestRunner.run(EclipseTestRunner.java:204)
at org.eclipse.test.UITestApplication$3.run(UITestApplication.java:195)
at org.eclipse.swt.widgets.RunnableLock.run(RunnableLock.java:35)
at org.eclipse.swt.widgets.Synchronizer.runAsyncMessages(Synchronizer.java:134)
at org.eclipse.swt.widgets.Display.runAsyncMessages(Display.java:3468)
at org.eclipse.swt.widgets.Display.readAndDispatch(Display.java:3115)
at org.eclipse.ui.internal.Workbench.runEventLoop(Workbench.java:2405)
at org.eclipse.ui.internal.Workbench.runUI(Workbench.java:2369)
at org.eclipse.ui.internal.Workbench.access$4(Workbench.java:2221)
at org.eclipse.ui.internal.Workbench$5.run(Workbench.java:500)
at org.eclipse.core.databinding.observable.Realm.runWithDefault(Realm.java:332)
at org.eclipse.ui.internal.Workbench.createAndRunWorkbench(Workbench.java:493)
at org.eclipse.ui.PlatformUI.createAndRunWorkbench(PlatformUI.java:149)
at org.eclipse.ui.internal.ide.application.IDEApplication.start(IDEApplication.java:113)
at org.eclipse.test.UITestApplication.runApplication(UITestApplication.java:138)
at org.eclipse.test.UITestApplication.run(UITestApplication.java:60)
at org.eclipse.test.UITestApplication.start(UITestApplication.java:210)
at org.eclipse.equinox.internal.app.EclipseAppHandle.run(EclipseAppHandle.java:194)
at
org.eclipse.core.runtime.internal.adaptor.EclipseAppLauncher.runApplication(EclipseAppLauncher.java:110)
at
org.eclipse.core.runtime.internal.adaptor.EclipseAppLauncher.start(EclipseAppLauncher.java:79)
at org.eclipse.core.runtime.adaptor.EclipseStarter.run(EclipseStarter.java:368)
at org.eclipse.core.runtime.adaptor.EclipseStarter.run(EclipseStarter.java:179)
at org.eclipse.equinox.launcher.Main.invokeFramework(Main.java:559)
at org.eclipse.equinox.launcher.Main.basicRun(Main.java:514)
at org.eclipse.equinox.launcher.Main.run(Main.java:1311)
at org.eclipse.equinox.launcher.Main.main(Main.java:1287)
at org.eclipse.core.launcher.Main.main(Main.java:34)
Caused by: java.lang.Exception: Could not find plugin "org.jboss.tools.tests"
at org.eclipse.test.EclipseTestRunner.loadSuiteClass(EclipseTestRunner.java:304)
at org.eclipse.test.EclipseTestRunner.getTest(EclipseTestRunner.java:237)
FAILED: org.jboss.tools.vpe.html.test.HtmlAllTests
Error Message:
java.lang.Exception: Could not find plugin "org.jboss.tools.vpe.html.test"
Stack Trace:
org.eclipse.test.EclipseTestRunner$TestFailedException: java.lang.Exception: Could not
find plugin "org.jboss.tools.vpe.html.test"
at org.eclipse.test.EclipseTestRunner.runFailed(EclipseTestRunner.java:288)
at org.eclipse.test.EclipseTestRunner.getTest(EclipseTestRunner.java:240)
at org.eclipse.test.EclipseTestRunner.<init>(EclipseTestRunner.java:220)
at org.eclipse.test.EclipseTestRunner.run(EclipseTestRunner.java:204)
at org.eclipse.test.UITestApplication$3.run(UITestApplication.java:195)
at org.eclipse.swt.widgets.RunnableLock.run(RunnableLock.java:35)
at org.eclipse.swt.widgets.Synchronizer.runAsyncMessages(Synchronizer.java:134)
at org.eclipse.swt.widgets.Display.runAsyncMessages(Display.java:3468)
at org.eclipse.swt.widgets.Display.readAndDispatch(Display.java:3115)
at org.eclipse.ui.internal.Workbench.runEventLoop(Workbench.java:2405)
at org.eclipse.ui.internal.Workbench.runUI(Workbench.java:2369)
at org.eclipse.ui.internal.Workbench.access$4(Workbench.java:2221)
at org.eclipse.ui.internal.Workbench$5.run(Workbench.java:500)
at org.eclipse.core.databinding.observable.Realm.runWithDefault(Realm.java:332)
at org.eclipse.ui.internal.Workbench.createAndRunWorkbench(Workbench.java:493)
at org.eclipse.ui.PlatformUI.createAndRunWorkbench(PlatformUI.java:149)
at org.eclipse.ui.internal.ide.application.IDEApplication.start(IDEApplication.java:113)
at org.eclipse.test.UITestApplication.runApplication(UITestApplication.java:138)
at org.eclipse.test.UITestApplication.run(UITestApplication.java:60)
at org.eclipse.test.UITestApplication.start(UITestApplication.java:210)
at org.eclipse.equinox.internal.app.EclipseAppHandle.run(EclipseAppHandle.java:194)
at
org.eclipse.core.runtime.internal.adaptor.EclipseAppLauncher.runApplication(EclipseAppLauncher.java:110)
at
org.eclipse.core.runtime.internal.adaptor.EclipseAppLauncher.start(EclipseAppLauncher.java:79)
at org.eclipse.core.runtime.adaptor.EclipseStarter.run(EclipseStarter.java:368)
at org.eclipse.core.runtime.adaptor.EclipseStarter.run(EclipseStarter.java:179)
at org.eclipse.equinox.launcher.Main.invokeFramework(Main.java:559)
at org.eclipse.equinox.launcher.Main.basicRun(Main.java:514)
at org.eclipse.equinox.launcher.Main.run(Main.java:1311)
at org.eclipse.equinox.launcher.Main.main(Main.java:1287)
at org.eclipse.core.launcher.Main.main(Main.java:34)
Caused by: java.lang.Exception: Could not find plugin
"org.jboss.tools.vpe.html.test"
at org.eclipse.test.EclipseTestRunner.loadSuiteClass(EclipseTestRunner.java:304)
at org.eclipse.test.EclipseTestRunner.getTest(EclipseTestRunner.java:237)
FAILED: org.jboss.tools.vpe.jsp.test.JSPAllTests
Error Message:
java.lang.Exception: Could not find plugin "org.jboss.tools.vpe.jsp.test"
Stack Trace:
org.eclipse.test.EclipseTestRunner$TestFailedException: java.lang.Exception: Could not
find plugin "org.jboss.tools.vpe.jsp.test"
at org.eclipse.test.EclipseTestRunner.runFailed(EclipseTestRunner.java:288)
at org.eclipse.test.EclipseTestRunner.getTest(EclipseTestRunner.java:240)
at org.eclipse.test.EclipseTestRunner.<init>(EclipseTestRunner.java:220)
at org.eclipse.test.EclipseTestRunner.run(EclipseTestRunner.java:204)
at org.eclipse.test.UITestApplication$3.run(UITestApplication.java:195)
at org.eclipse.swt.widgets.RunnableLock.run(RunnableLock.java:35)
at org.eclipse.swt.widgets.Synchronizer.runAsyncMessages(Synchronizer.java:134)
at org.eclipse.swt.widgets.Display.runAsyncMessages(Display.java:3468)
at org.eclipse.swt.widgets.Display.readAndDispatch(Display.java:3115)
at org.eclipse.ui.internal.Workbench.runEventLoop(Workbench.java:2405)
at org.eclipse.ui.internal.Workbench.runUI(Workbench.java:2369)
at org.eclipse.ui.internal.Workbench.access$4(Workbench.java:2221)
at org.eclipse.ui.internal.Workbench$5.run(Workbench.java:500)
at org.eclipse.core.databinding.observable.Realm.runWithDefault(Realm.java:332)
at org.eclipse.ui.internal.Workbench.createAndRunWorkbench(Workbench.java:493)
at org.eclipse.ui.PlatformUI.createAndRunWorkbench(PlatformUI.java:149)
at org.eclipse.ui.internal.ide.application.IDEApplication.start(IDEApplication.java:113)
at org.eclipse.test.UITestApplication.runApplication(UITestApplication.java:138)
at org.eclipse.test.UITestApplication.run(UITestApplication.java:60)
at org.eclipse.test.UITestApplication.start(UITestApplication.java:210)
at org.eclipse.equinox.internal.app.EclipseAppHandle.run(EclipseAppHandle.java:194)
at
org.eclipse.core.runtime.internal.adaptor.EclipseAppLauncher.runApplication(EclipseAppLauncher.java:110)
at
org.eclipse.core.runtime.internal.adaptor.EclipseAppLauncher.start(EclipseAppLauncher.java:79)
at org.eclipse.core.runtime.adaptor.EclipseStarter.run(EclipseStarter.java:368)
at org.eclipse.core.runtime.adaptor.EclipseStarter.run(EclipseStarter.java:179)
at org.eclipse.equinox.launcher.Main.invokeFramework(Main.java:559)
at org.eclipse.equinox.launcher.Main.basicRun(Main.java:514)
at org.eclipse.equinox.launcher.Main.run(Main.java:1311)
at org.eclipse.equinox.launcher.Main.main(Main.java:1287)
at org.eclipse.core.launcher.Main.main(Main.java:34)
Caused by: java.lang.Exception: Could not find plugin
"org.jboss.tools.vpe.jsp.test"
at org.eclipse.test.EclipseTestRunner.loadSuiteClass(EclipseTestRunner.java:304)
at org.eclipse.test.EclipseTestRunner.getTest(EclipseTestRunner.java:237)
FAILED: org.jboss.tools.vpe.test.VpeAllTests
Error Message:
java.lang.Exception: Could not find plugin "org.jboss.tools.vpe.test"
Stack Trace:
org.eclipse.test.EclipseTestRunner$TestFailedException: java.lang.Exception: Could not
find plugin "org.jboss.tools.vpe.test"
at org.eclipse.test.EclipseTestRunner.runFailed(EclipseTestRunner.java:288)
at org.eclipse.test.EclipseTestRunner.getTest(EclipseTestRunner.java:240)
at org.eclipse.test.EclipseTestRunner.<init>(EclipseTestRunner.java:220)
at org.eclipse.test.EclipseTestRunner.run(EclipseTestRunner.java:204)
at org.eclipse.test.UITestApplication$3.run(UITestApplication.java:195)
at org.eclipse.swt.widgets.RunnableLock.run(RunnableLock.java:35)
at org.eclipse.swt.widgets.Synchronizer.runAsyncMessages(Synchronizer.java:134)
at org.eclipse.swt.widgets.Display.runAsyncMessages(Display.java:3468)
at org.eclipse.swt.widgets.Display.readAndDispatch(Display.java:3115)
at org.eclipse.ui.internal.Workbench.runEventLoop(Workbench.java:2405)
at org.eclipse.ui.internal.Workbench.runUI(Workbench.java:2369)
at org.eclipse.ui.internal.Workbench.access$4(Workbench.java:2221)
at org.eclipse.ui.internal.Workbench$5.run(Workbench.java:500)
at org.eclipse.core.databinding.observable.Realm.runWithDefault(Realm.java:332)
at org.eclipse.ui.internal.Workbench.createAndRunWorkbench(Workbench.java:493)
at org.eclipse.ui.PlatformUI.createAndRunWorkbench(PlatformUI.java:149)
at org.eclipse.ui.internal.ide.application.IDEApplication.start(IDEApplication.java:113)
at org.eclipse.test.UITestApplication.runApplication(UITestApplication.java:138)
at org.eclipse.test.UITestApplication.run(UITestApplication.java:60)
at org.eclipse.test.UITestApplication.start(UITestApplication.java:210)
at org.eclipse.equinox.internal.app.EclipseAppHandle.run(EclipseAppHandle.java:194)
at
org.eclipse.core.runtime.internal.adaptor.EclipseAppLauncher.runApplication(EclipseAppLauncher.java:110)
at
org.eclipse.core.runtime.internal.adaptor.EclipseAppLauncher.start(EclipseAppLauncher.java:79)
at org.eclipse.core.runtime.adaptor.EclipseStarter.run(EclipseStarter.java:368)
at org.eclipse.core.runtime.adaptor.EclipseStarter.run(EclipseStarter.java:179)
at org.eclipse.equinox.launcher.Main.invokeFramework(Main.java:559)
at org.eclipse.equinox.launcher.Main.basicRun(Main.java:514)
at org.eclipse.equinox.launcher.Main.run(Main.java:1311)
at org.eclipse.equinox.launcher.Main.main(Main.java:1287)
at org.eclipse.core.launcher.Main.main(Main.java:34)
Caused by: java.lang.Exception: Could not find plugin
"org.jboss.tools.vpe.test"
at org.eclipse.test.EclipseTestRunner.loadSuiteClass(EclipseTestRunner.java:304)
at org.eclipse.test.EclipseTestRunner.getTest(EclipseTestRunner.java:237)
FAILED: org.jboss.tools.vpe.ui.test.VpeUiTests
Error Message:
java.lang.Exception: Could not find plugin "org.jboss.tools.vpe.ui.test"
Stack Trace:
org.eclipse.test.EclipseTestRunner$TestFailedException: java.lang.Exception: Could not
find plugin "org.jboss.tools.vpe.ui.test"
at org.eclipse.test.EclipseTestRunner.runFailed(EclipseTestRunner.java:288)
at org.eclipse.test.EclipseTestRunner.getTest(EclipseTestRunner.java:240)
at org.eclipse.test.EclipseTestRunner.<init>(EclipseTestRunner.java:220)
at org.eclipse.test.EclipseTestRunner.run(EclipseTestRunner.java:204)
at org.eclipse.test.UITestApplication$3.run(UITestApplication.java:195)
at org.eclipse.swt.widgets.RunnableLock.run(RunnableLock.java:35)
at org.eclipse.swt.widgets.Synchronizer.runAsyncMessages(Synchronizer.java:134)
at org.eclipse.swt.widgets.Display.runAsyncMessages(Display.java:3468)
at org.eclipse.swt.widgets.Display.readAndDispatch(Display.java:3115)
at org.eclipse.ui.internal.Workbench.runEventLoop(Workbench.java:2405)
at org.eclipse.ui.internal.Workbench.runUI(Workbench.java:2369)
at org.eclipse.ui.internal.Workbench.access$4(Workbench.java:2221)
at org.eclipse.ui.internal.Workbench$5.run(Workbench.java:500)
at org.eclipse.core.databinding.observable.Realm.runWithDefault(Realm.java:332)
at org.eclipse.ui.internal.Workbench.createAndRunWorkbench(Workbench.java:493)
at org.eclipse.ui.PlatformUI.createAndRunWorkbench(PlatformUI.java:149)
at org.eclipse.ui.internal.ide.application.IDEApplication.start(IDEApplication.java:113)
at org.eclipse.test.UITestApplication.runApplication(UITestApplication.java:138)
at org.eclipse.test.UITestApplication.run(UITestApplication.java:60)
at org.eclipse.test.UITestApplication.start(UITestApplication.java:210)
at org.eclipse.equinox.internal.app.EclipseAppHandle.run(EclipseAppHandle.java:194)
at
org.eclipse.core.runtime.internal.adaptor.EclipseAppLauncher.runApplication(EclipseAppLauncher.java:110)
at
org.eclipse.core.runtime.internal.adaptor.EclipseAppLauncher.start(EclipseAppLauncher.java:79)
at org.eclipse.core.runtime.adaptor.EclipseStarter.run(EclipseStarter.java:368)
at org.eclipse.core.runtime.adaptor.EclipseStarter.run(EclipseStarter.java:179)
at org.eclipse.equinox.launcher.Main.invokeFramework(Main.java:559)
at org.eclipse.equinox.launcher.Main.basicRun(Main.java:514)
at org.eclipse.equinox.launcher.Main.run(Main.java:1311)
at org.eclipse.equinox.launcher.Main.main(Main.java:1287)
at org.eclipse.core.launcher.Main.main(Main.java:34)
Caused by: java.lang.Exception: Could not find plugin
"org.jboss.tools.vpe.ui.test"
at org.eclipse.test.EclipseTestRunner.loadSuiteClass(EclipseTestRunner.java:304)
at org.eclipse.test.EclipseTestRunner.getTest(EclipseTestRunner.java:237)
FAILED: org.jboss.tools.vpe.xulrunner.test.XulRunnerAllTests
Error Message:
java.lang.Exception: Could not find plugin "org.jboss.tools.vpe.xulrunner.test"
Stack Trace:
org.eclipse.test.EclipseTestRunner$TestFailedException: java.lang.Exception: Could not
find plugin "org.jboss.tools.vpe.xulrunner.test"
at org.eclipse.test.EclipseTestRunner.runFailed(EclipseTestRunner.java:288)
at org.eclipse.test.EclipseTestRunner.getTest(EclipseTestRunner.java:240)
at org.eclipse.test.EclipseTestRunner.<init>(EclipseTestRunner.java:220)
at org.eclipse.test.EclipseTestRunner.run(EclipseTestRunner.java:204)
at org.eclipse.test.UITestApplication$3.run(UITestApplication.java:195)
at org.eclipse.swt.widgets.RunnableLock.run(RunnableLock.java:35)
at org.eclipse.swt.widgets.Synchronizer.runAsyncMessages(Synchronizer.java:134)
at org.eclipse.swt.widgets.Display.runAsyncMessages(Display.java:3468)
at org.eclipse.swt.widgets.Display.readAndDispatch(Display.java:3115)
at org.eclipse.ui.internal.Workbench.runEventLoop(Workbench.java:2405)
at org.eclipse.ui.internal.Workbench.runUI(Workbench.java:2369)
at org.eclipse.ui.internal.Workbench.access$4(Workbench.java:2221)
at org.eclipse.ui.internal.Workbench$5.run(Workbench.java:500)
at org.eclipse.core.databinding.observable.Realm.runWithDefault(Realm.java:332)
at org.eclipse.ui.internal.Workbench.createAndRunWorkbench(Workbench.java:493)
at org.eclipse.ui.PlatformUI.createAndRunWorkbench(PlatformUI.java:149)
at org.eclipse.ui.internal.ide.application.IDEApplication.start(IDEApplication.java:113)
at org.eclipse.test.UITestApplication.runApplication(UITestApplication.java:138)
at org.eclipse.test.UITestApplication.run(UITestApplication.java:60)
at org.eclipse.test.UITestApplication.start(UITestApplication.java:210)
at org.eclipse.equinox.internal.app.EclipseAppHandle.run(EclipseAppHandle.java:194)
at
org.eclipse.core.runtime.internal.adaptor.EclipseAppLauncher.runApplication(EclipseAppLauncher.java:110)
at
org.eclipse.core.runtime.internal.adaptor.EclipseAppLauncher.start(EclipseAppLauncher.java:79)
at org.eclipse.core.runtime.adaptor.EclipseStarter.run(EclipseStarter.java:368)
at org.eclipse.core.runtime.adaptor.EclipseStarter.run(EclipseStarter.java:179)
at org.eclipse.equinox.launcher.Main.invokeFramework(Main.java:559)
at org.eclipse.equinox.launcher.Main.basicRun(Main.java:514)
at org.eclipse.equinox.launcher.Main.run(Main.java:1311)
at org.eclipse.equinox.launcher.Main.main(Main.java:1287)
at org.eclipse.core.launcher.Main.main(Main.java:34)
Caused by: java.lang.Exception: Could not find plugin
"org.jboss.tools.vpe.xulrunner.test"
at org.eclipse.test.EclipseTestRunner.loadSuiteClass(EclipseTestRunner.java:304)
at org.eclipse.test.EclipseTestRunner.getTest(EclipseTestRunner.java:237)
FAILED: org.jboss.tools.ws.core.test.JBossWSCoreAllTests
Error Message:
java.lang.Exception: Could not find plugin "org.jboss.tools.ws.core.test"
Stack Trace:
org.eclipse.test.EclipseTestRunner$TestFailedException: java.lang.Exception: Could not
find plugin "org.jboss.tools.ws.core.test"
at org.eclipse.test.EclipseTestRunner.runFailed(EclipseTestRunner.java:288)
at org.eclipse.test.EclipseTestRunner.getTest(EclipseTestRunner.java:240)
at org.eclipse.test.EclipseTestRunner.<init>(EclipseTestRunner.java:220)
at org.eclipse.test.EclipseTestRunner.run(EclipseTestRunner.java:204)
at org.eclipse.test.UITestApplication$3.run(UITestApplication.java:195)
at org.eclipse.swt.widgets.RunnableLock.run(RunnableLock.java:35)
at org.eclipse.swt.widgets.Synchronizer.runAsyncMessages(Synchronizer.java:134)
at org.eclipse.swt.widgets.Display.runAsyncMessages(Display.java:3468)
at org.eclipse.swt.widgets.Display.readAndDispatch(Display.java:3115)
at org.eclipse.ui.internal.Workbench.runEventLoop(Workbench.java:2405)
at org.eclipse.ui.internal.Workbench.runUI(Workbench.java:2369)
at org.eclipse.ui.internal.Workbench.access$4(Workbench.java:2221)
at org.eclipse.ui.internal.Workbench$5.run(Workbench.java:500)
at org.eclipse.core.databinding.observable.Realm.runWithDefault(Realm.java:332)
at org.eclipse.ui.internal.Workbench.createAndRunWorkbench(Workbench.java:493)
at org.eclipse.ui.PlatformUI.createAndRunWorkbench(PlatformUI.java:149)
at org.eclipse.ui.internal.ide.application.IDEApplication.start(IDEApplication.java:113)
at org.eclipse.test.UITestApplication.runApplication(UITestApplication.java:138)
at org.eclipse.test.UITestApplication.run(UITestApplication.java:60)
at org.eclipse.test.UITestApplication.start(UITestApplication.java:210)
at org.eclipse.equinox.internal.app.EclipseAppHandle.run(EclipseAppHandle.java:194)
at
org.eclipse.core.runtime.internal.adaptor.EclipseAppLauncher.runApplication(EclipseAppLauncher.java:110)
at
org.eclipse.core.runtime.internal.adaptor.EclipseAppLauncher.start(EclipseAppLauncher.java:79)
at org.eclipse.core.runtime.adaptor.EclipseStarter.run(EclipseStarter.java:368)
at org.eclipse.core.runtime.adaptor.EclipseStarter.run(EclipseStarter.java:179)
at org.eclipse.equinox.launcher.Main.invokeFramework(Main.java:559)
at org.eclipse.equinox.launcher.Main.basicRun(Main.java:514)
at org.eclipse.equinox.launcher.Main.run(Main.java:1311)
at org.eclipse.equinox.launcher.Main.main(Main.java:1287)
at org.eclipse.core.launcher.Main.main(Main.java:34)
Caused by: java.lang.Exception: Could not find plugin
"org.jboss.tools.ws.core.test"
at org.eclipse.test.EclipseTestRunner.loadSuiteClass(EclipseTestRunner.java:304)
at org.eclipse.test.EclipseTestRunner.getTest(EclipseTestRunner.java:237)
FAILED: org.jboss.tools.ws.ui.test.JBossWSUIAllTests
Error Message:
java.lang.Exception: Could not find plugin "org.jboss.tools.ws.ui.test"
Stack Trace:
org.eclipse.test.EclipseTestRunner$TestFailedException: java.lang.Exception: Could not
find plugin "org.jboss.tools.ws.ui.test"
at org.eclipse.test.EclipseTestRunner.runFailed(EclipseTestRunner.java:288)
at org.eclipse.test.EclipseTestRunner.getTest(EclipseTestRunner.java:240)
at org.eclipse.test.EclipseTestRunner.<init>(EclipseTestRunner.java:220)
at org.eclipse.test.EclipseTestRunner.run(EclipseTestRunner.java:204)
at org.eclipse.test.UITestApplication$3.run(UITestApplication.java:195)
at org.eclipse.swt.widgets.RunnableLock.run(RunnableLock.java:35)
at org.eclipse.swt.widgets.Synchronizer.runAsyncMessages(Synchronizer.java:134)
at org.eclipse.swt.widgets.Display.runAsyncMessages(Display.java:3468)
at org.eclipse.swt.widgets.Display.readAndDispatch(Display.java:3115)
at org.eclipse.ui.internal.Workbench.runEventLoop(Workbench.java:2405)
at org.eclipse.ui.internal.Workbench.runUI(Workbench.java:2369)
at org.eclipse.ui.internal.Workbench.access$4(Workbench.java:2221)
at org.eclipse.ui.internal.Workbench$5.run(Workbench.java:500)
at org.eclipse.core.databinding.observable.Realm.runWithDefault(Realm.java:332)
at org.eclipse.ui.internal.Workbench.createAndRunWorkbench(Workbench.java:493)
at org.eclipse.ui.PlatformUI.createAndRunWorkbench(PlatformUI.java:149)
at org.eclipse.ui.internal.ide.application.IDEApplication.start(IDEApplication.java:113)
at org.eclipse.test.UITestApplication.runApplication(UITestApplication.java:138)
at org.eclipse.test.UITestApplication.run(UITestApplication.java:60)
at org.eclipse.test.UITestApplication.start(UITestApplication.java:210)
at org.eclipse.equinox.internal.app.EclipseAppHandle.run(EclipseAppHandle.java:194)
at
org.eclipse.core.runtime.internal.adaptor.EclipseAppLauncher.runApplication(EclipseAppLauncher.java:110)
at
org.eclipse.core.runtime.internal.adaptor.EclipseAppLauncher.start(EclipseAppLauncher.java:79)
at org.eclipse.core.runtime.adaptor.EclipseStarter.run(EclipseStarter.java:368)
at org.eclipse.core.runtime.adaptor.EclipseStarter.run(EclipseStarter.java:179)
at org.eclipse.equinox.launcher.Main.invokeFramework(Main.java:559)
at org.eclipse.equinox.launcher.Main.basicRun(Main.java:514)
at org.eclipse.equinox.launcher.Main.run(Main.java:1311)
at org.eclipse.equinox.launcher.Main.main(Main.java:1287)
at org.eclipse.core.launcher.Main.main(Main.java:34)
Caused by: java.lang.Exception: Could not find plugin
"org.jboss.tools.ws.ui.test"
at org.eclipse.test.EclipseTestRunner.loadSuiteClass(EclipseTestRunner.java:304)
at org.eclipse.test.EclipseTestRunner.getTest(EclipseTestRunner.java:237)
--------------------------------------------------
Changes:
[dmaliarevich]
https://jira.jboss.org/jira/browse/JBIDE-3225,
https://jira.jboss.org/jira/browse/JBIDE-3708, text processing in jsf templates was
changed, util methods were added.
[dmaliarevich]
https://jira.jboss.org/jira/browse/JBIDE-4552, fixed,
VpeLoadBundleCreator.removeElement(..) was changed.
[vyemialyanchyk]
https://jira.jboss.org/jira/browse/JBIDE-4549 - delete unused keys
[vyemialyanchyk]
https://jira.jboss.org/jira/browse/JBIDE-4549 - setup right resource
bundle prefix
[mareshkau]
https://jira.jboss.org/jira/browse/JBIDE-3793
[DartPeng] JBIDE-4578
Done
[DartPeng] JBIDE-4536
Remove useless libraries.
[DartPeng] JBIDE-4217
Add CSV parser test case
[DartPeng] JBIDE-4217
Add CSV parser test case
[DartPeng] JBIDE-4536
Remove some useless libraries.
[dgolovin] fix build after renaming hibernate.ui.* plug-ins to only hibernat.ui
[dgolovin] remove uneseccary .settings
[dgolovin] remove references to hibernate.ui.veditor and hibernate.ui.view plug-ins from
hibernate feature, add hibernate.ui.test into hibernate.console.test feature
[dgolovin] test feature is separated to common pasrt an all other tests to be able start
tests without performing build for all tests
[dgolovin] Share project "org.jboss.tools.all.test.feature" into
"https://svn.jboss.org/repos/jbosstools"
[max.andersen(a)jboss.com] JBIDE-3883 remove .settings
[nickboldt]
[nickboldt]
[nickboldt] generate psfs
[max.andersen(a)jboss.com]
https://jira.jboss.org/jira/browse/JBIDE-3883 fixed bad usage of
com.sun.* that showed up when setting J2SE-1.5 exec environment.
[max.andersen(a)jboss.com] JBIDE-3883 cleanup for manifest changes done in hibernate
[max.andersen(a)jboss.com] svn:ignore
[max.andersen(a)jboss.com] JBIDE-3883 initial cleanup of manifest and classpath to use
execution environments instead of specific named jdkand random compile flags
[koen.aers(a)jboss.com] update of the feature.xml and feature.properties
[koen.aers(a)jboss.com] update of the feature.xml and feature.properties
[koen.aers(a)jboss.com] update of the feature.xml and feature.properties
[koen.aers(a)jboss.com] update of the feature.xml and feature.properties
[koen.aers(a)jboss.com] update of the feature.xml and feature.properties
[nickboldt] increment to 3.2.0
[nickboldt] add source features
[nickboldt] jbpm3.sdk should not include convert
[nickboldt] typo
[nickboldt] jbpm3 athena builder
[nickboldt] switch to latest basebuilder
[max.andersen(a)jboss.com] whats new and noteworthy for M2
[dgolovin] merge from 3.1.0.M2 branch
[akazakov]
https://jira.jboss.org/jira/browse/JBIDE-2808
[akazakov]
https://jira.jboss.org/jira/browse/JBIDE-2808
[koen.aers(a)jboss.com] added the test feature/plugins and the convert feature/plugins
[koen.aers(a)jboss.com] removed org.jboss.tools.jbpm.common tests
[max.andersen(a)jboss.com] bin remove/ignore
[anis] Added Seam 2.1.1GA tests report
[koen.aers(a)jboss.com] added test plugin/feature
[anis] Added Seam 2fp tests report
[anis] Added Seam 1.2 tests report
[nickboldt] renamed to jbpm3.map
[nickboldt] typo
[nickboldt] move common into common; rename elements to jbpm3
[koen.aers(a)jboss.com]
[koen.aers(a)jboss.com]
[anis] Added smoke tests report
[anis] Removed wrong report
[anis] Added smoke test report
[anis] Removed folder
[anis] Created folder for tests
[vyemialyanchyk]
https://jira.jboss.org/jira/browse/JBIDE-4524
[vyemialyanchyk]
https://jira.jboss.org/jira/browse/JBIDE-4524
[vyemialyanchyk]
https://jira.jboss.org/jira/browse/JBIDE-4524
[vyemialyanchyk]
https://jira.jboss.org/jira/browse/JBIDE-4524
[vyemialyanchyk]
https://jira.jboss.org/jira/browse/JBIDE-4524
[vyemialyanchyk]
https://jira.jboss.org/jira/browse/JBIDE-4524
[vyemialyanchyk]
https://jira.jboss.org/jira/browse/JBIDE-4524
[vyemialyanchyk]
[vyemialyanchyk]
[vyemialyanchyk]
[vyemialyanchyk]
[vyemialyanchyk]
[abogachuk]
https://jira.jboss.org/jira/browse/JBDS-784 - master_output.xml files
updated.
[vyemialyanchyk]
[DartPeng] JBIDE-4551
Done
[sflanigan]
https://jira.jboss.org/jira/browse/JBIDE-3557 Externalize English strings
[sflanigan]
https://jira.jboss.org/jira/browse/JBIDE-3557 Externalize English strings
[sflanigan]
https://jira.jboss.org/jira/browse/JBIDE-3557 Externalize English strings
[sflanigan]
https://jira.jboss.org/jira/browse/JBIDE-3557 Externalize English strings
(annotating tests to disable nls warnings)
[koen.aers(a)jboss.com] reorganizing wizards
[koen.aers(a)jboss.com] SqlTask configuration is now supported
[koen.aers(a)jboss.com] remove import
[koen.aers(a)jboss.com] reorganizing wizards
[koen.aers(a)jboss.com] Hql node: query and parameters are supported
[snjeza]
https://jira.jboss.org/jira/browse/JBIDE-4487 Turn off validation by a per folder
basis
[akazakov]
https://jira.jboss.org/jira/browse/JBIDE-4545 Fixed
[akazakov]
https://jira.jboss.org/jira/browse/JBIDE-4545 Fixed
[akazakov]
https://jira.jboss.org/jira/browse/JBIDE-4545 Fixed
[rob.stryker(a)jboss.com] JBIDE-4491 - deleting a renamed xpath failed
[rob.stryker(a)jboss.com] More development. Woo Hoo.
[DartPeng] JBIDE-4551
Add CSV input type string
[DartPeng] JBIDE-4536
Change the plugins name
[DartPeng] JBIDE-4536
Change the plugins name
[DartPeng] JBIDE-4536
Remove the example codes
[sflanigan]
https://jira.jboss.org/jira/browse/JBIDE-3557 Added NON-NLS comments. Also
added javadocs to show which params are translatable when constructing FormData etc.
[sflanigan]
https://jira.jboss.org/jira/browse/JBIDE-3557 Externalize English strings
[sflanigan]
https://jira.jboss.org/jira/browse/JBIDE-3557 Externalize English strings
[snjeza]
https://jira.jboss.org/jira/browse/JBIDE-4432 Add or move "Show experimental
sites" from prefences to the Project Examples wizard
[koen.aers(a)jboss.com] remove duplicate edit domain (and command stack)
[koen.aers(a)jboss.com] remove duplicate edit domain (and command stack)
[vyemialyanchyk]
https://jira.jboss.org/jira/browse/JBIDE-4524 - rename veditor plugin
[vyemialyanchyk]
https://jira.jboss.org/jira/browse/JBIDE-4524 - rename veditor plugin
[vyemialyanchyk]
https://jira.jboss.org/jira/browse/JBIDE-4524 - rename veditor plugin
[vyemialyanchyk]
https://jira.jboss.org/jira/browse/JBIDE-4524 - rename veditor plugin
[vyemialyanchyk]
https://jira.jboss.org/jira/browse/JBIDE-4524 - rename veditor plugin
[vyemialyanchyk]
https://jira.jboss.org/jira/browse/JBIDE-4524 - rename veditor plugin
[vyemialyanchyk]
https://jira.jboss.org/jira/browse/JBIDE-4524 - rename veditor plugin
[vyemialyanchyk]
https://jira.jboss.org/jira/browse/JBIDE-4524 - rename veditor plugin
[vyemialyanchyk]
https://jira.jboss.org/jira/browse/JBIDE-4524 - rename veditor plugin
[vyemialyanchyk]
https://jira.jboss.org/jira/browse/JBIDE-4524 - rename veditor plugin
[vyemialyanchyk]
https://jira.jboss.org/jira/browse/JBIDE-4524 - rename veditor plugin
[vyemialyanchyk]
https://jira.jboss.org/jira/browse/JBIDE-4524 - rename veditor plugin
[vyemialyanchyk]
https://jira.jboss.org/jira/browse/JBIDE-4524 - rename veditor plugin
[vyemialyanchyk]
https://jira.jboss.org/jira/browse/JBIDE-4524 - rename veditor plugin
[vyemialyanchyk]
https://jira.jboss.org/jira/browse/JBIDE-4524 - rename veditor plugin
[vyemialyanchyk]
https://jira.jboss.org/jira/browse/JBIDE-4524 - rename veditor plugin
[aklimkovich] Total 26/ Failed 7/ Passed 19
[aklimkovich] Removed file/folder
[aklimkovich] Added a file remotely
[yzhishko] VPE Tests. One bug not serious.
[chukhutsina] <html><head><meta name="qrichtext"
content="1" /></head><body
style="font-size:9pt;font-family:Sans Serif">
<
p>https://jira.jboss.org/jira/browse/JBDS-770- Redefied
"generate.col" template and now column-width unspecified Warnings no
longer appear.Resolved the bug about the screens that don't fit the document -now they
are scaled .</p>
</body></html>
[dazarov]
https://jira.jboss.org/jira/browse/JBIDE-1077
[dgeraskov]
https://jira.jboss.org/jira/browse/JBIDE-4555
removed bad dialect set.
[dazarov]
https://jira.jboss.org/jira/browse/JBIDE-1077
[smukhina]
https://jira.jboss.org/jira/browse/JBDS-783 Versions of the corresponding
guides should are changed corresponing to plugins of 3.1.0.M2
[dazarov]
https://jira.jboss.org/jira/browse/JBIDE-1077
[dmaliarevich]
https://jira.jboss.org/jira/browse/JBIDE-4102, comment node updating was
changed.
[Grid.Qian] JBIDE-4532: make up the change for missing the sflanigan's commit
[Grid.Qian] JBIDE-4532: apply the changes for this issue
[Grid.Qian] JBIDE-4532: revert the change for this issue
[DartPeng] JBIDE-4551
Add wizard page for setting CSV configurations and selecting CSV file.
[Grid.Qian] JBIDE-4532: when delete the partnerlink, a exception
occured:java.lang.ClassCastException: org.eclipse.wst.wsdl.util.WSDLResourceImpl
[DartPeng] JBIDE-4540
Control the number of JSON reader in smooks config file.
[DartPeng] JBIDE-4389
Add wizard title
[sflanigan] Eliminating a few of Eclipse's NLS warnings.
https://jira.jboss.org/jira/browse/JBIDE-4044
[dgolovin] fix build after renaming hibernate.ui.* plug-ins to only hibernat.ui
[dgolovin]
[dgolovin] merge for changes from 3.0.0.M2 branch
[dgolovin] merge for changes from 3.0.0.M2 branch
[nickboldt] switch jbpm3 to 3.2.0.M2
--------------------------------------------------
Console log:
[...truncated 120405 lines...]
[echo] jbds-jmx-filename=JMX-1.1.0.M3-N200907071308-H8.zip
[echo] jbds-jmx-nodeps-filename=JMX-nodeps-1.1.0.M3-N200907071308-H8.zip
[echo]
[echo] Getting version for 'drools-ide' builder to property
'drools-ide.versionTag' from
/qa/services/hudson/hudson_workspace/workspace/jbosstools-nightly-3.1.0.M3/org.jboss.ide.eclipse.releng/builders/product/versionTags/jbosstools/3.1.0.M3.tags
[echo]
[echo] jbds-drools-ide-filename=DroolsIDE-5.1.0.trunk-N200907071308-H8.zip
[echo]
jbds-drools-ide-nodeps-filename=DroolsIDE-nodeps-5.1.0.trunk-N200907071308-H8.zip
[echo]
[echo] Getting version for 'archives' builder to property
'archives.versionTag' from
/qa/services/hudson/hudson_workspace/workspace/jbosstools-nightly-3.1.0.M3/org.jboss.ide.eclipse.releng/builders/product/versionTags/jbosstools/3.1.0.M3.tags
[echo]
[echo] jbds-archives-filename=JBossTools-Archives-3.1.0.M3-N200907071308-H8.zip
[echo]
jbds-archives-nodeps-filename=JBossTools-Archives-nodeps-3.1.0.M3-N200907071308-H8.zip
[echo]
[echo] Getting version for 'xulrunner' builder to property
'xulrunner.versionTag' from
/qa/services/hudson/hudson_workspace/workspace/jbosstools-nightly-3.1.0.M3/org.jboss.ide.eclipse.releng/builders/product/versionTags/jbosstools/3.1.0.M3.tags
[echo]
[echo]
jbds-xulrunner-win32-filename=XulRunner-win32-1.0.0.GA-N200907071308-H8.zip
[echo]
jbds-xulrunner-win32-nodeps-filename=XulRunner-win32-nodeps-1.0.0.GA-N200907071308-H8.zip
[echo]
[echo] Getting version for 'xulrunner' builder to property
'xulrunner.versionTag' from
/qa/services/hudson/hudson_workspace/workspace/jbosstools-nightly-3.1.0.M3/org.jboss.ide.eclipse.releng/builders/product/versionTags/jbosstools/3.1.0.M3.tags
[echo]
[echo]
jbds-xulrunner-linux-gtk-filename=XulRunner-linux-gtk-1.0.0.GA-N200907071308-H8.zip
[echo]
jbds-xulrunner-linux-gtk-nodeps-filename=XulRunner-linux-gtk-nodeps-1.0.0.GA-N200907071308-H8.zip
[echo]
[echo] Getting version for 'richfaces' builder to property
'richfaces.versionTag' from
/qa/services/hudson/hudson_workspace/workspace/jbosstools-nightly-3.1.0.M3/org.jboss.ide.eclipse.releng/builders/product/versionTags/jbosstools/3.1.0.M3.tags
[echo]
[echo]
jbds-richfaces-win32-filename=RichFaces-VPE-win32-3.1.0.M3-N200907071308-H8.zip
[echo]
jbds-richfaces-win32-nodeps-filename=RichFaces-VPE-win32-nodeps-3.1.0.M3-N200907071308-H8.zip
[echo]
[echo] Getting version for 'richfaces' builder to property
'richfaces.versionTag' from
/qa/services/hudson/hudson_workspace/workspace/jbosstools-nightly-3.1.0.M3/org.jboss.ide.eclipse.releng/builders/product/versionTags/jbosstools/3.1.0.M3.tags
[echo]
[echo]
jbds-richfaces-linux-gtk-filename=RichFaces-VPE-linux-gtk-3.1.0.M3-N200907071308-H8.zip
[echo]
jbds-richfaces-linux-gtk-nodeps-filename=RichFaces-VPE-linux-gtk-nodeps-3.1.0.M3-N200907071308-H8.zip
[echo]
[echo] Getting version for 'jbpm-convert' builder to property
'jbpm-convert.versionTag' from
/qa/services/hudson/hudson_workspace/workspace/jbosstools-nightly-3.1.0.M3/org.jboss.ide.eclipse.releng/builders/product/versionTags/jbosstools/3.1.0.M3.tags
[echo]
[echo] jbds-jbpm-convert-filename=jBPM-Convert-1.1.0.M3-N200907071308-H8.zip
[echo]
jbds-jbpm-convert-nodeps-filename=jBPM-Convert-nodeps-1.1.0.M3-N200907071308-H8.zip
[echo]
[echo] Getting version for 'freemarker' builder to property
'freemarker.versionTag' from
/qa/services/hudson/hudson_workspace/workspace/jbosstools-nightly-3.1.0.M3/org.jboss.ide.eclipse.releng/builders/product/versionTags/jbosstools/3.1.0.M3.tags
[echo]
[echo] jbds-freemarker-filename=FreeMarkerIDE-1.1.0.M3-N200907071308-H8.zip
[echo]
jbds-freemarker-nodeps-filename=FreeMarkerIDE-nodeps-1.1.0.M3-N200907071308-H8.zip
[echo]
[echo] Getting version for 'hibernate-tools' builder to property
'hibernate-tools.versionTag' from
/qa/services/hudson/hudson_workspace/workspace/jbosstools-nightly-3.1.0.M3/org.jboss.ide.eclipse.releng/builders/product/versionTags/jbosstools/3.1.0.M3.tags
[echo]
[echo] jbds-hibernate-tools-filename=HibernateTools-3.3.0.M3-N200907071308-H8.zip
[echo]
jbds-hibernate-tools-nodeps-filename=HibernateTools-nodeps-3.3.0.M3-N200907071308-H8.zip
[echo]
[echo] Getting version for 'struts' builder to property
'struts.versionTag' from
/qa/services/hudson/hudson_workspace/workspace/jbosstools-nightly-3.1.0.M3/org.jboss.ide.eclipse.releng/builders/product/versionTags/jbosstools/3.1.0.M3.tags
[echo]
[echo] jbds-struts-filename=StrutsTools-3.1.0.M3-N200907071308-H8.zip
[echo]
jbds-struts-nodeps-filename=StrutsTools-nodeps-3.1.0.M3-N200907071308-H8.zip
[echo]
[echo] Getting version for 'jbpm' builder to property
'jbpm.versionTag' from
/qa/services/hudson/hudson_workspace/workspace/jbosstools-nightly-3.1.0.M3/org.jboss.ide.eclipse.releng/builders/product/versionTags/jbosstools/3.1.0.M3.tags
[echo]
[echo] jbds-jbpm-filename=jBPM-Designer-3.1.7.GA-N200907071308-H8.zip
[echo]
jbds-jbpm-nodeps-filename=jBPM-Designer-nodeps-3.1.7.GA-N200907071308-H8.zip
[echo]
[echo] Getting version for 'jbpm4' builder to property
'jbpm4.versionTag' from
/qa/services/hudson/hudson_workspace/workspace/jbosstools-nightly-3.1.0.M3/org.jboss.ide.eclipse.releng/builders/product/versionTags/jbosstools/3.1.0.M3.tags
[echo]
[echo] jbds-jbpm4-filename=jBPM4-Designer-4.0.0.M3-N200907071308-H8.zip
[echo]
jbds-jbpm4-nodeps-filename=jBPM4-Designer-nodeps-4.0.0.M3-N200907071308-H8.zip
[echo]
[echo] Getting version for 'as' builder to property 'as.versionTag'
from
/qa/services/hudson/hudson_workspace/workspace/jbosstools-nightly-3.1.0.M3/org.jboss.ide.eclipse.releng/builders/product/versionTags/jbosstools/3.1.0.M3.tags
[echo]
[echo] jbds-as-filename=JBossAS-Tools-2.1.0.M3-N200907071308-H8.zip
[echo] jbds-as-nodeps-filename=JBossAS-Tools-nodeps-2.1.0.M3-N200907071308-H8.zip
[echo]
[echo] Getting version for 'seam' builder to property
'seam.versionTag' from
/qa/services/hudson/hudson_workspace/workspace/jbosstools-nightly-3.1.0.M3/org.jboss.ide.eclipse.releng/builders/product/versionTags/jbosstools/3.1.0.M3.tags
[echo]
[echo] jbds-seam-filename=SeamTools-3.1.0.M3-N200907071308-H8.zip
[echo] jbds-seam-nodeps-filename=SeamTools-nodeps-3.1.0.M3-N200907071308-H8.zip
[echo]
[echo] Getting version for 'maven' builder to property
'maven.versionTag' from
/qa/services/hudson/hudson_workspace/workspace/jbosstools-nightly-3.1.0.M3/org.jboss.ide.eclipse.releng/builders/product/versionTags/jbosstools/3.1.0.M3.tags
[echo]
[echo] jbds-maven-filename=JBoss-Maven-Tools-1.0.0.M3-N200907071308-H8.zip
[echo]
jbds-maven-nodeps-filename=JBoss-Maven-Tools-nodeps-1.0.0.M3-N200907071308-H8.zip
[echo]
[echo] Getting version for 'examples' builder to property
'examples.versionTag' from
/qa/services/hudson/hudson_workspace/workspace/jbosstools-nightly-3.1.0.M3/org.jboss.ide.eclipse.releng/builders/product/versionTags/jbosstools/3.1.0.M3.tags
[echo]
[echo] jbds-examples-filename=JBossTools-Examples-1.1.0.M3-N200907071308-H8.zip
[echo]
jbds-examples-nodeps-filename=JBossTools-Examples-nodeps-1.1.0.M3-N200907071308-H8.zip
[echo]
[echo] Getting version for 'esb' builder to property 'esb.versionTag'
from
/qa/services/hudson/hudson_workspace/workspace/jbosstools-nightly-3.1.0.M3/org.jboss.ide.eclipse.releng/builders/product/versionTags/jbosstools/3.1.0.M3.tags
[echo]
[echo] jbds-esb-filename=JBossTools-ESB-1.3.0.M3-N200907071308-H8.zip
[echo]
jbds-esb-nodeps-filename=JBossTools-ESB-nodeps-1.3.0.M3-N200907071308-H8.zip
[echo]
[echo] Getting version for 'ws' builder to property 'ws.versionTag'
from
/qa/services/hudson/hudson_workspace/workspace/jbosstools-nightly-3.1.0.M3/org.jboss.ide.eclipse.releng/builders/product/versionTags/jbosstools/3.1.0.M3.tags
[echo]
[echo] jbds-ws-filename=JBossWS-Tools-1.1.0.M3-N200907071308-H8.zip
[echo] jbds-ws-nodeps-filename=JBossWS-Tools-nodeps-1.1.0.M3-N200907071308-H8.zip
[echo]
[echo] Getting version for 'birt' builder to property
'birt.versionTag' from
/qa/services/hudson/hudson_workspace/workspace/jbosstools-nightly-3.1.0.M3/org.jboss.ide.eclipse.releng/builders/product/versionTags/jbosstools/3.1.0.M3.tags
[echo]
[echo] jbds-birt-filename=JBossTools-BIRT-1.1.0.M3-N200907071308-H8.zip
[echo]
jbds-birt-nodeps-filename=JBossTools-BIRT-nodeps-1.1.0.M3-N200907071308-H8.zip
[echo]
[echo] Getting version for 'portlet' builder to property
'portlet.versionTag' from
/qa/services/hudson/hudson_workspace/workspace/jbosstools-nightly-3.1.0.M3/org.jboss.ide.eclipse.releng/builders/product/versionTags/jbosstools/3.1.0.M3.tags
[echo]
[echo] jbds-portlet-filename=JBoss-Portlet-Tools-1.1.0.M3-N200907071308-H8.zip
[echo]
jbds-portlet-nodeps-filename=JBoss-Portlet-Tools-nodeps-1.1.0.M3-N200907071308-H8.zip
[echo]
[echo] Getting version for 'smooks' builder to property
'smooks.versionTag' from
/qa/services/hudson/hudson_workspace/workspace/jbosstools-nightly-3.1.0.M3/org.jboss.ide.eclipse.releng/builders/product/versionTags/jbosstools/3.1.0.M3.tags
[echo]
[echo] jbds-smooks-filename=JBossTools-Smooks-1.1.0.M3-N200907071308-H8.zip
[echo]
jbds-smooks-nodeps-filename=JBossTools-Smooks-nodeps-1.1.0.M3-N200907071308-H8.zip
[echo]
[loadfile]
/home/hudson/hudson_workspace/workspace/jbosstools-nightly-3.1.0.M3/jbds-build/3.1.0.M3/200907071308/smooks/JBossTools-Smooks-1.1.0.M3-N200907071308-H8.zip.MD5
doesn't exist
[echo] Getting version for 'tptp' builder to property
'tptp.versionTag' from
/qa/services/hudson/hudson_workspace/workspace/jbosstools-nightly-3.1.0.M3/org.jboss.ide.eclipse.releng/builders/product/versionTags/jbosstools/3.1.0.M3.tags
[echo]
[echo] jbds-tptp-filename=JBoss-TPTP-Tools-1.1.0.M3-N200907071308-H8.zip
[echo]
jbds-tptp-nodeps-filename=JBoss-TPTP-Tools-nodeps-1.1.0.M3-N200907071308-H8.zip
[echo]
pack200:
[echo] Using /qa/tools/opt/jdk1.5.0_15/jre/bin/pack200 to pack update site jars...
[mkdir] Created dir:
/qa/services/hudson/hudson_workspace/workspace/jbosstools-nightly-3.1.0.M3/org.jboss.ide.eclipse.releng/builders/product/updateSite/updateSitePackTmp/output
[mkdir] Created dir:
/qa/services/hudson/hudson_workspace/workspace/jbosstools-nightly-3.1.0.M3/org.jboss.ide.eclipse.releng/builders/product/updateSite/updateSitePackTmp/input
[echo] Zip update jars in
/home/hudson/hudson_workspace/workspace/jbosstools-nightly-3.1.0.M3/jbds-build/site to
temporary Master zip (to avoid packing nested jars) ...
[zip] Building zip:
/qa/services/hudson/hudson_workspace/workspace/jbosstools-nightly-3.1.0.M3/org.jboss.ide.eclipse.releng/builders/product/updateSite/updateSitePackTmp/input/Master.zip
[exec] 60M updateSite/updateSitePackTmp/input/Master.zip
[echo] Pack jars ...
[echo] Run jarprocessor.pack200 using launcherjar =
/home/hudson/hudson_workspace/workspace/jbosstools-nightly-3.1.0.M3/jbds-build/clean-eclipse/eclipse/plugins/org.eclipse.equinox.launcher_1.0.200.v20090520.jar
[exec] 173M updateSite/updateSitePackTmp/output/Master.zip
[unzip] Expanding:
/qa/services/hudson/hudson_workspace/workspace/jbosstools-nightly-3.1.0.M3/org.jboss.ide.eclipse.releng/builders/product/updateSite/updateSitePackTmp/output/Master.zip
into /home/hudson/hudson_workspace/workspace/jbosstools-nightly-3.1.0.M3/jbds-build/site
[delete] Deleting directory
/qa/services/hudson/hudson_workspace/workspace/jbosstools-nightly-3.1.0.M3/org.jboss.ide.eclipse.releng/builders/product/updateSite/updateSitePackTmp
copy.site.rootfiles:
[echo] Build development jbosstools update site...
[copy] Copying 4 files to
/home/hudson/hudson_workspace/workspace/jbosstools-nightly-3.1.0.M3/jbds-build/site/eclipse
p2:
[echo] Run p2 metadata generator using launcherjar =
/home/hudson/hudson_workspace/workspace/jbosstools-nightly-3.1.0.M3/jbds-build/clean-eclipse/eclipse/plugins/org.eclipse.equinox.launcher_1.0.200.v20090520.jar
[p2] Generating metadata for
/home/hudson/hudson_workspace/workspace/jbosstools-nightly-3.1.0.M3/jbds-build/site/eclipse.
[p2] Generation completed with success [12 seconds].
build.metadata:
publish.site:
post-build:
publish.results:
send.notification.email:
[mail] Failed to initialise MIME mail: javax/mail/MessagingException
publish.log:
init:
clean.all.subfolders:
BUILD SUCCESSFUL
Total time: 92 minutes 37 seconds
++ buildResult=0
++ cd ../configs/jbds
++ zip build.log.zip build.log
updating: build.log (deflated 95%)
++ cd ../..
+++ date +%s
++ endtime=1246992781
+++ echo 'scale=2; (1246992781 - 1246987100)/60'
+++ bc -l
++ elapsed=94.68
++ echo 'Elapsed time: 94.68mins.'
Elapsed time: 94.68mins.
++ [[ 0 != 0 ]]
++ [[ '' == \l\o\c\a\l ]]
+++ cat
/home/hudson/hudson_workspace/workspace/jbosstools-nightly-3.1.0.M3/jbds-build/buildData.properties
+++ grep product.releaseNumber
+++ perl -ne 's/[\s\t]+product.releaseNumber=//g;print;'
++ version=3.1.0.M3
+++ cat
/home/hudson/hudson_workspace/workspace/jbosstools-nightly-3.1.0.M3/jbds-build/buildData.properties
+++ grep upload.to
+++ perl -ne 's/[\s\t]+upload.to=//g;print;'
++ builddir=nightly/3.1.0.M3/200907071308
+++ cat
/home/hudson/hudson_workspace/workspace/jbosstools-nightly-3.1.0.M3/jbds-build/buildData.properties
+++ grep product.buildDesc
+++ perl -ne 's/[\s\t]+product.buildDesc=//g; print;'
++ buildtype=nightly
+++ cat
/home/hudson/hudson_workspace/workspace/jbosstools-nightly-3.1.0.M3/jbds-build/buildData.properties
+++ grep product.releaseNumber
+++ perl -ne 's/[\s\t]+product.releaseNumber=//g; print;'
++ releaseNumber=3.1.0.M3
++ DESTINATION=jbossqa@download.jboss.org:/htdocs/jbosstools
++ scp -r
/home/hudson/hudson_workspace/workspace/jbosstools-nightly-3.1.0.M3/jbds-build/3.1.0.M3
jbossqa@download.jboss.org:/htdocs/jbosstools/builds/nightly/
++ scp configs/jbds/build.log.zip
jbossqa@download.jboss.org:/htdocs/jbosstools/builds/nightly/3.1.0.M3/200907071308/
++ scp
/home/hudson/hudson_workspace/workspace/jbosstools-nightly-3.1.0.M3/jbds-build/latestBuild.html
jbossqa@download.jboss.org:/htdocs/jbosstools/builds/nightly/
++ scp
/home/hudson/hudson_workspace/workspace/jbosstools-nightly-3.1.0.M3/jbds-build/latestBuildFailures.html
jbossqa@download.jboss.org:/htdocs/jbosstools/builds/nightly/
+++ date +%s
++ endtime=1246994809
+++ echo 'scale=2; (1246994809 - 1246987100)/60'
+++ bc -l
++ elapsed=128.48
++ echo 'Elapsed time: 128.48mins.'
Elapsed time: 128.48mins.
++ [[ -d
/home/hudson/hudson_workspace/workspace/jbosstools-nightly-3.1.0.M3/jbds-build/site/eclipse
]]
++ mkdir -p
/home/hudson/hudson_workspace/workspace/jbosstools-nightly-3.1.0.M3/jbds-build/site/nightly/trunk
++ mv
/home/hudson/hudson_workspace/workspace/jbosstools-nightly-3.1.0.M3/jbds-build/site/eclipse/artifacts.jar
/home/hudson/hudson_workspace/workspace/jbosstools-nightly-3.1.0.M3/jbds-build/site/eclipse/associateSites.xml
/home/hudson/hudson_workspace/workspace/jbosstools-nightly-3.1.0.M3/jbds-build/site/eclipse/content.jar
/home/hudson/hudson_workspace/workspace/jbosstools-nightly-3.1.0.M3/jbds-build/site/eclipse/features
/home/hudson/hudson_workspace/workspace/jbosstools-nightly-3.1.0.M3/jbds-build/site/eclipse/index.html
/home/hudson/hudson_workspace/workspace/jbosstools-nightly-3.1.0.M3/jbds-build/site/eclipse/plugins
/home/hudson/hudson_workspace/workspace/jbosstools-nightly-3.1.0.M3/jbds-build/site/eclipse/site.xml
/home/hudson/hudson_workspace/workspace/jbosstools-nightly-3.1.0.M3/jbds-build/site/eclipse/web
/home/hudson/hudson_workspace/workspace/jbosstools-nightly-3.1.0.M3/jbds-build/site/nightly/trunk
+++ find
/home/hudson/hudson_workspace/workspace/jbosstools-nightly-3.1.0.M3/jbds-build/site/nightly/trunk/features
-name '*.jar'
++ [[ -n
/home/hudson/hudson_workspace/workspace/jbosstools-nightly-3.1.0.M3/jbds-build/site/nightly/trunk/features/org.jboss.tools.seam.feature_3.1.0.M3-N200907071308-H8.jar
/home/hudson/hudson_workspace/workspace/jbosstools-nightly-3.1.0.M3/jbds-build/site/nightly/trunk/features/org.guvnor.tools.feature_5.1.0.trunk-N200907071308-H8.jar
/home/hudson/hudson_workspace/workspace/jbosstools-nightly-3.1.0.M3/jbds-build/site/nightly/trunk/features/org.jboss.tools.jbpm4.feature_4.0.0.M3-N200907071308-H8.jar
/home/hudson/hudson_workspace/workspace/jbosstools-nightly-3.1.0.M3/jbds-build/site/nightly/trunk/features/org.jboss.tools.richfaces.feature_3.1.0.M3-N200907071308-H8.jar
/home/hudson/hudson_workspace/workspace/jbosstools-nightly-3.1.0.M3/jbds-build/site/nightly/trunk/features/org.jboss.tools.xulrunner.feature_1.8.1.3-20070904.jar
/home/hudson/hudson_workspace/workspace/jbosstools-nightly-3.1.0.M3/jbds-build/site/nightly/trunk/features/org.jboss.tools.struts_feature_3.1.0.M3-N200907071308-H8.jar
/home/hudson/hudson_workspace/workspace/jbosstools-nightly-3.1.0.M3/jbds-build/site/nightly/trunk/features/org.jboss.tools.tptp.feature_1.1.0.M3-N200907071308-H8.jar
/home/hudson/hudson_workspace/workspace/jbosstools-nightly-3.1.0.M3/jbds-build/site/nightly/trunk/features/org.jboss.tools.birt.feature_1.1.0.M3-N200907071308-H8.jar
/home/hudson/hudson_workspace/workspace/jbosstools-nightly-3.1.0.M3/jbds-build/site/nightly/trunk/features/org.jbpm.gd.jpdl.feature_3.1.7.GA-N200907071308-H8.jar
/home/hudson/hudson_workspace/workspace/jbosstools-nightly-3.1.0.M3/jbds-build/site/nightly/trunk/features/org.jboss.tools.jmx.feature_1.1.0.M3-N200907071308-H8.jar
/home/hudson/hudson_workspace/workspace/jbosstools-nightly-3.1.0.M3/jbds-build/site/nightly/trunk/features/org.jboss.tools.maven.feature_1.0.0.M3-N200907071308-H8.jar
/home/hudson/hudson_workspace/workspace/jbosstools-nightly-3.1.0.M3/jbds-build/site/nightly/trunk/features/org.jboss.tools.ws.feature_1.1.0.M3-N200907071308-H8.jar
/home/hudson/hudson_workspace/workspace/jbosstools-nightly-3.1.0.M3/jbds-build/site/nightly/trunk/features/org.jboss.tools.flow.jpdl4.feature_4.0.0.M3-N200907071308-H8.jar
/home/hudson/hudson_workspace/workspace/jbosstools-nightly-3.1.0.M3/jbds-build/site/nightly/trunk/features/org.jboss.ide.eclipse.as.feature_2.1.0.M3-N200907071308-H8.jar
/home/hudson/hudson_workspace/workspace/jbosstools-nightly-3.1.0.M3/jbds-build/site/nightly/trunk/features/org.jboss.tools.esb.feature_1.3.0.M3-N200907071308-H8.jar
/home/hudson/hudson_workspace/workspace/jbosstools-nightly-3.1.0.M3/jbds-build/site/nightly/trunk/features/org.jboss.tools.portlet.feature_1.1.0.M3-N200907071308-H8.jar
/home/hudson/hudson_workspace/workspace/jbosstools-nightly-3.1.0.M3/jbds-build/site/nightly/trunk/features/org.jboss.tools.profiler.feature_1.0.0.M3-N200907071308-H8.jar
/home/hudson/hudson_workspace/workspace/jbosstools-nightly-3.1.0.M3/jbds-build/site/nightly/trunk/features/org.drools.eclipse.task.feature_5.1.0.trunk-N200907071308-H8.jar
/home/hudson/hudson_workspace/workspace/jbosstools-nightly-3.1.0.M3/jbds-build/site/nightly/trunk/features/org.hibernate.eclipse.feature_3.3.0.M3-N200907071308-H8.jar
/home/hudson/hudson_workspace/workspace/jbosstools-nightly-3.1.0.M3/jbds-build/site/nightly/trunk/features/org.drools.eclipse.feature_5.1.0.trunk-N200907071308-H8.jar
/home/hudson/hudson_workspace/workspace/jbosstools-nightly-3.1.0.M3/jbds-build/site/nightly/trunk/features/org.jboss.ide.eclipse.archives.feature_3.1.0.M3-N200907071308-H8.jar
/home/hudson/hudson_workspace/workspace/jbosstools-nightly-3.1.0.M3/jbds-build/site/nightly/trunk/features/org.jboss.ide.eclipse.freemarker.feature_1.1.0.M3-N200907071308-H8.jar
/home/hudson/hudson_workspace/workspace/jbosstools-nightly-3.1.0.M3/jbds-build/site/nightly/trunk/features/org.jboss.tools.flow.common.feature_4.0.0.M3-N200907071308-H8.jar
/home/hudson/hudson_workspace/workspace/jbosstools-nightly-3.1.0.M3/jbds-build/site/nightly/trunk/features/org.jboss.tools.jbpm.common.feature_4.0.0.M3-N200907071308-H8.jar
/home/hudson/hudson_workspace/workspace/jbosstools-nightly-3.1.0.M3/jbds-build/site/nightly/trunk/features/org.jboss.tools.jbpm.convert.feature_1.1.0.M3-N200907071308-H8.jar
/home/hudson/hudson_workspace/workspace/jbosstools-nightly-3.1.0.M3/jbds-build/site/nightly/trunk/features/org.jboss.tools.project.examples.feature_1.1.0.M3-N200907071308-H8.jar
]]
++ mkdir -p jbossqa@download.jboss.org:/htdocs/jbosstools/updates/nightly/
++ rsync -arz --delete
/home/hudson/hudson_workspace/workspace/jbosstools-nightly-3.1.0.M3/jbds-build/site/nightly/trunk
jbossqa@download.jboss.org:/htdocs/jbosstools/updates/nightly/
+++ date +%s
++ endtime=1246994987
+++ echo 'scale=2; (1246994987 - 1246987100)/60'
+++ bc -l
++ elapsed=131.45
++ echo 'Elapsed time: 131.45mins.'
Elapsed time: 131.45mins.
Terminating xvnc
[jbosstools-nightly-3.1.0.M3] $ vncserver -kill :17
Killing Xvnc process ID 3562
[jbosstools-nightly-3.1.0.M3] $ bash -xe /tmp/hudson5075977790621720059.sh
+ kill 3543
Recording test results
Build was marked for publishing on
https://hudson.jboss.org/hudson/
Email was triggered for: Unstable
Email was triggered for: Still Unstable
Trigger Unstable was overridden by another trigger and will not send an email.
There are 1 triggered emails.
Sending email for trigger: Still Unstable
--------------------------------------------------