See
http://hudson.qa.jboss.com/hudson/job/drools/2610/changes
Changes:
[salaboy21] FTP test , port change to 2121 at localhost, modify drools.ftp.conf if you
want to change this
------------------------------------------
[...truncated 23647 lines...]
<quantity>2</quantity>
</example.OrderItem>
</list>
<list>
<example.OrderItem>
<price>8.9</price>
<productId>111</productId>
<quantity>2</quantity>
</example.OrderItem>
</list>
org.custommonkey.xmlunit.Diff[identical]
Tests run: 1, Failures: 0, Errors: 0, Skipped: 0, Time elapsed: 0.119 sec
Running org.drools.runtime.pipeline.impl.XStreamFactTest
Tests run: 1, Failures: 0, Errors: 0, Skipped: 0, Time elapsed: 0.056 sec
Results :
Tests run: 6, Failures: 0, Errors: 0, Skipped: 0
[INFO] [jar:jar]
[INFO] Building jar:
http://hudson.qa.jboss.com/hudson/job/drools/ws/trunk/drools-pipeline/dro...
[INFO] Preparing source:jar
[WARNING] Removing: jar from forked lifecycle, to prevent recursive invocation.
[INFO] No goals needed for project - skipping
[INFO] [source:jar {execution: default}]
[INFO] Building jar:
http://hudson.qa.jboss.com/hudson/job/drools/ws/trunk/drools-pipeline/dro...
[INFO] Preparing source:test-jar
[WARNING] Removing: jar from forked lifecycle, to prevent recursive invocation.
[WARNING] Removing: test-jar from forked lifecycle, to prevent recursive invocation.
[INFO] No goals needed for project - skipping
[INFO] [source:test-jar {execution: default}]
[INFO] Building jar:
http://hudson.qa.jboss.com/hudson/job/drools/ws/trunk/drools-pipeline/dro...
[INFO] [jar:test-jar {execution: default}]
[INFO] Building jar:
http://hudson.qa.jboss.com/hudson/job/drools/ws/trunk/drools-pipeline/dro...
[INFO] [install:install]
[INFO] Installing
http://hudson.qa.jboss.com/hudson/job/drools/ws/trunk/drools-pipeline/dro...
to
/home/hudson/.m2/repository/org/drools/drools-transformer-xstream/5.0.0.SNAPSHOT/drools-transformer-xstream-5.0.0.SNAPSHOT.jar
[INFO] Installing
http://hudson.qa.jboss.com/hudson/job/drools/ws/trunk/drools-pipeline/dro...
to
/home/hudson/.m2/repository/org/drools/drools-transformer-xstream/5.0.0.SNAPSHOT/drools-transformer-xstream-5.0.0.SNAPSHOT-sources.jar
[INFO] Installing
http://hudson.qa.jboss.com/hudson/job/drools/ws/trunk/drools-pipeline/dro...
to
/home/hudson/.m2/repository/org/drools/drools-transformer-xstream/5.0.0.SNAPSHOT/drools-transformer-xstream-5.0.0.SNAPSHOT-test-sources.jar
[INFO] Installing
http://hudson.qa.jboss.com/hudson/job/drools/ws/trunk/drools-pipeline/dro...
to
/home/hudson/.m2/repository/org/drools/drools-transformer-xstream/5.0.0.SNAPSHOT/drools-transformer-xstream-5.0.0.SNAPSHOT-tests.jar
[INFO] ------------------------------------------------------------------------
[INFO] Building Drools :: Pipeline:: Transformer :: JXLS
[INFO] task-segment: [clean, install]
[INFO] ------------------------------------------------------------------------
[INFO] [clean:clean]
[INFO] [resources:resources]
[WARNING] Using platform encoding (UTF-8 actually) to copy filtered resources, i.e. build
is platform dependent!
[INFO] Copying 0 resource
[INFO] [compiler:compile]
[INFO] Compiling 1 source file to
http://hudson.qa.jboss.com/hudson/job/drools/ws/trunk/drools-pipeline/dro...
[INFO] [resources:testResources]
[WARNING] Using platform encoding (UTF-8 actually) to copy filtered resources, i.e. build
is platform dependent!
[INFO] Copying 0 resource
[INFO] Copying 3 resources
[INFO] [compiler:testCompile]
[INFO] Compiling 4 source files to
http://hudson.qa.jboss.com/hudson/job/drools/ws/trunk/drools-pipeline/dro...
[INFO] [surefire:test]
[INFO] Surefire report directory:
http://hudson.qa.jboss.com/hudson/job/drools/ws/trunk/drools-pipeline/dro...
-------------------------------------------------------
T E S T S
-------------------------------------------------------
Running org.drools.runtime.pipeline.impl.JxlsTest
INFO - XLSReaderImpl.readSheet(40) | Processing sheet Sheet1
INFO - XLSReaderImpl.readSheet(40) | Processing sheet Sheet3
Tests run: 1, Failures: 0, Errors: 0, Skipped: 0, Time elapsed: 1.21 sec
Results :
Tests run: 1, Failures: 0, Errors: 0, Skipped: 0
[INFO] [jar:jar]
[INFO] Building jar:
http://hudson.qa.jboss.com/hudson/job/drools/ws/trunk/drools-pipeline/dro...
[INFO] Preparing source:jar
[WARNING] Removing: jar from forked lifecycle, to prevent recursive invocation.
[INFO] No goals needed for project - skipping
[INFO] [source:jar {execution: default}]
[INFO] Building jar:
http://hudson.qa.jboss.com/hudson/job/drools/ws/trunk/drools-pipeline/dro...
[INFO] Preparing source:test-jar
[WARNING] Removing: jar from forked lifecycle, to prevent recursive invocation.
[WARNING] Removing: test-jar from forked lifecycle, to prevent recursive invocation.
[INFO] No goals needed for project - skipping
[INFO] [source:test-jar {execution: default}]
[INFO] Building jar:
http://hudson.qa.jboss.com/hudson/job/drools/ws/trunk/drools-pipeline/dro...
[INFO] [jar:test-jar {execution: default}]
[INFO] Building jar:
http://hudson.qa.jboss.com/hudson/job/drools/ws/trunk/drools-pipeline/dro...
[INFO] [install:install]
[INFO] Installing
http://hudson.qa.jboss.com/hudson/job/drools/ws/trunk/drools-pipeline/dro...
to
/home/hudson/.m2/repository/org/drools/drools-transformer-jxls/5.0.0.SNAPSHOT/drools-transformer-jxls-5.0.0.SNAPSHOT.jar
[INFO] Installing
http://hudson.qa.jboss.com/hudson/job/drools/ws/trunk/drools-pipeline/dro...
to
/home/hudson/.m2/repository/org/drools/drools-transformer-jxls/5.0.0.SNAPSHOT/drools-transformer-jxls-5.0.0.SNAPSHOT-sources.jar
[INFO] Installing
http://hudson.qa.jboss.com/hudson/job/drools/ws/trunk/drools-pipeline/dro...
to
/home/hudson/.m2/repository/org/drools/drools-transformer-jxls/5.0.0.SNAPSHOT/drools-transformer-jxls-5.0.0.SNAPSHOT-test-sources.jar
[INFO] Installing
http://hudson.qa.jboss.com/hudson/job/drools/ws/trunk/drools-pipeline/dro...
to
/home/hudson/.m2/repository/org/drools/drools-transformer-jxls/5.0.0.SNAPSHOT/drools-transformer-jxls-5.0.0.SNAPSHOT-tests.jar
[INFO] ------------------------------------------------------------------------
[INFO] Building Drools :: Pipeline :: Messenger :: JMS
[INFO] task-segment: [clean, install]
[INFO] ------------------------------------------------------------------------
[INFO] [clean:clean]
[INFO] [resources:resources]
[WARNING] Using platform encoding (UTF-8 actually) to copy filtered resources, i.e. build
is platform dependent!
[INFO] skip non existing resourceDirectory
http://hudson.qa.jboss.com/hudson/job/drools/ws/trunk/drools-pipeline/dro...
[INFO] [compiler:compile]
[INFO] Compiling 4 source files to
http://hudson.qa.jboss.com/hudson/job/drools/ws/trunk/drools-pipeline/dro...
[INFO] [resources:testResources]
[WARNING] Using platform encoding (UTF-8 actually) to copy filtered resources, i.e. build
is platform dependent!
[INFO] Copying 0 resource
[INFO] Copying 3 resources
[INFO] [compiler:testCompile]
[INFO] Compiling 4 source files to
http://hudson.qa.jboss.com/hudson/job/drools/ws/trunk/drools-pipeline/dro...
[INFO] [surefire:test]
[INFO] Surefire report directory:
http://hudson.qa.jboss.com/hudson/job/drools/ws/trunk/drools-pipeline/dro...
-------------------------------------------------------
T E S T S
-------------------------------------------------------
Running org.drools.runtime.pipeline.impl.SimpleJmsMessengerTest
log4j:WARN No appenders could be found for logger
(org.apache.activemq.transport.vm.VMTransportFactory).
log4j:WARN Please initialize the log4j system properly.
msg received : ActiveMQObjectMessage {commandId = 5, responseRequired = true, messageId =
ID:soa3.qa.atl2.redhat.com-33389-1235051349934-2:0:1:1:1, originalDestination = null,
originalTransactionId = null, producerId =
ID:soa3.qa.atl2.redhat.com-33389-1235051349934-2:0:1:1, destination = queue://FOO.BAR,
transactionId = null, expiration = 0, timestamp = 1235051350457, arrival = 0, brokerInTime
= 1235051350461, brokerOutTime = 1235051350468, correlationId = null, replyTo = null,
persistent = true, type = null, priority = 4, groupID = null, groupSequence = 0,
targetConsumerId = null, compressed = false, userID = null, content =
org.apache.activemq.util.ByteSequence@195dd5b, marshalledProperties = null, dataStructure
= null, redeliveryCounter = 0, size = 1037, properties = null, readOnlyProperties = true,
readOnlyBody = true, droppable = false}
msg received : ActiveMQObjectMessage {commandId = 6, responseRequired = true, messageId =
ID:soa3.qa.atl2.redhat.com-33389-1235051349934-2:0:1:1:2, originalDestination = null,
originalTransactionId = null, producerId =
ID:soa3.qa.atl2.redhat.com-33389-1235051349934-2:0:1:1, destination = queue://FOO.BAR,
transactionId = null, expiration = 0, timestamp = 1235051350464, arrival = 0, brokerInTime
= 1235051350464, brokerOutTime = 1235051350469, correlationId = null, replyTo = null,
persistent = true, type = null, priority = 4, groupID = null, groupSequence = 0,
targetConsumerId = null, compressed = false, userID = null, content =
org.apache.activemq.util.ByteSequence@12c8fa8, marshalledProperties = null, dataStructure
= null, redeliveryCounter = 0, size = 1038, properties = null, readOnlyProperties = true,
readOnlyBody = true, droppable = false}
msg received : ActiveMQObjectMessage {commandId = 7, responseRequired = true, messageId =
ID:soa3.qa.atl2.redhat.com-33389-1235051349934-2:0:1:1:3, originalDestination = null,
originalTransactionId = null, producerId =
ID:soa3.qa.atl2.redhat.com-33389-1235051349934-2:0:1:1, destination = queue://FOO.BAR,
transactionId = null, expiration = 0, timestamp = 1235051350466, arrival = 0, brokerInTime
= 1235051350468, brokerOutTime = 1235051350469, correlationId = null, replyTo = null,
persistent = true, type = null, priority = 4, groupID = null, groupSequence = 0,
targetConsumerId = null, compressed = false, userID = null, content =
org.apache.activemq.util.ByteSequence@1922f46, marshalledProperties = null, dataStructure
= null, redeliveryCounter = 0, size = 1038, properties = null, readOnlyProperties = true,
readOnlyBody = true, droppable = false}
msg received : ActiveMQObjectMessage {commandId = 8, responseRequired = true, messageId =
ID:soa3.qa.atl2.redhat.com-33389-1235051349934-2:0:1:1:4, originalDestination = null,
originalTransactionId = null, producerId =
ID:soa3.qa.atl2.redhat.com-33389-1235051349934-2:0:1:1, destination = queue://FOO.BAR,
transactionId = null, expiration = 0, timestamp = 1235051350469, arrival = 0, brokerInTime
= 1235051350469, brokerOutTime = 1235051350469, correlationId = null, replyTo = null,
persistent = true, type = null, priority = 4, groupID = null, groupSequence = 0,
targetConsumerId = null, compressed = false, userID = null, content =
org.apache.activemq.util.ByteSequence@15d3388, marshalledProperties = null, dataStructure
= null, redeliveryCounter = 0, size = 1038, properties = null, readOnlyProperties = true,
readOnlyBody = true, droppable = false}
Exception in thread "Thread-4" java.lang.NullPointerException
at
org.drools.runtime.pipeline.impl.JmsUnwrapMessageObject.receive(JmsUnwrapMessageObject.java:18)
at org.drools.runtime.pipeline.impl.BaseEmitter.emit(BaseEmitter.java:31)
at
org.drools.runtime.pipeline.impl.StatefulKnowledgeSessionPipelineImpl.insert(StatefulKnowledgeSessionPipelineImpl.java:35)
at
org.drools.runtime.pipeline.impl.JmsMessenger$JmsMessengerRunner.run(JmsMessenger.java:129)
at java.lang.Thread.run(Thread.java:595)
Tests run: 1, Failures: 0, Errors: 0, Skipped: 0, Time elapsed: 1.505 sec
Running org.drools.runtime.pipeline.impl.JaxbSimpleJmsMessengerTest
msg received : ActiveMQObjectMessage {commandId = 5, responseRequired = true, messageId =
ID:soa3.qa.atl2.redhat.com-33389-1235051349934-2:2:1:1:1, originalDestination = null,
originalTransactionId = null, producerId =
ID:soa3.qa.atl2.redhat.com-33389-1235051349934-2:2:1:1, destination = queue://FOO.BAR,
transactionId = null, expiration = 0, timestamp = 1235051354004, arrival = 0, brokerInTime
= 1235051354006, brokerOutTime = 1235051354007, correlationId = null, replyTo = null,
persistent = true, type = null, priority = 4, groupID = null, groupSequence = 0,
targetConsumerId = null, compressed = false, userID = null, content =
org.apache.activemq.util.ByteSequence@19b4fac, marshalledProperties = null, dataStructure
= null, redeliveryCounter = 0, size = 1417, properties = null, readOnlyProperties = true,
readOnlyBody = true, droppable = false}
Exception in thread "Thread-6" java.lang.NullPointerException
at
org.drools.runtime.pipeline.impl.JmsUnwrapMessageObject.receive(JmsUnwrapMessageObject.java:18)
at org.drools.runtime.pipeline.impl.BaseEmitter.emit(BaseEmitter.java:31)
at
org.drools.runtime.pipeline.impl.StatefulKnowledgeSessionPipelineImpl.insert(StatefulKnowledgeSessionPipelineImpl.java:35)
at
org.drools.runtime.pipeline.impl.JmsMessenger$JmsMessengerRunner.run(JmsMessenger.java:129)
at java.lang.Thread.run(Thread.java:595)
Tests run: 1, Failures: 0, Errors: 0, Skipped: 0, Time elapsed: 3.531 sec
Results :
Tests run: 2, Failures: 0, Errors: 0, Skipped: 0
[INFO] [jar:jar]
[INFO] Building jar:
http://hudson.qa.jboss.com/hudson/job/drools/ws/trunk/drools-pipeline/dro...
[INFO] Preparing source:jar
[WARNING] Removing: jar from forked lifecycle, to prevent recursive invocation.
[INFO] No goals needed for project - skipping
[INFO] [source:jar {execution: default}]
[INFO] Building jar:
http://hudson.qa.jboss.com/hudson/job/drools/ws/trunk/drools-pipeline/dro...
[INFO] Preparing source:test-jar
[WARNING] Removing: jar from forked lifecycle, to prevent recursive invocation.
[WARNING] Removing: test-jar from forked lifecycle, to prevent recursive invocation.
[INFO] No goals needed for project - skipping
[INFO] [source:test-jar {execution: default}]
[INFO] Building jar:
http://hudson.qa.jboss.com/hudson/job/drools/ws/trunk/drools-pipeline/dro...
[INFO] [jar:test-jar {execution: default}]
[INFO] Building jar:
http://hudson.qa.jboss.com/hudson/job/drools/ws/trunk/drools-pipeline/dro...
[INFO] [install:install]
[INFO] Installing
http://hudson.qa.jboss.com/hudson/job/drools/ws/trunk/drools-pipeline/dro...
to
/home/hudson/.m2/repository/org/drools/drools-messenger-jms/5.0.0.SNAPSHOT/drools-messenger-jms-5.0.0.SNAPSHOT.jar
[INFO] Installing
http://hudson.qa.jboss.com/hudson/job/drools/ws/trunk/drools-pipeline/dro...
to
/home/hudson/.m2/repository/org/drools/drools-messenger-jms/5.0.0.SNAPSHOT/drools-messenger-jms-5.0.0.SNAPSHOT-sources.jar
[INFO] Installing
http://hudson.qa.jboss.com/hudson/job/drools/ws/trunk/drools-pipeline/dro...
to
/home/hudson/.m2/repository/org/drools/drools-messenger-jms/5.0.0.SNAPSHOT/drools-messenger-jms-5.0.0.SNAPSHOT-test-sources.jar
[INFO] Installing
http://hudson.qa.jboss.com/hudson/job/drools/ws/trunk/drools-pipeline/dro...
to
/home/hudson/.m2/repository/org/drools/drools-messenger-jms/5.0.0.SNAPSHOT/drools-messenger-jms-5.0.0.SNAPSHOT-tests.jar
[INFO] ------------------------------------------------------------------------
[INFO] Building Drools :: Transformer
[INFO] task-segment: [clean, install]
[INFO] ------------------------------------------------------------------------
[INFO] [clean:clean]
[INFO] [site:attach-descriptor]
[INFO] Preparing source:jar
[WARNING] Removing: jar from forked lifecycle, to prevent recursive invocation.
[INFO] No goals needed for project - skipping
[INFO] [source:jar {execution: default}]
[INFO] Preparing source:test-jar
[WARNING] Removing: jar from forked lifecycle, to prevent recursive invocation.
[WARNING] Removing: test-jar from forked lifecycle, to prevent recursive invocation.
[INFO] No goals needed for project - skipping
[INFO] [source:test-jar {execution: default}]
[INFO] [install:install]
[INFO] Installing
http://hudson.qa.jboss.com/hudson/job/drools/ws/trunk/drools-pipeline/pom... to
/home/hudson/.m2/repository/org/drools/drools-transformer/5.0.0.SNAPSHOT/drools-transformer-5.0.0.SNAPSHOT.pom
[INFO] ------------------------------------------------------------------------
[INFO] Building Drools :: Process :: WorkItems
[INFO] task-segment: [clean, install]
[INFO] ------------------------------------------------------------------------
[INFO] [clean:clean]
[INFO] [resources:resources]
[WARNING] Using platform encoding (UTF-8 actually) to copy filtered resources, i.e. build
is platform dependent!
[INFO] Copying 9 resources
[INFO] [compiler:compile]
[INFO] Compiling 15 source files to
http://hudson.qa.jboss.com/hudson/job/drools/ws/trunk/drools-process/droo...
[INFO] [resources:testResources]
[WARNING] Using platform encoding (UTF-8 actually) to copy filtered resources, i.e. build
is platform dependent!
[INFO] Copying 0 resource
[INFO] Copying 3 resources
[INFO] [compiler:testCompile]
[INFO] Compiling 6 source files to
http://hudson.qa.jboss.com/hudson/job/drools/ws/trunk/drools-process/droo...
[INFO] [surefire:test]
[INFO] Surefire report directory:
http://hudson.qa.jboss.com/hudson/job/drools/ws/trunk/drools-process/droo...
-------------------------------------------------------
T E S T S
-------------------------------------------------------
Running org.drools.process.workitem.rss.RSSWorkItemHandlerTest
Tests run: 1, Failures: 0, Errors: 0, Skipped: 0, Time elapsed: 1.897 sec
Running org.drools.process.workitem.email.EmailWorkItemHandlerTest
log4j:WARN No appenders could be found for logger
(org.subethamail.smtp.server.CommandHandler).
log4j:WARN Please initialize the log4j system properly.
Tests run: 1, Failures: 0, Errors: 0, Skipped: 0, Time elapsed: 0.065 sec
Running org.drools.process.workitem.jabber.JabberWorkItemHandlerTest
Error! A startup class specified in smack-config.xml could not be loaded:
org.jivesoftware.smackx.ServiceDiscoveryManager
Error! A startup class specified in smack-config.xml could not be loaded:
org.jivesoftware.smackx.XHTMLManager
Error! A startup class specified in smack-config.xml could not be loaded:
org.jivesoftware.smackx.muc.MultiUserChat
Error! A startup class specified in smack-config.xml could not be loaded:
org.jivesoftware.smackx.filetransfer.FileTransferManager
Error! A startup class specified in smack-config.xml could not be loaded:
org.jivesoftware.smackx.LastActivityManager
Error! A startup class specified in smack-config.xml could not be loaded:
org.jivesoftware.smackx.ServiceDiscoveryManager
Error! A startup class specified in smack-config.xml could not be loaded:
org.jivesoftware.smackx.XHTMLManager
Error! A startup class specified in smack-config.xml could not be loaded:
org.jivesoftware.smackx.muc.MultiUserChat
Error! A startup class specified in smack-config.xml could not be loaded:
org.jivesoftware.smackx.filetransfer.FileTransferManager
Error! A startup class specified in smack-config.xml could not be loaded:
org.jivesoftware.smackx.LastActivityManager
Connected to
talk4.l.google.com
Logged in as drools.demo(a)gmail.com/SmackCB1142D0
Message Sended
Tests run: 1, Failures: 0, Errors: 0, Skipped: 0, Time elapsed: 1.178 sec
Running org.drools.process.workitem.ftp.FTPUploadWorkItemHandlerTest
Tests run: 2, Failures: 1, Errors: 0, Skipped: 0, Time elapsed: 0.336 sec <<<
FAILURE!
Running com.sample.RuleFlowTest
Tests run: 0, Failures: 0, Errors: 0, Skipped: 0, Time elapsed: 0.003 sec
Results :
Failed tests:
testUploadFile(org.drools.process.workitem.ftp.FTPUploadWorkItemHandlerTest)
Tests run: 5, Failures: 1, Errors: 0, Skipped: 0
[INFO] ------------------------------------------------------------------------
[ERROR] BUILD FAILURE
[INFO] ------------------------------------------------------------------------
[INFO] There are test failures.
Please refer to
http://hudson.qa.jboss.com/hudson/job/drools/ws/trunk/drools-process/droo...
for the individual test results.
[INFO] ------------------------------------------------------------------------
[INFO] For more information, run Maven with the -e switch
[INFO] ------------------------------------------------------------------------
[INFO] Total time: 4 minutes 41 seconds
[INFO] Finished at: Thu Feb 19 08:49:22 EST 2009
[INFO] Final Memory: 48M/992M
[INFO] ------------------------------------------------------------------------
Terminating xvnc
[drools] $ vncserver -kill :10
Killing Xvnc process ID 29320
Recording test results