See
http://hudson.qa.jboss.com/hudson/job/drools/1302/changes
Changes:
[mark.proctor(a)jboss.com] JBRULES-1488 Serialisation TidyUps
-Moved serialisation tests to MarshallingTest
-Removed unneeded byte[] stream wrapper from AbstractRuleBase
[mark.proctor(a)jboss.com] JBRULES-1488 Serialisation TidyUps
-Moved serialisation tests to MarshallingTest
-Removed unneeded byte[] stream wrapper from AbstractRuleBase
------------------------------------------
[...truncated 7464 lines...]
Tests run: 1, Failures: 0, Errors: 0, Skipped: 0, Time elapsed: 0.008 sec
Running org.drools.compiler.PackageBuilderConfigurationTest
Tests run: 5, Failures: 0, Errors: 0, Skipped: 0, Time elapsed: 0.048 sec
Running org.drools.brms.client.modeldriven.SuggestionCompletionEngineTest
Tests run: 7, Failures: 0, Errors: 0, Skipped: 0, Time elapsed: 0.041 sec
Running org.drools.brms.server.util.BRLPersitenceTest
<rule>
<modelVersion>1.0</modelVersion>
<attributes>
<attribute>
<attributeName>no-loop</attributeName>
<value>true</value>
</attribute>
</attributes>
<lhs>
<fact>
<constraintList>
<constraints>
<fieldConstraint>
<fieldBinding>f1</fieldBinding>
<fieldName>age</fieldName>
<operator><</operator>
<value>42</value>
<constraintValueType>0</constraintValueType>
</fieldConstraint>
</constraints>
</constraintList>
<factType>Person</factType>
<boundName>p1</boundName>
</fact>
<compositePattern>
<type>not</type>
<patterns>
<fact>
<factType>Cancel</factType>
</fact>
</patterns>
</compositePattern>
</lhs>
<rhs>
<modify>
<variable>p1</variable>
<fieldValues>
<fieldValue>
<field>status</field>
<value>rejected</value>
<type>String</type>
</fieldValue>
</fieldValues>
</modify>
<retract>
<variableName>p1</variableName>
</retract>
<dslSentence>
<sentence>Send an email to {administrator}</sentence>
</dslSentence>
</rhs>
</rule>
Tests run: 7, Failures: 0, Errors: 0, Skipped: 0, Time elapsed: 0.395 sec
Running org.drools.rule.builder.dialect.java.JavaExprAnalyzerTest
Tests run: 1, Failures: 0, Errors: 0, Skipped: 0, Time elapsed: 0.008 sec
Running org.drools.brms.modeldriven.CompositeFactPatternTest
Tests run: 1, Failures: 0, Errors: 0, Skipped: 0, Time elapsed: 0.016 sec
Running org.drools.integrationtests.sequential.SequentialTest
Iterations in for SEQUENTIAL : 15
Iterations in for RETE : 11
Tests run: 3, Failures: 0, Errors: 0, Skipped: 0, Time elapsed: 8.429 sec
Running org.drools.lang.dsl.DefaultDSLMappingEntryTest
Tests run: 17, Failures: 0, Errors: 0, Skipped: 0, Time elapsed: 0.024 sec
Running org.drools.brms.modeldriven.FactPatternTest
Tests run: 5, Failures: 0, Errors: 0, Skipped: 0, Time elapsed: 0.008 sec
Running org.drools.integrationtests.OutOfMemoryTest
Tests run: 2, Failures: 0, Errors: 0, Skipped: 0, Time elapsed: 13.653 sec
Running
org.drools.rule.builder.dialect.mvel.MVELReturnValueConstraintEvaluatorBuilderTest
Tests run: 1, Failures: 0, Errors: 0, Skipped: 0, Time elapsed: 0.012 sec
Running org.drools.integrationtests.StreamsTest
Tests run: 1, Failures: 0, Errors: 0, Skipped: 0, Time elapsed: 0.043 sec
Running org.drools.rule.builder.dialect.mvel.MVELReturnValueBuilderTest
Tests run: 1, Failures: 0, Errors: 0, Skipped: 0, Time elapsed: 0.015 sec
Running org.drools.integrationtests.StatelessStressTest
Tests run: 1, Failures: 0, Errors: 0, Skipped: 0, Time elapsed: 0.006 sec
Running org.drools.compiler.PackageBuilderTest
stilton 200
Tests run: 28, Failures: 0, Errors: 0, Skipped: 0, Time elapsed: 1.298 sec
Running org.drools.compiler.RuleBaseLoaderTest
Tests run: 2, Failures: 0, Errors: 0, Skipped: 0, Time elapsed: 0.067 sec
Running org.drools.integrationtests.FirstOrderLogicTest
Tests run: 19, Failures: 0, Errors: 0, Skipped: 0, Time elapsed: 0.933 sec
Running org.drools.lang.descr.AndDescrTest
Tests run: 1, Failures: 0, Errors: 0, Skipped: 0, Time elapsed: 0.006 sec
Running org.drools.integrationtests.TruthMaintenanceTest
[ObjectInserted: handle=[fact fid:1:1:[Person name='person']]; object=[Person
name='person']]
[ObjectInserted: handle=[fact fid:2:2:CheeseEqual( type='person', price=2 )];
object=CheeseEqual( type='person', price=2 )]
[ObjectUpdated: handle=[fact fid:1:3:[Person name='person']]; old_object=[Person
name='person']; new_object=[Person name='person']]
[ObjectRetracted: handle=[fact fid:1:3:[Person name='person']]; old_object=[Person
name='person']]
[ObjectRetracted: handle=[fact fid:2:2:CheeseEqual( type='person', price=2 )];
old_object=CheeseEqual( type='person', price=2 )]
Tests run: 14, Failures: 0, Errors: 0, Skipped: 0, Time elapsed: 0.674 sec
Running org.drools.rule.builder.dialect.mvel.MVELSalienceBuilderTest
Tests run: 1, Failures: 0, Errors: 0, Skipped: 0, Time elapsed: 0.027 sec
Running org.drools.testframework.ScenarioRunnerTest
Tests run: 19, Failures: 0, Errors: 0, Skipped: 0, Time elapsed: 0.468 sec
Running org.drools.compiler.RuleFlowErrorTest
Tests run: 1, Failures: 0, Errors: 0, Skipped: 0, Time elapsed: 0.016 sec
Running org.drools.integrationtests.AccumulateTest
Tests run: 27, Failures: 0, Errors: 0, Skipped: 0, Time elapsed: 1.682 sec
Running org.drools.lang.MVELDumperTest
Tests run: 2, Failures: 0, Errors: 0, Skipped: 0, Time elapsed: 0.007 sec
Running org.drools.compiler.RuleErrorTest
IM IN YR EROR problem
problem
problem
Tests run: 1, Failures: 0, Errors: 0, Skipped: 0, Time elapsed: 0.009 sec
Running org.drools.integrationtests.StatefulSessionTest
java.lang.Exception: this should throw an exception
at
org.drools.test.Rule_Throw_Consequence_Exception_0.consequence(Rule_Throw_Consequence_Exception_0.java:7)
at
org.drools.test.Rule_Throw_Consequence_Exception_0ConsequenceInvoker.evaluate(Rule_Throw_Consequence_Exception_0ConsequenceInvoker.java:19)
at org.drools.common.DefaultAgenda.fireActivation(DefaultAgenda.java:550)
at org.drools.common.DefaultAgenda.fireNextItem(DefaultAgenda.java:514)
at org.drools.common.AbstractWorkingMemory.fireAllRules(AbstractWorkingMemory.java:436)
at org.drools.common.AbstractWorkingMemory.fireAllRules(AbstractWorkingMemory.java:408)
at org.drools.concurrent.FireAllRules.execute(FireAllRules.java:23)
at org.drools.concurrent.CommandExecutor.run(CommandExecutor.java:60)
at java.lang.Thread.run(Thread.java:595)
java.lang.Exception: this should throw an exception
at
org.drools.test.Rule_Throw_Consequence_Exception_0.consequence(Rule_Throw_Consequence_Exception_0.java:7)
at
org.drools.test.Rule_Throw_Consequence_Exception_0ConsequenceInvoker.evaluate(Rule_Throw_Consequence_Exception_0ConsequenceInvoker.java:19)
at org.drools.common.DefaultAgenda.fireActivation(DefaultAgenda.java:550)
at org.drools.common.DefaultAgenda.fireNextItem(DefaultAgenda.java:514)
at org.drools.common.AbstractWorkingMemory.fireAllRules(AbstractWorkingMemory.java:436)
at org.drools.common.AbstractWorkingMemory.fireAllRules(AbstractWorkingMemory.java:408)
at org.drools.concurrent.FireAllRules.execute(FireAllRules.java:23)
at org.drools.concurrent.CommandExecutor.run(CommandExecutor.java:60)
at java.lang.Thread.run(Thread.java:595)
java.lang.Exception: this should throw an exception
at
org.drools.test.Rule_Throw_Consequence_Exception_0.consequence(Rule_Throw_Consequence_Exception_0.java:7)
at
org.drools.test.Rule_Throw_Consequence_Exception_0ConsequenceInvoker.evaluate(Rule_Throw_Consequence_Exception_0ConsequenceInvoker.java:19)
at org.drools.common.DefaultAgenda.fireActivation(DefaultAgenda.java:550)
at org.drools.common.DefaultAgenda.fireNextItem(DefaultAgenda.java:514)
at org.drools.common.AbstractWorkingMemory.fireAllRules(AbstractWorkingMemory.java:436)
at org.drools.common.AbstractWorkingMemory.fireAllRules(AbstractWorkingMemory.java:408)
at org.drools.concurrent.FireAllRules.execute(FireAllRules.java:23)
at org.drools.concurrent.CommandExecutor.run(CommandExecutor.java:60)
at java.lang.Thread.run(Thread.java:595)
Tests run: 7, Failures: 0, Errors: 0, Skipped: 0, Time elapsed: 0.763 sec
Running org.drools.xml.processes.ActionNodeTest
(null: 4, 92): cvc-elt.1: Cannot find the declaration of element 'process'.
Tests run: 1, Failures: 0, Errors: 0, Skipped: 0, Time elapsed: 0.06 sec
Running org.drools.brms.server.util.BRDRLPersistenceTest
Tests run: 17, Failures: 0, Errors: 0, Skipped: 0, Time elapsed: 0.026 sec
Running org.drools.testframework.FactPopulatorTest
Tests run: 2, Failures: 0, Errors: 0, Skipped: 0, Time elapsed: 0.01 sec
Running org.drools.brms.modeldriven.CompositeFieldConstraintTest
Tests run: 3, Failures: 0, Errors: 0, Skipped: 0, Time elapsed: 0.005 sec
Running org.drools.integrationtests.eventgenerator.SimpleEventGeneratorTest
Tests run: 8, Failures: 0, Errors: 0, Skipped: 0, Time elapsed: 0.522 sec
Running org.drools.compiler.SourcePackageProviderTest
RuleAgent(default) INFO (Thu Feb 28 15:22:06 EST 2008): Configuring with
newInstance=false, secondsToRefresh=-1
RuleAgent(default) INFO (Thu Feb 28 15:22:06 EST 2008): Configuring package provider :
FileScanner scanning: /tmp/__temp_test_drools_packages/Something.drl
RuleAgent(default) INFO (Thu Feb 28 15:22:06 EST 2008): Applying changes to the rulebase.
RuleAgent(default) INFO (Thu Feb 28 15:22:06 EST 2008): Adding package called HelloWorld
Tests run: 1, Failures: 0, Errors: 0, Skipped: 0, Time elapsed: 0.06 sec
Running org.drools.brms.modeldriven.ConstraintTest
Tests run: 1, Failures: 0, Errors: 0, Skipped: 0, Time elapsed: 0.006 sec
Running org.drools.rule.builder.dialect.mvel.MVELEvalBuilderTest
Tests run: 1, Failures: 0, Errors: 0, Skipped: 0, Time elapsed: 0.013 sec
Running org.drools.integrationtests.waltz.ReteOOWaltzTest
4142
Tests run: 1, Failures: 0, Errors: 0, Skipped: 0, Time elapsed: 4.743 sec
Running org.drools.integrationtests.DynamicRulesTest
Tests run: 16, Failures: 0, Errors: 0, Skipped: 0, Time elapsed: 2.059 sec
Running org.drools.brms.modeldriven.ActionFieldValueTest
Tests run: 1, Failures: 0, Errors: 0, Skipped: 0, Time elapsed: 0.006 sec
Running org.drools.testframework.RuleCoverageListenerTest
Tests run: 1, Failures: 0, Errors: 0, Skipped: 0, Time elapsed: 0.009 sec
Running org.drools.brms.server.util.SuggestionCompletionEngineBuilderTest
Tests run: 1, Failures: 0, Errors: 0, Skipped: 0, Time elapsed: 0.005 sec
Running org.drools.integrationtests.ExecutionFlowControlTest
Tests run: 27, Failures: 0, Errors: 0, Skipped: 0, Time elapsed: 2.113 sec
Running org.drools.brms.modeldriven.ActionSetFieldTest
Tests run: 2, Failures: 0, Errors: 0, Skipped: 0, Time elapsed: 0.006 sec
Running org.drools.brms.modeldriven.RuleModelTest
<rule>
<modelVersion>1.0</modelVersion>
<attributes/>
<lhs>
<fact>
<factType>Car</factType>
<boundName>x</boundName>
</fact>
<fact>
<factType>Car</factType>
<boundName>y</boundName>
</fact>
<fact>
<factType>House</factType>
</fact>
</lhs>
<rhs>
<retract>
<variableName>q</variableName>
</retract>
</rhs>
</rule>
Tests run: 12, Failures: 0, Errors: 0, Skipped: 0, Time elapsed: 0.019 sec
Running org.drools.xml.rules.XmlPackageReaderTest
Tests run: 14, Failures: 0, Errors: 0, Skipped: 0, Time elapsed: 0.323 sec
Running org.drools.lang.RuleParserTest
Tests run: 116, Failures: 0, Errors: 0, Skipped: 0, Time elapsed: 0.18 sec
Running org.drools.rule.builder.dialect.mvel.MVELExprAnalyzerTest
Tests run: 2, Failures: 0, Errors: 0, Skipped: 0, Time elapsed: 0.006 sec
Running org.drools.reteoo.ReteooBuilderTest
Tests run: 3, Failures: 0, Errors: 0, Skipped: 0, Time elapsed: 0.007 sec
Running org.drools.lang.dsl.DefaultExpanderTest
rule 'x'
when
Foo()
then end
Tests run: 6, Failures: 0, Errors: 0, Skipped: 0, Time elapsed: 0.054 sec
Running org.drools.rule.builder.dialect.mvel.MVELPredicateBuilderTest
Tests run: 1, Failures: 0, Errors: 0, Skipped: 0, Time elapsed: 0.017 sec
Running org.drools.brms.server.util.ScenarioXMLPersistenceTest
Tests run: 2, Failures: 0, Errors: 0, Skipped: 0, Time elapsed: 0.05 sec
Results :
Failed tests:
testThreadSafetyEclipse(org.drools.integrationtests.PackageBuilderThreadSafetyTest)
Tests run: 668, Failures: 1, Errors: 0, Skipped: 0
[INFO] ------------------------------------------------------------------------
[ERROR] BUILD FAILURE
[INFO] ------------------------------------------------------------------------
[INFO] There are test failures.
[INFO] ------------------------------------------------------------------------
[INFO] For more information, run Maven with the -e switch
[INFO] ------------------------------------------------------------------------
[INFO] Total time: 2 minutes 43 seconds
[INFO] Finished at: Thu Feb 28 15:22:15 EST 2008
[INFO] Final Memory: 17M/79M
[INFO] ------------------------------------------------------------------------
Terminating xvnc
[drools] $ vncserver -kill :10
Killing Xvnc process ID 24081
ERROR: No artifacts found that match the file pattern
"trunk/target/,rules-ouput/". Configuration error?
ERROR: 'trunk/target/' doesn't match anything, but '' does. Perhaps
that's what you mean?
Recording test results