[
http://jira.jboss.com/jira/browse/JBPM-1268?page=comments#action_12418849 ]
Thomas Diesler commented on JBPM-1268:
--------------------------------------
ant test fails in jbpm-3.2.3.GA
test:
[junit] Running org.jbpm.enterprise.AppServerConfigurationsTest
[junit] Tests run: 4, Failures: 0, Errors: 3, Time elapsed: 1.278 sec
[junit] TEST org.jbpm.enterprise.AppServerConfigurationsTest FAILED
[junit] Running org.jbpm.msg.jms.AsyncProcessingTest
[junit] Tests run: 1, Failures: 0, Errors: 1, Time elapsed: 0.117 sec
[junit] TEST org.jbpm.msg.jms.AsyncProcessingTest FAILED
[junit] Running org.jbpm.persistence.jta.JtaDbPersistenceTest
[junit] Tests run: 4, Failures: 0, Errors: 4, Time elapsed: 0.247 sec
[junit] TEST org.jbpm.persistence.jta.JtaDbPersistenceTest FAILED
[junit] Running org.jbpm.scheduler.ejbtimer.EjbSchedulerTest
[junit] Tests run: 6, Failures: 0, Errors: 6, Time elapsed: 0.231 sec
[junit] TEST org.jbpm.scheduler.ejbtimer.EjbSchedulerTest FAILED
[junit] Tests FAILED
Mavenize enterprise
-------------------
Key: JBPM-1268
URL:
http://jira.jboss.com/jira/browse/JBPM-1268
Project: JBoss jBPM
Issue Type: Sub-task
Components: jPDL 3
Reporter: Thomas Diesler
Assigned To: Thomas Diesler
Fix For: jBPM jPDL 3.2.4
--
This message is automatically generated by JIRA.
-
If you think it was sent incorrectly contact one of the administrators:
http://jira.jboss.com/jira/secure/Administrators.jspa
-
For more information on JIRA, see:
http://www.atlassian.com/software/jira