See
<
http://hudson.qa.jboss.com/hudson/job/jbosstools-teiid-designer_trunk/160...
Changes:
[mickael_istria] JBIDE-12003: Maven job to publish TP first publish site and then
validates targets. So unified.target validation was re-enabled by default since it always
happen after mutliple.target was built.
[mickael_istria] JBIDE-12003: Maven job to publish TP first publish site and then
validates targets. So unified.target validation was re-enabled by default since it always
happen after mutliple.target was built.
------------------------------------------
[...truncated 20785 lines...]
[INFO] argLine set to
-javaagent:<http://hudson.qa.jboss.com/hudson/job/jbosstools-teiid-designer_trunk/ws/.repository/org/jacoco/org.jacoco.agent/0.5.7.201204190339/org.jacoco.agent-0.5.7.201204190339-runtime.jar=destfile=/mnt/hudson_workspace/workspace/jbosstools-teiid-designer_trunk/sources/target/jacoco.exec,append=true,includes=org.jboss.tools.*>
[INFO]
[INFO] --- tycho-source-plugin:0.15.0:plugin-source (plugin-source) @
org.teiid.designer.runtime.feature ---
[INFO]
[INFO] --- tycho-packaging-plugin:0.15.0:package-feature (default-package-feature) @
org.teiid.designer.runtime.feature ---
[INFO] Building jar:
<
http://hudson.qa.jboss.com/hudson/job/jbosstools-teiid-designer_trunk/ws/...
[INFO]
[INFO] --- tycho-p2-plugin:0.15.0:p2-metadata-default (default-p2-metadata-default) @
org.teiid.designer.runtime.feature ---
[INFO]
[INFO] --- tycho-p2-plugin:0.15.0:feature-p2-metadata (default-feature-p2-metadata) @
org.teiid.designer.runtime.feature ---
[INFO]
[INFO] --- maven-install-plugin:2.3.1:install (default-install) @
org.teiid.designer.runtime.feature ---
[INFO] Installing
<
http://hudson.qa.jboss.com/hudson/job/jbosstools-teiid-designer_trunk/ws/...
to
<
http://hudson.qa.jboss.com/hudson/job/jbosstools-teiid-designer_trunk/ws/...
[INFO] Installing
<
http://hudson.qa.jboss.com/hudson/job/jbosstools-teiid-designer_trunk/ws/...
to
<
http://hudson.qa.jboss.com/hudson/job/jbosstools-teiid-designer_trunk/ws/...
[INFO] Installing
<
http://hudson.qa.jboss.com/hudson/job/jbosstools-teiid-designer_trunk/ws/...
to
<
http://hudson.qa.jboss.com/hudson/job/jbosstools-teiid-designer_trunk/ws/...
[INFO] Installing
<
http://hudson.qa.jboss.com/hudson/job/jbosstools-teiid-designer_trunk/ws/...
to
<
http://hudson.qa.jboss.com/hudson/job/jbosstools-teiid-designer_trunk/ws/...
[INFO]
[INFO] --- tycho-p2-plugin:0.15.0:update-local-index (default-update-local-index) @
org.teiid.designer.runtime.feature ---
[INFO]
[INFO] ------------------------------------------------------------------------
[INFO] Building org.teiid.datatools.connectivity.feature 8.0.0-SNAPSHOT
[INFO] ------------------------------------------------------------------------
[INFO]
[INFO] --- maven-clean-plugin:2.4.1:clean (default-clean) @
org.teiid.datatools.connectivity.feature ---
[INFO] Deleting
<
http://hudson.qa.jboss.com/hudson/job/jbosstools-teiid-designer_trunk/ws/...
[INFO]
[INFO] --- tycho-packaging-plugin:0.15.0:build-qualifier (default-build-qualifier) @
org.teiid.datatools.connectivity.feature ---
[INFO]
[INFO] --- tycho-packaging-plugin:0.15.0:validate-id (default-validate-id) @
org.teiid.datatools.connectivity.feature ---
[INFO]
[INFO] --- tycho-packaging-plugin:0.15.0:validate-version (default-validate-version) @
org.teiid.datatools.connectivity.feature ---
[INFO]
[INFO] --- jacoco-maven-plugin:0.5.7.201204190339:prepare-agent (default) @
org.teiid.datatools.connectivity.feature ---
[INFO] argLine set to
-javaagent:<http://hudson.qa.jboss.com/hudson/job/jbosstools-teiid-designer_trunk/ws/.repository/org/jacoco/org.jacoco.agent/0.5.7.201204190339/org.jacoco.agent-0.5.7.201204190339-runtime.jar=destfile=/mnt/hudson_workspace/workspace/jbosstools-teiid-designer_trunk/sources/target/jacoco.exec,append=true,includes=org.jboss.tools.*>
[INFO]
[INFO] --- tycho-source-plugin:0.15.0:plugin-source (plugin-source) @
org.teiid.datatools.connectivity.feature ---
[INFO]
[INFO] --- tycho-packaging-plugin:0.15.0:package-feature (default-package-feature) @
org.teiid.datatools.connectivity.feature ---
[INFO] Building jar:
<
http://hudson.qa.jboss.com/hudson/job/jbosstools-teiid-designer_trunk/ws/...
[INFO]
[INFO] --- tycho-p2-plugin:0.15.0:p2-metadata-default (default-p2-metadata-default) @
org.teiid.datatools.connectivity.feature ---
[INFO]
[INFO] --- tycho-p2-plugin:0.15.0:feature-p2-metadata (default-feature-p2-metadata) @
org.teiid.datatools.connectivity.feature ---
[INFO]
[INFO] --- maven-install-plugin:2.3.1:install (default-install) @
org.teiid.datatools.connectivity.feature ---
[INFO] Installing
<
http://hudson.qa.jboss.com/hudson/job/jbosstools-teiid-designer_trunk/ws/...
to
<
http://hudson.qa.jboss.com/hudson/job/jbosstools-teiid-designer_trunk/ws/...
[INFO] Installing
<
http://hudson.qa.jboss.com/hudson/job/jbosstools-teiid-designer_trunk/ws/...
to
<
http://hudson.qa.jboss.com/hudson/job/jbosstools-teiid-designer_trunk/ws/...
[INFO] Installing
<
http://hudson.qa.jboss.com/hudson/job/jbosstools-teiid-designer_trunk/ws/...
to
<
http://hudson.qa.jboss.com/hudson/job/jbosstools-teiid-designer_trunk/ws/...
[INFO] Installing
<
http://hudson.qa.jboss.com/hudson/job/jbosstools-teiid-designer_trunk/ws/...
to
<
http://hudson.qa.jboss.com/hudson/job/jbosstools-teiid-designer_trunk/ws/...
[INFO]
[INFO] --- tycho-p2-plugin:0.15.0:update-local-index (default-update-local-index) @
org.teiid.datatools.connectivity.feature ---
[INFO]
[INFO] ------------------------------------------------------------------------
[INFO] Building org.teiid.designer.test 8.0.0-SNAPSHOT
[INFO] ------------------------------------------------------------------------
[INFO]
[INFO] --- maven-clean-plugin:2.4.1:clean (default-clean) @ org.teiid.designer.test ---
[INFO] Deleting
<
http://hudson.qa.jboss.com/hudson/job/jbosstools-teiid-designer_trunk/ws/...
[INFO]
[INFO] --- tycho-packaging-plugin:0.15.0:build-qualifier (default-build-qualifier) @
org.teiid.designer.test ---
[INFO]
[INFO] --- tycho-packaging-plugin:0.15.0:validate-id (default-validate-id) @
org.teiid.designer.test ---
[INFO]
[INFO] --- tycho-packaging-plugin:0.15.0:validate-version (default-validate-version) @
org.teiid.designer.test ---
[INFO]
[INFO] --- jacoco-maven-plugin:0.5.7.201204190339:prepare-agent (default) @
org.teiid.designer.test ---
[INFO] argLine set to
-javaagent:<http://hudson.qa.jboss.com/hudson/job/jbosstools-teiid-designer_trunk/ws/.repository/org/jacoco/org.jacoco.agent/0.5.7.201204190339/org.jacoco.agent-0.5.7.201204190339-runtime.jar=destfile=/mnt/hudson_workspace/workspace/jbosstools-teiid-designer_trunk/sources/target/jacoco.exec,append=true,includes=org.jboss.tools.*>
[INFO]
[INFO] --- maven-resources-plugin:2.4.1:resources (default-resources) @
org.teiid.designer.test ---
[INFO] Using 'ISO-8859-1' encoding to copy filtered resources.
[INFO] skip non existing resourceDirectory
<
http://hudson.qa.jboss.com/hudson/job/jbosstools-teiid-designer_trunk/ws/...
[INFO]
[INFO] --- tycho-compiler-plugin:0.15.0:compile (default-compile) @
org.teiid.designer.test ---
[INFO] Compiling 2 source files to
<
http://hudson.qa.jboss.com/hudson/job/jbosstools-teiid-designer_trunk/ws/...
[INFO]
[INFO] --- maven-resources-plugin:2.4.1:testResources (default-testResources) @
org.teiid.designer.test ---
[INFO] Using 'ISO-8859-1' encoding to copy filtered resources.
[INFO] skip non existing resourceDirectory
<
http://hudson.qa.jboss.com/hudson/job/jbosstools-teiid-designer_trunk/ws/...
[INFO]
[INFO] --- tycho-source-plugin:0.15.0:plugin-source (plugin-source) @
org.teiid.designer.test ---
[WARNING] bundle localization file
<
http://hudson.qa.jboss.com/hudson/job/jbosstools-teiid-designer_trunk/ws/...
not found
[WARNING] Bundle-Name header not found in
<
http://hudson.qa.jboss.com/hudson/job/jbosstools-teiid-designer_trunk/ws/...
fallback to Bundle-SymbolicName for source bundle
[WARNING] Bundle-Vendor header not found in
<
http://hudson.qa.jboss.com/hudson/job/jbosstools-teiid-designer_trunk/ws/...
fallback to 'unknown' for source bundle
[INFO] Building jar:
<
http://hudson.qa.jboss.com/hudson/job/jbosstools-teiid-designer_trunk/ws/...
[INFO]
[INFO] --- tycho-packaging-plugin:0.15.0:package-plugin (default-package-plugin) @
org.teiid.designer.test ---
[INFO] Building jar:
<
http://hudson.qa.jboss.com/hudson/job/jbosstools-teiid-designer_trunk/ws/...
[INFO]
[INFO] --- tycho-p2-plugin:0.15.0:p2-metadata-default (default-p2-metadata-default) @
org.teiid.designer.test ---
[INFO]
[INFO] --- maven-install-plugin:2.3.1:install (default-install) @ org.teiid.designer.test
---
[INFO] Installing
<
http://hudson.qa.jboss.com/hudson/job/jbosstools-teiid-designer_trunk/ws/...
to
<
http://hudson.qa.jboss.com/hudson/job/jbosstools-teiid-designer_trunk/ws/...
[INFO] Installing
<
http://hudson.qa.jboss.com/hudson/job/jbosstools-teiid-designer_trunk/ws/...
to
<
http://hudson.qa.jboss.com/hudson/job/jbosstools-teiid-designer_trunk/ws/...
[INFO] Installing
<
http://hudson.qa.jboss.com/hudson/job/jbosstools-teiid-designer_trunk/ws/...
to
<
http://hudson.qa.jboss.com/hudson/job/jbosstools-teiid-designer_trunk/ws/...
[INFO] Installing
<
http://hudson.qa.jboss.com/hudson/job/jbosstools-teiid-designer_trunk/ws/...
to
<
http://hudson.qa.jboss.com/hudson/job/jbosstools-teiid-designer_trunk/ws/...
[INFO] Installing
<
http://hudson.qa.jboss.com/hudson/job/jbosstools-teiid-designer_trunk/ws/...
to
<
http://hudson.qa.jboss.com/hudson/job/jbosstools-teiid-designer_trunk/ws/...
[INFO]
[INFO] --- tycho-p2-plugin:0.15.0:update-local-index (default-update-local-index) @
org.teiid.designer.test ---
[INFO]
[INFO] ------------------------------------------------------------------------
[INFO] Skipping teiid.site
[INFO] This project has been banned from the build due to previous failures.
[INFO] ------------------------------------------------------------------------
[INFO] ------------------------------------------------------------------------
[INFO] Reactor Summary:
[INFO]
[INFO] teiid.all ......................................... SUCCESS [1.662s]
[INFO] teiid.plugins ..................................... SUCCESS [0.025s]
[INFO] net.jcip.annotations .............................. SUCCESS [0.767s]
[INFO] net.sf.saxon ...................................... SUCCESS [0.515s]
[INFO] org.apache.poi .................................... SUCCESS [0.193s]
[INFO] org.jaxen ......................................... SUCCESS [0.341s]
[INFO] org.mockito ....................................... SUCCESS [0.450s]
[INFO] org.teiid.datatools.connectivity.model ............ SUCCESS [1.169s]
[INFO] org.teiid.datatools.connectivity .................. SUCCESS [0.911s]
[INFO] org.teiid.datatools.connectivity.ui ............... SUCCESS [1.073s]
[INFO] teiid_embedded_query .............................. SUCCESS [0.488s]
[INFO] org.teiid.core.designer ........................... SUCCESS [0.875s]
[INFO] org.teiid.designer ................................ SUCCESS [0.205s]
[INFO] org.teiid.designer.modeshape ...................... SUCCESS [0.280s]
[INFO] org.teiid.designer.legacy ......................... SUCCESS [2.330s]
[INFO] org.teiid.designer.metamodels.diagram ............. SUCCESS [0.529s]
[INFO] org.teiid.designer.metamodels.core ................ SUCCESS [0.803s]
[INFO] org.teiid.designer.metamodels.transformation ...... SUCCESS [1.240s]
[INFO] org.teiid.designer.extension ...................... SUCCESS [0.557s]
[INFO] org.teiid.designer.core ........................... SUCCESS [3.558s]
[INFO] org.teiid.designer.ui.common ...................... SUCCESS [1.336s]
[INFO] org.teiid.designer.compare ........................ SUCCESS [0.617s]
[INFO] org.teiid.designer.core.xslt ...................... SUCCESS [0.281s]
[INFO] org.teiid.designer.metamodels.relational .......... SUCCESS [1.307s]
[INFO] org.teiid.designer.ddl ............................ SUCCESS [0.336s]
[INFO] org.teiid.designer.jdbc ........................... SUCCESS [0.684s]
[INFO] org.teiid.designer.jdbc.relational ................ SUCCESS [0.486s]
[INFO] org.teiid.designer.metamodels.xsd ................. SUCCESS [0.521s]
[INFO] org.teiid.designer.metamodels.xml ................. SUCCESS [0.774s]
[INFO] org.teiid.designer.mapping ........................ SUCCESS [0.390s]
[INFO] org.teiid.designer.metamodels.function ............ SUCCESS [0.499s]
[INFO] org.teiid.designer.metamodels.webservice .......... SUCCESS [0.605s]
[INFO] org.teiid.designer.metamodels.wsdl ................ SUCCESS [0.810s]
[INFO] org.teiid.designer.relational ..................... SUCCESS [0.396s]
[INFO] org.teiid.designer.xml ............................ SUCCESS [0.379s]
[INFO] org.teiid.designer.udf ............................ SUCCESS [0.277s]
[INFO] org.teiid.designer.transformation ................. SUCCESS [1.049s]
[INFO] org.teiid.designer.webservice ..................... SUCCESS [0.995s]
[INFO] org.teiid.designer.ui ............................. SUCCESS [3.115s]
[INFO] org.teiid.designer.datatools ...................... SUCCESS [0.612s]
[INFO] org.teiid.designer.datatools.ui ................... SUCCESS [0.737s]
[INFO] org.teiid.designer.roles .......................... SUCCESS [0.222s]
[INFO] org.teiid.designer.vdb ............................ SUCCESS [0.523s]
[INFO] org.teiid.designer.dqp ............................ SUCCESS [0.593s]
[INFO] org.teiid.designer.compare.ui ..................... SUCCESS [0.546s]
[INFO] org.teiid.designer.diagram.ui ..................... SUCCESS [1.834s]
[INFO] org.teiid.designer.roles.ui ....................... SUCCESS [0.444s]
[INFO] org.teiid.designer.vdb.ui ......................... SUCCESS [0.720s]
[INFO] org.teiid.designer.query.ui ....................... SUCCESS [0.671s]
[INFO] org.teiid.designer.tools.textimport.ui ............ SUCCESS [0.448s]
[INFO] org.teiid.designer.relational.ui .................. SUCCESS [0.917s]
[INFO] org.teiid.designer.transformation.ui .............. SUCCESS [2.318s]
[INFO] org.teiid.designer.jdbc.ui ........................ SUCCESS [0.642s]
[INFO] org.teiid.designer.sdt ............................ SUCCESS [0.313s]
[INFO] org.teiid.designer.dqp.ui ......................... SUCCESS [1.348s]
[INFO] org.teiid.designer.advisor.ui ..................... SUCCESS [1.127s]
[INFO] org.teiid.designer.ddl.importer ................... SUCCESS [0.270s]
[INFO] org.teiid.designer.ddl.importer.ui ................ SUCCESS [0.427s]
[INFO] org.teiid.designer.extension.ui ................... SUCCESS [0.809s]
[INFO] org.teiid.designer.help ........................... SUCCESS [0.121s]
[INFO] org.teiid.designer.xsd ............................ SUCCESS [0.258s]
[INFO] org.teiid.designer.mapping.ui ..................... SUCCESS [1.241s]
[INFO] org.teiid.designer.metamodels.builder ............. SUCCESS [0.276s]
[INFO] org.teiid.designer.metamodels.builder.execution ... SUCCESS [0.318s]
[INFO] org.teiid.designer.metamodels.dependency .......... SUCCESS [0.299s]
[INFO] org.teiid.designer.metamodels.xsd.ui .............. SUCCESS [0.869s]
[INFO] org.teiid.designer.modelgenerator ................. SUCCESS [0.282s]
[INFO] org.wsdl4j ........................................ SUCCESS [0.121s]
[INFO] org.teiid.designer.modelgenerator.salesforce ...... SUCCESS [0.516s]
[INFO] org.teiid.designer.modelgenerator.salesforce.ui ... SUCCESS [0.600s]
[INFO] org.teiid.designer.modelgenerator.ui .............. SUCCESS [0.306s]
[INFO] org.teiid.designer.schema.tools ................... SUCCESS [0.451s]
[INFO] org.teiid.designer.modelgenerator.xml ............. SUCCESS [0.975s]
[INFO] org.teiid.designer.modelgenerator.wsdl ............ SUCCESS [0.661s]
[INFO] org.teiid.designer.xsd.ui ......................... SUCCESS [1.642s]
[INFO] org.teiid.designer.modelgenerator.wsdl.ui ......... SUCCESS [0.929s]
[INFO] org.teiid.designer.udf.ui ......................... SUCCESS [0.384s]
[INFO] org.teiid.designer.xml.ui ......................... SUCCESS [0.702s]
[INFO] org.teiid.designer.webservice.ui .................. SUCCESS [0.934s]
[INFO] teiid.features .................................... SUCCESS [0.032s]
[INFO] org.teiid.designer.feature ........................ SUCCESS [0.316s]
[INFO] teiid.tests ....................................... SUCCESS [0.011s]
[INFO] org.teiid.core.designer.test.framework ............ SUCCESS [0.290s]
[INFO] org.teiid.core.designer.test ...................... SUCCESS [12.799s]
[INFO] org.teiid.designer.compare.test ................... SUCCESS [10.489s]
[INFO] org.teiid.designer.core.test.framework ............ SUCCESS [0.851s]
[INFO] org.teiid.designer.core.test ...................... SUCCESS [42.032s]
[INFO] org.teiid.designer.core.xslt.test ................. SUCCESS [9.420s]
[INFO] org.teiid.designer.ddl.importer.test .............. SUCCESS [10.728s]
[INFO] org.teiid.designer.dqp.test ....................... SUCCESS [15.701s]
[INFO] org.teiid.designer.extension.test ................. SUCCESS [10.872s]
[INFO] org.teiid.designer.jdbc.test.framework ............ SUCCESS [0.300s]
[INFO] org.teiid.designer.jdbc.relational.test ........... SUCCESS [10.523s]
[INFO] org.teiid.designer.jdbc.test ...................... SUCCESS [10.308s]
[INFO] org.teiid.designer.mapping.ui.test ................ SUCCESS [10.608s]
[INFO] org.teiid.designer.metamodels.core.test ........... SUCCESS [8.210s]
[INFO] org.teiid.designer.metamodels.relational.test ..... SUCCESS [9.115s]
[INFO] org.teiid.designer.metamodels.transformation.test . SUCCESS [8.136s]
[INFO] org.teiid.designer.metamodels.wsdl.test ........... SUCCESS [10.432s]
[INFO] org.teiid.designer.metamodels.xml.test ............ SUCCESS [8.312s]
[INFO] org.teiid.designer.modelgenerator.salesforce.test . SUCCESS [9.332s]
[INFO] org.teiid.designer.modelgenerator.test ............ SUCCESS [8.713s]
[INFO] org.teiid.designer.modelgenerator.wsdl.test ....... SUCCESS [11.536s]
[INFO] org.teiid.designer.query.ui.test .................. SUCCESS [9.530s]
[INFO] org.teiid.designer.schema.tools.test .............. SUCCESS [8.571s]
[INFO] org.teiid.designer.sdt.test ....................... SUCCESS [9.543s]
[INFO] org.teiid.designer.transformation.test ............ SUCCESS [14.258s]
[INFO] org.teiid.designer.ui.common.test ................. SUCCESS [19.200s]
[INFO] org.teiid.designer.ui.test ........................ SUCCESS [9.391s]
[INFO] org.teiid.designer.webservice.test ................ SUCCESS [10.388s]
[INFO] org.teiid.designer.webservice.ui.test ............. SUCCESS [9.699s]
[INFO] org.teiid.designer.xml.ui.test .................... FAILURE [5.612s]
[INFO] org.teiid.designer.xsd.ui.test .................... SUCCESS [9.667s]
[INFO] org.teiid.designer.ui.bot.test .................... SUCCESS [11.163s]
[INFO] org.teiid.designer.vdb.test ....................... SUCCESS [13.344s]
[INFO] org.teiid.designer.test.feature ................... SKIPPED
[INFO] org.teiid.designer.runtime.feature ................ SUCCESS [0.324s]
[INFO] org.teiid.datatools.connectivity.feature .......... SUCCESS [0.127s]
[INFO] org.teiid.designer.test ........................... SUCCESS [0.336s]
[INFO] teiid.site ........................................ SKIPPED
[INFO] ------------------------------------------------------------------------
[INFO] BUILD FAILURE
[INFO] ------------------------------------------------------------------------
[INFO] Total time: 8:08.601s
[INFO] Finished at: Wed Jul 18 08:12:32 EDT 2012
[INFO] Final Memory: 182M/507M
[INFO] ------------------------------------------------------------------------
[ERROR] Failed to execute goal org.eclipse.tycho:tycho-surefire-plugin:0.15.0:test
(default-test) on project org.teiid.designer.xml.ui.test: An unexpected error occured
(return code 13). See log for details. -> [Help 1]
[ERROR]
[ERROR] To see the full stack trace of the errors, re-run Maven with the -e switch.
[ERROR] Re-run Maven using the -X switch to enable full debug logging.
[ERROR]
[ERROR] For more information about the errors and possible solutions, please read the
following articles:
[ERROR] [Help 1]
http://cwiki.apache.org/confluence/display/MAVEN/MojoFailureException
[ERROR]
[ERROR] After correcting the problems, you can resume the build with the command
[ERROR] mvn <goals> -rf :org.teiid.designer.xml.ui.test
Build step 'Invoke top-level Maven targets' marked build as failure
Terminating xvnc.
$ vncserver -kill :217
Killing Xvnc process ID 29001
Archiving artifacts
Recording test results