Build failed in Hudson: JBoss-AS-5.1.x-testSuite-sun16 #313

jboss-qa-internal at redhat.com jboss-qa-internal at redhat.com
Mon Aug 10 10:54:42 EDT 2009


See http://hudson.qa.jboss.com/hudson/job/JBoss-AS-5.1.x-testSuite-sun16/313/

------------------------------------------
[...truncated 21573 lines...]
    [junit] Tests run: 1, Failures: 0, Errors: 0, Time elapsed: 9.494 sec
    [junit] Running org.jboss.test.jca.test.ExecuteSQLDuringRollbackStressTestCase
    [junit] Tests run: 1, Failures: 0, Errors: 0, Time elapsed: 25.641 sec
    [junit] Running org.jboss.test.jca.test.HAConnectionFactoryUnitTestCase
    [junit] Tests run: 3, Failures: 0, Errors: 0, Time elapsed: 65.411 sec
    [junit] Running org.jboss.test.jca.test.InflowUnitTestCase
    [junit] Tests run: 1, Failures: 0, Errors: 0, Time elapsed: 1.199 sec
    [junit] Running org.jboss.test.jca.test.InternalManagedConnectionPoolStatUnitTestCase
    [junit] Tests run: 1, Failures: 0, Errors: 0, Time elapsed: 0.139 sec
    [junit] Running org.jboss.test.jca.test.JDBCComplianceUnitTestCase
    [junit] Tests run: 1, Failures: 0, Errors: 0, Time elapsed: 1.315 sec
    [junit] Running org.jboss.test.jca.test.JDBCDriverRedeployUnitTestCase
    [junit] Tests run: 1, Failures: 0, Errors: 0, Time elapsed: 0.148 sec
    [junit] Running org.jboss.test.jca.test.JDBCStatementTestsConnectionUnitTestCase
    [junit] Tests run: 7, Failures: 0, Errors: 0, Time elapsed: 3.042 sec
    [junit] Running org.jboss.test.jca.test.LocalTransactionTidyupUnitTestCase
    [junit] Tests run: 10, Failures: 0, Errors: 0, Time elapsed: 2.351 sec
    [junit] Running org.jboss.test.jca.test.LocalWrapperCleanupUnitTestCase
    [junit] Tests run: 8, Failures: 0, Errors: 0, Time elapsed: 4.088 sec
    [junit] Running org.jboss.test.jca.test.ManagedDeploymentUnitTestCase
    [junit] Tests run: 10, Failures: 0, Errors: 0, Time elapsed: 2.664 sec
    [junit] Running org.jboss.test.jca.test.MultiThreadedTxDsUnitTestCase
    [junit] Tests run: 4, Failures: 0, Errors: 0, Time elapsed: 3.585 sec
    [junit] Running org.jboss.test.jca.test.MultiThreadedTxUnitTestCase
    [junit] Tests run: 10, Failures: 0, Errors: 0, Time elapsed: 5.718 sec
    [junit] Running org.jboss.test.jca.test.PSCacheUnitTestCase
    [junit] Tests run: 6, Failures: 0, Errors: 0, Time elapsed: 2.255 sec
    [junit] Running org.jboss.test.jca.test.PoolingUnitTestCase
    [junit] Tests run: 5, Failures: 0, Errors: 0, Time elapsed: 1.743 sec
    [junit] Running org.jboss.test.jca.test.PreFillPoolingUnitTestCase
    [junit] Tests run: 9, Failures: 0, Errors: 0, Time elapsed: 39.919 sec
    [junit] Running org.jboss.test.jca.test.RecyclingInterleavingStressTestCase
    [junit] Tests run: 1, Failures: 0, Errors: 0, Time elapsed: 6.113 sec
    [junit] Running org.jboss.test.jca.test.RecyclingStickyStressTestCase
    [junit] Tests run: 1, Failures: 0, Errors: 0, Time elapsed: 4.376 sec
    [junit] Running org.jboss.test.jca.test.RecyclingStickyWithContinuousPoisonThreadStressTestCase
    [junit] Tests run: 1, Failures: 0, Errors: 0, Time elapsed: 4.378 sec
    [junit] Running org.jboss.test.jca.test.RecyclingStickyWithPoisonThreadStressTestCase
    [junit] Tests run: 1, Failures: 0, Errors: 0, Time elapsed: 4.446 sec
    [junit] Running org.jboss.test.jca.test.ReentrantUnitTestCase
    [junit] Tests run: 1, Failures: 0, Errors: 0, Time elapsed: 2.895 sec
    [junit] Running org.jboss.test.jca.test.RemoteDSUnitTestCase
    [junit] Tests run: 1, Failures: 0, Errors: 0, Time elapsed: 1.053 sec
    [junit] Running org.jboss.test.jca.test.RetryableResourceUnitTestCase
    [junit] Tests run: 1, Failures: 0, Errors: 0, Time elapsed: 0.153 sec
    [junit] Running org.jboss.test.jca.test.RollbackOnlyReleaseConnectionUnitTestCase
    [junit] Tests run: 1, Failures: 0, Errors: 0, Time elapsed: 2.626 sec
    [junit] Running org.jboss.test.jca.test.ScopedRARNoJBossAppUnitTestCase
    [junit] Tests run: 1, Failures: 0, Errors: 0, Time elapsed: 1.074 sec
    [junit] Running org.jboss.test.jca.test.ScopedRARUnitTestCase
    [junit] Tests run: 1, Failures: 0, Errors: 0, Time elapsed: 0.826 sec
    [junit] Running org.jboss.test.jca.test.StaleConnectionCheckerUnitTestCase
    [junit] Tests run: 3, Failures: 0, Errors: 0, Time elapsed: 0.42 sec
    [junit] Running org.jboss.test.jca.test.StatisticsFormatterUnitTestCase
    [junit] Tests run: 6, Failures: 1, Errors: 0, Time elapsed: 0.936 sec
    [junit] Test org.jboss.test.jca.test.StatisticsFormatterUnitTestCase FAILED
    [junit] Running org.jboss.test.jca.test.StatisticsReporterUnitTestCase
    [junit] Tests run: 1, Failures: 0, Errors: 0, Time elapsed: 10.183 sec
    [junit] Running org.jboss.test.jca.test.TestConnectionUnitTestCase
    [junit] Tests run: 1, Failures: 0, Errors: 0, Time elapsed: 0.459 sec
    [junit] Running org.jboss.test.jca.test.TimerUnitTestCase
    [junit] Tests run: 1, Failures: 0, Errors: 0, Time elapsed: 10.608 sec
    [junit] Running org.jboss.test.jca.test.TransactionActiveUnitTestCase
    [junit] Tests run: 2, Failures: 0, Errors: 0, Time elapsed: 23.602 sec
    [junit] Running org.jboss.test.jca.test.TxConnectionManagerUnitTestCase
    [junit] Tests run: 12, Failures: 0, Errors: 0, Time elapsed: 9.806 sec
    [junit] Running org.jboss.test.jca.test.TxInflowUnitTestCase
    [junit] Tests run: 1, Failures: 0, Errors: 0, Time elapsed: 0.691 sec
    [junit] Running org.jboss.test.jca.test.UncontendedInterleavingStressTestCase
    [junit] Tests run: 1, Failures: 0, Errors: 0, Time elapsed: 3.905 sec
    [junit] Running org.jboss.test.jca.test.UncontendedStickyStressTestCase
    [junit] Tests run: 1, Failures: 0, Errors: 0, Time elapsed: 4.195 sec
    [junit] Running org.jboss.test.jca.test.UnsharedConnectionUnitTestCase
    [junit] Tests run: 1, Failures: 0, Errors: 0, Time elapsed: 1.401 sec
    [junit] Running org.jboss.test.jca.test.UserTxUnitTestCase
    [junit] Tests run: 2, Failures: 0, Errors: 0, Time elapsed: 2.12 sec
    [junit] Running org.jboss.test.jca.test.WorkManagerUnitTestCase
    [junit] Tests run: 1, Failures: 0, Errors: 0, Time elapsed: 0.604 sec
    [junit] Running org.jboss.test.jca.test.XADSUnitTestCase
    [junit] Tests run: 1, Failures: 0, Errors: 0, Time elapsed: 0.623 sec
    [junit] Running org.jboss.test.jca.test.XAExceptionUnitTestCase
    [junit] Tests run: 14, Failures: 0, Errors: 0, Time elapsed: 3.52 sec
    [junit] Running org.jboss.test.jca.test.XATxConnectionManagerUnitTestCase
    [junit] Tests run: 8, Failures: 0, Errors: 0, Time elapsed: 1.942 sec
    [junit] Running org.jboss.test.tm.test.BMTCleanUpUnitTestCase
    [junit] Tests run: 2, Failures: 0, Errors: 0, Time elapsed: 11.159 sec
    [junit] Running org.jboss.test.tm.test.MTTransactionManagerUnitTestCase
    [junit] Tests run: 3, Failures: 0, Errors: 0, Time elapsed: 1.014 sec
    [junit] Running org.jboss.test.tm.test.SimpleNoLockTransactionLocalStressTestCase
    [junit] Tests run: 1, Failures: 0, Errors: 0, Time elapsed: 1.481 sec
    [junit] Running org.jboss.test.tm.test.SimpleTransactionLocalStressTestCase
    [junit] Tests run: 1, Failures: 0, Errors: 0, Time elapsed: 1.603 sec
    [junit] Running org.jboss.test.tm.test.SimpleUncontendedNoLockTransactionLocalStressTestCase
    [junit] Tests run: 1, Failures: 0, Errors: 0, Time elapsed: 1.409 sec
    [junit] Running org.jboss.test.tm.test.SimpleUncontendedTransactionLocalStressTestCase
    [junit] Tests run: 1, Failures: 0, Errors: 0, Time elapsed: 1.456 sec
    [junit] Running org.jboss.test.tm.test.TransactionLocalUnitTestCase
    [junit] Tests run: 22, Failures: 0, Errors: 0, Time elapsed: 2.549 sec
    [junit] Running org.jboss.test.tm.test.TransactionManagerUnitTestCase
    [junit] Tests run: 28, Failures: 0, Errors: 0, Time elapsed: 1.365 sec
    [junit] Running org.jboss.test.tm.test.TxTimeoutUnitTestCase
    [junit] Tests run: 2, Failures: 0, Errors: 0, Time elapsed: 20.316 sec
    [junit] Running org.jboss.test.tm.test.WebBMTCleanUpUnitTestCase
    [junit] Tests run: 1, Failures: 0, Errors: 0, Time elapsed: 3.043 sec
     [echo] Starting patternset=jts.security.includes config=jts
    [junit] Running org.jboss.test.jca.test.SecurityContextUnitTestCase
    [junit] Tests run: 4, Failures: 0, Errors: 0, Time elapsed: 3.184 sec
[server:stop] Shutting down server: jts
[server:stop] shutdownTimeout will be=45
[server:stop] Server stopped.

tests-classloader-leak:
     [echo] creating classloader-leak config
     [copy] Copying 580 files to /qa/services/hudson/hudson_workspace/workspace/JBoss-AS-5.1.x-testSuite-sun16/JBossAS_5_x/build/output/jboss-5.2.0.Beta/server/classloader-leak
     [copy] Copied 150 empty directories to 2 empty directories under /qa/services/hudson/hudson_workspace/workspace/JBoss-AS-5.1.x-testSuite-sun16/JBossAS_5_x/build/output/jboss-5.2.0.Beta/server/classloader-leak
     [echo] Overwriting config descriptors
     [copy] Warning: /qa/services/hudson/hudson_workspace/workspace/JBoss-AS-5.1.x-testSuite-sun16/JBossAS_5_x/testsuite/output/resources/test-configs/classloader-leak not found.
[server:start] Starting server "classloader-leak", with command (start timeout is 240 seconds ): 
[server:start] /qa/tools/opt/jdk1.6.0_15/bin/java -cp /qa/services/hudson/hudson_workspace/workspace/JBoss-AS-5.1.x-testSuite-sun16/JBossAS_5_x/build/output/jboss-5.2.0.Beta/bin/run.jar:/qa/tools/opt/jdk1.6.0_15/lib/tools.jar -Xms128m -Xmx512m -XX:MaxPermSize=256m -XX:+HeapDumpOnOutOfMemoryError -Djava.net.preferIPv4Stack=true -Djava.endorsed.dirs=/qa/services/hudson/hudson_workspace/workspace/JBoss-AS-5.1.x-testSuite-sun16/JBossAS_5_x/build/output/jboss-5.2.0.Beta/lib/endorsed -Djgroups.udp.ip_ttl=0 -Dxb.builder.useUnorderedSequence=true -Djboss.server.log.threshold=DEBUG -Djava.endorsed.dirs=/qa/services/hudson/hudson_workspace/workspace/JBoss-AS-5.1.x-testSuite-sun16/JBossAS_5_x/build/output/jboss-5.2.0.Beta/lib/endorsed/ -Dxb.builder.useUnorderedSequence=true org.jboss.Main -c classloader-leak -b 10.16.93.25 -g DefaultPartition -u 227.43.88.166 
[server:start] Server started.
    [junit] Running org.jboss.test.classloader.leak.test.EarWithCommonsLoggingClassloaderLeakTestCase
    [junit] Tests run: 1, Failures: 0, Errors: 0, Time elapsed: 67.676 sec
    [junit] Running org.jboss.test.classloader.leak.test.EarWithDualCommonsLoggingClassloaderLeakTestCase
    [junit] Tests run: 1, Failures: 0, Errors: 0, Time elapsed: 92.175 sec
    [junit] Running org.jboss.test.classloader.leak.test.IsolatedEarClassloaderLeakTestCase
    [junit] Tests run: 1, Failures: 0, Errors: 0, Time elapsed: 62.865 sec
    [junit] Running org.jboss.test.classloader.leak.test.IsolatedEarWithCommonsLoggingClassloaderLeakTestCase
    [junit] Tests run: 1, Failures: 0, Errors: 0, Time elapsed: 26.53 sec
    [junit] Running org.jboss.test.classloader.leak.test.IsolatedEarWithDualCommonsLoggingClassloaderLeakTestCase
    [junit] Tests run: 1, Failures: 0, Errors: 0, Time elapsed: 36.379 sec
    [junit] Running org.jboss.test.classloader.leak.test.IsolatedEjb3EarClassloaderLeakTestCase
    [junit] Tests run: 1, Failures: 0, Errors: 0, Time elapsed: 40.524 sec
    [junit] Running org.jboss.test.classloader.leak.test.IsolatedNoWebEarClassloaderLeakTestCase
    [junit] Tests run: 1, Failures: 0, Errors: 0, Time elapsed: 22.921 sec
    [junit] Running org.jboss.test.classloader.leak.test.IsolatedNoWebEjb3EarClassloaderLeakTestCase
    [junit] Tests run: 1, Failures: 0, Errors: 0, Time elapsed: 20.646 sec
    [junit] Running org.jboss.test.classloader.leak.test.NoWebEarClassloaderLeakTestCase
    [junit] Tests run: 1, Failures: 0, Errors: 0, Time elapsed: 26.686 sec
    [junit] Running org.jboss.test.classloader.leak.test.NoWebEjb3EarClassloaderLeakTestCase
    [junit] Tests run: 1, Failures: 0, Errors: 0, Time elapsed: 20.474 sec
    [junit] Running org.jboss.test.classloader.leak.test.SimpleEarClassloaderLeakTestCase
    [junit] Tests run: 1, Failures: 0, Errors: 0, Time elapsed: 32.03 sec
    [junit] Running org.jboss.test.classloader.leak.test.SimpleEjb2ClassloaderLeakTestCase
    [junit] Tests run: 1, Failures: 0, Errors: 0, Time elapsed: 29.919 sec
    [junit] Running org.jboss.test.classloader.leak.test.SimpleEjb3ClassloaderLeakTestCase
    [junit] Tests run: 1, Failures: 0, Errors: 0, Time elapsed: 28.061 sec
    [junit] Running org.jboss.test.classloader.leak.test.SimpleEjb3EarClassloaderLeakTestCase
    [junit] Tests run: 1, Failures: 0, Errors: 0, Time elapsed: 32.169 sec
    [junit] Running org.jboss.test.classloader.leak.test.SimpleWarClassloaderLeakTestCase
    [junit] Tests run: 1, Failures: 0, Errors: 0, Time elapsed: 8.258 sec
    [junit] Running org.jboss.test.classloader.leak.test.WarWithCommonsLoggingClassloaderLeakTestCase
    [junit] Tests run: 1, Failures: 0, Errors: 0, Time elapsed: 8.245 sec
[server:stop] Shutting down server: classloader-leak
[server:stop] shutdownTimeout will be=45
[server:stop] Server stopped.

tests-clustered-classloader-leak:
     [echo] creating cluster-classloader-leak-0 config, jboss.dist=/qa/services/hudson/hudson_workspace/workspace/JBoss-AS-5.1.x-testSuite-sun16/JBossAS_5_x/build/output/jboss-5.2.0.Beta
     [copy] Copying 581 files to /qa/services/hudson/hudson_workspace/workspace/JBoss-AS-5.1.x-testSuite-sun16/JBossAS_5_x/build/output/jboss-5.2.0.Beta/server/cluster-classloader-leak-0
     [copy] Copied 152 empty directories to 3 empty directories under /qa/services/hudson/hudson_workspace/workspace/JBoss-AS-5.1.x-testSuite-sun16/JBossAS_5_x/build/output/jboss-5.2.0.Beta/server/cluster-classloader-leak-0
     [echo] Overwriting config descriptors
     [copy] Warning: /qa/services/hudson/hudson_workspace/workspace/JBoss-AS-5.1.x-testSuite-sun16/JBossAS_5_x/testsuite/output/resources/test-configs/cluster-classloader-leak-0 not found.
     [echo] creating cluster-classloader-leak-1 config, jboss.dist=/qa/services/hudson/hudson_workspace/workspace/JBoss-AS-5.1.x-testSuite-sun16/JBossAS_5_x/build/output/jboss-5.2.0.Beta
     [copy] Copying 581 files to /qa/services/hudson/hudson_workspace/workspace/JBoss-AS-5.1.x-testSuite-sun16/JBossAS_5_x/build/output/jboss-5.2.0.Beta/server/cluster-classloader-leak-1
     [copy] Copied 152 empty directories to 3 empty directories under /qa/services/hudson/hudson_workspace/workspace/JBoss-AS-5.1.x-testSuite-sun16/JBossAS_5_x/build/output/jboss-5.2.0.Beta/server/cluster-classloader-leak-1
     [echo] Overwriting config descriptors
     [copy] Warning: /qa/services/hudson/hudson_workspace/workspace/JBoss-AS-5.1.x-testSuite-sun16/JBossAS_5_x/testsuite/output/resources/test-configs/cluster-classloader-leak-1 not found.
[server:start] Starting server "cluster-classloader-leak-0", with command (start timeout is 240 seconds ): 
[server:start] /qa/tools/opt/jdk1.6.0_15/bin/java -cp /qa/services/hudson/hudson_workspace/workspace/JBoss-AS-5.1.x-testSuite-sun16/JBossAS_5_x/build/output/jboss-5.2.0.Beta/bin/run.jar:/qa/tools/opt/jdk1.6.0_15/lib/tools.jar -Xms128m -Xmx512m -XX:MaxPermSize=256m -XX:+HeapDumpOnOutOfMemoryError -Djava.net.preferIPv4Stack=true -Djava.endorsed.dirs=/qa/services/hudson/hudson_workspace/workspace/JBoss-AS-5.1.x-testSuite-sun16/JBossAS_5_x/build/output/jboss-5.2.0.Beta/lib/endorsed -Dresolve.dns=false -Djgroups.udp.ip_ttl=0 -Djboss.messaging.ServerPeerID=0 -Dnode0.bind.address=10.16.93.25 -Djboss.partition.name=DefaultPartition -Dxb.builder.useUnorderedSequence=true -Djboss.server.log.threshold=DEBUG -Djava.endorsed.dirs=/qa/services/hudson/hudson_workspace/workspace/JBoss-AS-5.1.x-testSuite-sun16/JBossAS_5_x/build/output/jboss-5.2.0.Beta/lib/endorsed/ -Dxb.builder.useUnorderedSequence=true org.jboss.Main -c cluster-classloader-leak-0 -b 10.16.93.25 -g DefaultPartition -u 227.43!
 .88.166 
[server:start] Server started.
[server:start] Starting server "cluster-classloader-leak-1", with command (start timeout is 240 seconds ): 
[server:start] /qa/tools/opt/jdk1.6.0_15/bin/java -cp /qa/services/hudson/hudson_workspace/workspace/JBoss-AS-5.1.x-testSuite-sun16/JBossAS_5_x/build/output/jboss-5.2.0.Beta/bin/run.jar:/qa/tools/opt/jdk1.6.0_15/lib/tools.jar -Xms128m -Xmx512m -XX:MaxPermSize=256m -XX:+HeapDumpOnOutOfMemoryError -Djava.net.preferIPv4Stack=true -Djava.endorsed.dirs=/qa/services/hudson/hudson_workspace/workspace/JBoss-AS-5.1.x-testSuite-sun16/JBossAS_5_x/build/output/jboss-5.2.0.Beta/lib/endorsed -Dresolve.dns=false -Djgroups.udp.ip_ttl=0 -Djboss.messaging.ServerPeerID=1 -Dnode0.bind.address=10.16.93.25 -Djboss.partition.name=DefaultPartition -Dxb.builder.useUnorderedSequence=true -Djboss.server.log.threshold=DEBUG -Djava.endorsed.dirs=/qa/services/hudson/hudson_workspace/workspace/JBoss-AS-5.1.x-testSuite-sun16/JBossAS_5_x/build/output/jboss-5.2.0.Beta/lib/endorsed/ -Dxb.builder.useUnorderedSequence=true org.jboss.Main -c cluster-classloader-leak-1 -b 10.16.93.26 -g DefaultPartition -u 227.43!
 .88.166 
[server:start] Server started.

tests-clustering-unit:
    [junit] Running org.jboss.test.cluster.classloader.leak.test.NoPassivationWarClassloaderLeakTestCase
    [junit] Tests run: 2, Failures: 0, Errors: 0, Time elapsed: 190.799 sec
    [junit] Running org.jboss.test.cluster.classloader.leak.test.SimpleWarClassloaderLeakTestCase
    [junit] Tests run: 2, Failures: 0, Errors: 0, Time elapsed: 118.2 sec
[server:stop] Shutting down server: cluster-classloader-leak-0
[server:stop] shutdownTimeout will be=45
[server:stop] Writing server thread dump to /qa/services/hudson/hudson_workspace/workspace/JBoss-AS-5.1.x-testSuite-sun16/JBossAS_5_x/build/output/jboss-5.2.0.Beta/server/cluster-classloader-leak-0/log/threadDump.log
[server:stop] Failed to shutdown server "cluster-classloader-leak-0" before timeout. Destroying the process.
[server:stop] Unable to shutdown server properly: org.jboss.jbossas.servermanager.ServerShutdownException: Failed to shutdown server before timeout.Process was destroyed.
[server:stop] Shutting down server: cluster-classloader-leak-1
[server:stop] shutdownTimeout will be=45
[server:stop] Writing server thread dump to /qa/services/hudson/hudson_workspace/workspace/JBoss-AS-5.1.x-testSuite-sun16/JBossAS_5_x/build/output/jboss-5.2.0.Beta/server/cluster-classloader-leak-1/log/threadDump.log
[server:stop] Failed to shutdown server "cluster-classloader-leak-1" before timeout. Destroying the process.
[server:stop] Unable to shutdown server properly: org.jboss.jbossas.servermanager.ServerShutdownException: Failed to shutdown server before timeout.Process was destroyed.

compile-stylesheets:

tests-report-html:
    [mkdir] Created dir: /qa/services/hudson/hudson_workspace/workspace/JBoss-AS-5.1.x-testSuite-sun16/JBossAS_5_x/testsuite/output/reports/html
[junitreport] Processing /qa/services/hudson/hudson_workspace/workspace/JBoss-AS-5.1.x-testSuite-sun16/JBossAS_5_x/testsuite/output/reports/TESTS-TestSuites.xml to /tmp/null990036324
[junitreport] Loading stylesheet /qa/services/hudson/hudson_workspace/workspace/JBoss-AS-5.1.x-testSuite-sun16/JBossAS_5_x/testsuite/output/stylesheets/junit-frames.xsl
[junitreport] Transform time: 79366ms
[junitreport] Deleting: /tmp/null990036324

tests-report-text:
    [mkdir] Created dir: /qa/services/hudson/hudson_workspace/workspace/JBoss-AS-5.1.x-testSuite-sun16/JBossAS_5_x/testsuite/output/reports/text
    [style] Warning: the task name <style> is deprecated. Use <xslt> instead.
    [style] Transforming into /qa/services/hudson/hudson_workspace/workspace/JBoss-AS-5.1.x-testSuite-sun16/JBossAS_5_x/testsuite/output/reports/text
    [style] Processing /qa/services/hudson/hudson_workspace/workspace/JBoss-AS-5.1.x-testSuite-sun16/JBossAS_5_x/testsuite/output/reports/TESTS-TestSuites.xml to /qa/services/hudson/hudson_workspace/workspace/JBoss-AS-5.1.x-testSuite-sun16/JBossAS_5_x/testsuite/output/reports/text/TESTS-TestSuites.txt
    [style] Loading stylesheet /qa/services/hudson/hudson_workspace/workspace/JBoss-AS-5.1.x-testSuite-sun16/JBossAS_5_x/testsuite/output/stylesheets/summary1b.xsl

tests-report-xml:
    [mkdir] Created dir: /qa/services/hudson/hudson_workspace/workspace/JBoss-AS-5.1.x-testSuite-sun16/JBossAS_5_x/testsuite/output/reports/xml
    [style] Warning: the task name <style> is deprecated. Use <xslt> instead.
    [style] Transforming into /qa/services/hudson/hudson_workspace/workspace/JBoss-AS-5.1.x-testSuite-sun16/JBossAS_5_x/testsuite/output/reports/xml
    [style] Processing /qa/services/hudson/hudson_workspace/workspace/JBoss-AS-5.1.x-testSuite-sun16/JBossAS_5_x/testsuite/output/reports/TESTS-TestSuites.xml to /qa/services/hudson/hudson_workspace/workspace/JBoss-AS-5.1.x-testSuite-sun16/JBossAS_5_x/testsuite/output/reports/xml/TESTS-TestSuites.xml
    [style] Loading stylesheet /qa/services/hudson/hudson_workspace/workspace/JBoss-AS-5.1.x-testSuite-sun16/JBossAS_5_x/testsuite/output/stylesheets/shortXmlSummary.xsl

tests-report:
      [tar] Building tar: /qa/services/hudson/hudson_workspace/workspace/JBoss-AS-5.1.x-testSuite-sun16/JBossAS_5_x/testsuite/output/2009-08-10.10-01.tgz

BUILD FAILED
/qa/services/hudson/hudson_workspace/workspace/JBoss-AS-5.1.x-testSuite-sun16/JBossAS_5_x/testsuite/build.xml:1043: Some servers failed to shutdown cleanly.

Total time: 287 minutes 5 seconds
+ BSTATUS=1
+ [[ 1 -ne 0 ]]
+ kill-jboss
++ uname -s
+ [[ Linux == \L\i\n\u\x ]]
+ local 'PS=ps -eaf --columns 2200 | grep run.jar | grep -v grep | awk '\''{ print $2; }'\'''
+ eval 'ps -eaf --columns 2200 | grep run.jar | grep -v grep | awk '\''{ print $2; }'\'''
+ xargs kill -3
++ ps -eaf --columns 2200
++ grep run.jar
++ grep -v grep
++ awk '{ print $2; }'
+ sleep 1
+ eval 'ps -eaf --columns 2200 | grep run.jar | grep -v grep | awk '\''{ print $2; }'\'''
++ ps -eaf --columns 2200
+ xargs kill
++ grep run.jar
++ grep -v grep
++ awk '{ print $2; }'
+ sleep 10
+ eval 'ps -eaf --columns 2200 | grep run.jar | grep -v grep | awk '\''{ print $2; }'\'''
++ ps -eaf --columns 2200
++ grep run.jar
++ grep -v grep
+ xargs kill -9
++ awk '{ print $2; }'
+ exit 1
Archiving artifacts
Recording test results



More information about the builds mailing list