Build failed in Hudson: JBoss-AS-6.0.x-testSuite-sun16 #25

jboss-qa-internal at redhat.com jboss-qa-internal at redhat.com
Sun Feb 15 22:43:42 EST 2009


See http://hudson.qa.jboss.com/hudson/job/JBoss-AS-6.0.x-testSuite-sun16/25/

------------------------------------------
[...truncated 21343 lines...]
[server:start] Starting server "jacc-security-allstarrole", with command (start timeout is 240 seconds ): 
[server:start] /qa/tools/opt/jdk1.6.0_05/bin/java -cp /qa/services/hudson/hudson_workspace/workspace/JBoss-AS-6.0.x-testSuite-sun16/JBossAS/build/output/jboss-6.0.0.Alpha1/bin/run.jar:/qa/tools/opt/jdk1.6.0_05/lib/tools.jar -Xms128m -Xmx256m -XX:MaxPermSize=512m  -Djava.net.preferIPv4Stack=true -Djava.endorsed.dirs=/qa/services/hudson/hudson_workspace/workspace/JBoss-AS-6.0.x-testSuite-sun16/JBossAS/build/output/jboss-6.0.0.Alpha1/lib/endorsed  org.jboss.Main -c jacc-security-allstarrole -b localhost -g DefaultPartition -u 227.43.88.239 
     [echo] Starting patternset=jacc.allstarrole.includes config=JACC+allstarrole
    [junit] Running org.jboss.test.jacc.test.allstarrole.JBAS1824AllStarRoleJaccTestCase
    [junit] Tests run: 2, Failures: 0, Errors: 0, Time elapsed: 1.308 sec
[server:stop] Shutting down server: jacc-security-allstarrole
[server:stop] shutdownTimeout will be=45

tests-jbossmessaging:
     [echo] creating jbossmessaging config
     [copy] Copying 304 files to /qa/services/hudson/hudson_workspace/workspace/JBoss-AS-6.0.x-testSuite-sun16/JBossAS/build/output/jboss-6.0.0.Alpha1/server/jbossmessaging
     [copy] Copied 89 empty directories to 3 empty directories under /qa/services/hudson/hudson_workspace/workspace/JBoss-AS-6.0.x-testSuite-sun16/JBossAS/build/output/jboss-6.0.0.Alpha1/server/jbossmessaging
     [echo] Overwriting config descriptors
     [copy] Warning: /qa/services/hudson/hudson_workspace/workspace/JBoss-AS-6.0.x-testSuite-sun16/JBossAS/testsuite/output/resources/test-configs/jbossmessaging not found.
[server:start] Starting server "jbossmessaging", with command (start timeout is 240 seconds ): 
[server:start] /qa/tools/opt/jdk1.6.0_05/bin/java -cp /qa/services/hudson/hudson_workspace/workspace/JBoss-AS-6.0.x-testSuite-sun16/JBossAS/build/output/jboss-6.0.0.Alpha1/bin/run.jar:/qa/tools/opt/jdk1.6.0_05/lib/tools.jar -Xms128m -Xmx512m -XX:MaxPermSize=512m -XX:+HeapDumpOnOutOfMemoryError -Djava.net.preferIPv4Stack=true -Djava.endorsed.dirs=/qa/services/hudson/hudson_workspace/workspace/JBoss-AS-6.0.x-testSuite-sun16/JBossAS/build/output/jboss-6.0.0.Alpha1/lib/endorsed -Djgroups.udp.ip_ttl=0  org.jboss.Main -c jbossmessaging -b localhost -g DefaultPartition -u 227.43.88.239 

tests-jbossmessaging-unit:
    [junit] Running org.jboss.test.jbossmessaging.perf.JMSPerfStressTestCase
    [junit] Tests run: 4, Failures: 0, Errors: 0, Time elapsed: 6.25 sec
    [junit] Running org.jboss.test.jbossmessaging.perf.JMSReconnectStressTestCase
    [junit] Tests run: 1, Failures: 0, Errors: 0, Time elapsed: 3.061 sec
    [junit] Running org.jboss.test.jbossmessaging.perf.ReceiveNackClientStressTestCase
    [junit] Tests run: 1, Failures: 0, Errors: 0, Time elapsed: 2.025 sec
    [junit] Running org.jboss.test.jbossmessaging.perf.SendReplyPerfStressTestCase
    [junit] Tests run: 2, Failures: 0, Errors: 0, Time elapsed: 2.455 sec
    [junit] Running org.jboss.test.jbossmessaging.ra.RaJMSSessionUnitTestCase
    [junit] Tests run: 1, Failures: 0, Errors: 0, Time elapsed: 4.602 sec
    [junit] Running org.jboss.test.jbossmessaging.ra.RaQueueUnitTestCase
    [junit] Tests run: 4, Failures: 0, Errors: 0, Time elapsed: 5.853 sec
    [junit] Running org.jboss.test.jbossmessaging.ra.RaSyncRecUnitTestCase
    [junit] Tests run: 1, Failures: 0, Errors: 0, Time elapsed: 2.669 sec
    [junit] Running org.jboss.test.jbossmessaging.ra.RaTopicUnitTestCase
    [junit] Tests run: 4, Failures: 0, Errors: 0, Time elapsed: 6.903 sec
    [junit] Running org.jboss.test.jbossmessaging.test.ConcurrentDeliveryUnitTestCase
    [junit] Tests run: 1, Failures: 0, Errors: 0, Time elapsed: 21.852 sec
    [junit] Running org.jboss.test.jbossmessaging.test.ConnectionConsumerUnitTestCase
    [junit] Tests run: 3, Failures: 0, Errors: 0, Time elapsed: 1.877 sec
    [junit] Running org.jboss.test.jbossmessaging.test.JBossMessagingJoramUnitTestCase
    [junit] Tests run: 198, Failures: 0, Errors: 0, Time elapsed: 28.351 sec
    [junit] Running org.jboss.test.jbossmessaging.test.JBossSessionRecoverUnitTestCase
    [junit] Tests run: 5, Failures: 0, Errors: 0, Time elapsed: 14.269 sec
    [junit] Running org.jboss.test.jbossmessaging.test.MessageBodyUnitTestCase
    [junit] Tests run: 4, Failures: 0, Errors: 0, Time elapsed: 10.601 sec
    [junit] Running org.jboss.test.jbossmessaging.test.MessageTypesUnitTestCase
    [junit] Tests run: 6, Failures: 0, Errors: 0, Time elapsed: 2.521 sec
    [junit] Running org.jboss.test.jbossmessaging.test.RollBackUnitTestCase
    [junit] Tests run: 5, Failures: 0, Errors: 0, Time elapsed: 6.238 sec
    [junit] Running org.jboss.test.jbossmessaging.test.SecurityUnitTestCase
    [junit] Tests run: 30, Failures: 1, Errors: 0, Time elapsed: 18.717 sec
    [junit] Test org.jboss.test.jbossmessaging.test.SecurityUnitTestCase FAILED
    [junit] Running org.jboss.test.jbossmessaging.test.TemporarySessionConnectionUnitTestCase
    [junit] Tests run: 2, Failures: 0, Errors: 0, Time elapsed: 1.825 sec
    [junit] Running org.jboss.test.jbossmessaging.test.UnackedUnitTestCase
    [junit] Tests run: 6, Failures: 0, Errors: 0, Time elapsed: 115.15 sec
    [junit] Running org.jboss.test.jbossmessaging.test.XAResourceUnitTestCase
    [junit] Tests run: 2, Failures: 0, Errors: 0, Time elapsed: 2.144 sec
    [junit] Running org.jboss.test.jbossmessaging.test.XAResourceWrapperSmokeUnitTestCase
    [junit] Tests run: 1, Failures: 0, Errors: 0, Time elapsed: 0.441 sec
[server:stop] Shutting down server: jbossmessaging
[server:stop] shutdownTimeout will be=45

tests-jbossmessaging-cluster:
     [echo] creating jbm-cluster1 config
     [copy] Copying 344 files to /qa/services/hudson/hudson_workspace/workspace/JBoss-AS-6.0.x-testSuite-sun16/JBossAS/build/output/jboss-6.0.0.Alpha1/server/jbm-cluster1
     [copy] Copied 108 empty directories to 4 empty directories under /qa/services/hudson/hudson_workspace/workspace/JBoss-AS-6.0.x-testSuite-sun16/JBossAS/build/output/jboss-6.0.0.Alpha1/server/jbm-cluster1
     [echo] Overwriting config descriptors
     [copy] Copying 1 file to /qa/services/hudson/hudson_workspace/workspace/JBoss-AS-6.0.x-testSuite-sun16/JBossAS/build/output/jboss-6.0.0.Alpha1/server/jbm-cluster1
     [echo] creating jbm-cluster2 config
     [copy] Copying 344 files to /qa/services/hudson/hudson_workspace/workspace/JBoss-AS-6.0.x-testSuite-sun16/JBossAS/build/output/jboss-6.0.0.Alpha1/server/jbm-cluster2
     [copy] Copied 108 empty directories to 4 empty directories under /qa/services/hudson/hudson_workspace/workspace/JBoss-AS-6.0.x-testSuite-sun16/JBossAS/build/output/jboss-6.0.0.Alpha1/server/jbm-cluster2
     [echo] Overwriting config descriptors
     [copy] Copying 1 file to /qa/services/hudson/hudson_workspace/workspace/JBoss-AS-6.0.x-testSuite-sun16/JBossAS/build/output/jboss-6.0.0.Alpha1/server/jbm-cluster2
[server:start] Starting server "jbm-cluster1", with command (start timeout is 240 seconds ): 
[server:start] /qa/tools/opt/jdk1.6.0_05/bin/java -cp /qa/services/hudson/hudson_workspace/workspace/JBoss-AS-6.0.x-testSuite-sun16/JBossAS/build/output/jboss-6.0.0.Alpha1/bin/run.jar:/qa/tools/opt/jdk1.6.0_05/lib/tools.jar -Xms128m -Xmx512m -XX:MaxPermSize=512m -XX:+HeapDumpOnOutOfMemoryError -Djava.endorsed.dirs=/qa/services/hudson/hudson_workspace/workspace/JBoss-AS-6.0.x-testSuite-sun16/JBossAS/build/output/jboss-6.0.0.Alpha1/lib/endorsed -Djava.net.preferIPv4Stack=true -Djgroups.bind_addr=localhost  org.jboss.Main -c jbm-cluster1 -b localhost -g DefaultPartition -u 227.43.88.239 
[server:start] Starting server "jbm-cluster2", with command (start timeout is 240 seconds ): 
[server:start] /qa/tools/opt/jdk1.6.0_05/bin/java -cp /qa/services/hudson/hudson_workspace/workspace/JBoss-AS-6.0.x-testSuite-sun16/JBossAS/build/output/jboss-6.0.0.Alpha1/bin/run.jar:/qa/tools/opt/jdk1.6.0_05/lib/tools.jar -Xms128m -Xmx512m -XX:MaxPermSize=512m -XX:+HeapDumpOnOutOfMemoryError -Djbossnode0=localhost -Djava.endorsed.dirs=/qa/services/hudson/hudson_workspace/workspace/JBoss-AS-6.0.x-testSuite-sun16/JBossAS/build/output/jboss-6.0.0.Alpha1/lib/endorsed -Djava.net.preferIPv4Stack=true -Djboss.messaging.ServerPeerID=1 -Djgroups.bind_addr=10.16.88.239  org.jboss.Main -c jbm-cluster2 -b 10.16.88.239 -g DefaultPartition -u 227.43.88.239 

exec-jbmcluster:
    [junit] Running org.jboss.test.jbossmessaging.clustertest.ClusteredTestCase
    [junit] Running org.jboss.test.jbossmessaging.clustertest.ClusteredTestCase
    [junit] Tests run: 1, Failures: 0, Errors: 1, Time elapsed: 0 sec
    [junit] Test org.jboss.test.jbossmessaging.clustertest.ClusteredTestCase FAILED (timeout)
[server:stop] Shutting down server: jbm-cluster1
[server:stop] shutdownTimeout will be=45

init:

tests-compatibility:
    [junit] Running org.jboss.test.compatibility.test.SerialVersionUIDUnitTestCase
    [junit] Tests run: 1, Failures: 1, Errors: 0, Time elapsed: 67.373 sec
    [junit] Test org.jboss.test.compatibility.test.SerialVersionUIDUnitTestCase FAILED

tests-aop-scoped:
     [copy] Copying 1 file to /qa/services/hudson/hudson_workspace/workspace/JBoss-AS-6.0.x-testSuite-sun16/JBossAS/build/output/jboss-6.0.0.Alpha1/bin
     [echo] creating scoped-aop-jdk50 config
     [copy] Copying 344 files to /qa/services/hudson/hudson_workspace/workspace/JBoss-AS-6.0.x-testSuite-sun16/JBossAS/build/output/jboss-6.0.0.Alpha1/server/scoped-aop-jdk50
     [copy] Copied 108 empty directories to 4 empty directories under /qa/services/hudson/hudson_workspace/workspace/JBoss-AS-6.0.x-testSuite-sun16/JBossAS/build/output/jboss-6.0.0.Alpha1/server/scoped-aop-jdk50
     [echo] Overwriting config descriptors
     [copy] Warning: /qa/services/hudson/hudson_workspace/workspace/JBoss-AS-6.0.x-testSuite-sun16/JBossAS/testsuite/output/resources/test-configs/scoped-aop-jdk50 not found.
[server:start] Starting server "scoped-aop-jdk50", with command (start timeout is 240 seconds ): 
[server:start] /qa/tools/opt/jdk1.6.0_05/bin/java -cp /qa/services/hudson/hudson_workspace/workspace/JBoss-AS-6.0.x-testSuite-sun16/JBossAS/build/output/jboss-6.0.0.Alpha1/bin/run.jar:/qa/tools/opt/jdk1.6.0_05/lib/tools.jar -Xms128m -Xmx512m -XX:MaxPermSize=512m -XX:+HeapDumpOnOutOfMemoryError  -javaagent:pluggable-instrumentor.jar -Djava.net.preferIPv4Stack=true -Djava.endorsed.dirs=/qa/services/hudson/hudson_workspace/workspace/JBoss-AS-6.0.x-testSuite-sun16/JBossAS/build/output/jboss-6.0.0.Alpha1/lib/endorsed -Djgroups.udp.ip_ttl=0  org.jboss.Main -c scoped-aop-jdk50 -b localhost -g DefaultPartition -u 227.43.88.239 

run-tests-aop-scoped:
     [echo] Starting patternset=aop-with-classloader.includes config=aop-scoped
    [junit] Running org.jboss.test.aop.test.ScopedAnnotatedTestCase
    [junit] Tests run: 15, Failures: 0, Errors: 0, Time elapsed: 8.96 sec
    [junit] Running org.jboss.test.aop.test.ScopedAttachUnitTestCase
    [junit] Tests run: 6, Failures: 0, Errors: 0, Time elapsed: 6.718 sec
    [junit] Running org.jboss.test.aop.test.ScopedEarWithClassesInWebInfTestCase
    [junit] Tests run: 1, Failures: 0, Errors: 0, Time elapsed: 3.28 sec
    [junit] Running org.jboss.test.aop.test.ScopedExtenderBaseLoadedScopedNoParentDelegationTestCase
    [junit] Tests run: 7, Failures: 0, Errors: 0, Time elapsed: 9.684 sec
    [junit] Running org.jboss.test.aop.test.ScopedExtenderBaseLoadedScopedParentDelegationTestCase
    [junit] Tests run: 7, Failures: 0, Errors: 0, Time elapsed: 8.04 sec
    [junit] Running org.jboss.test.aop.test.ScopedExtenderBaseNotLoadedScopedNoParentDelegationTestCase
    [junit] Tests run: 7, Failures: 0, Errors: 0, Time elapsed: 10.572 sec
    [junit] Running org.jboss.test.aop.test.ScopedExtenderBaseNotLoadedScopedParentDelegationTestCase
    [junit] Tests run: 7, Failures: 0, Errors: 0, Time elapsed: 7.949 sec
    [junit] Running org.jboss.test.aop.test.ScopedUnitTestCase
    [junit] Tests run: 16, Failures: 0, Errors: 0, Time elapsed: 7.713 sec
    [junit] Running org.jboss.test.aop.test.ScopedWovenDependencyTestCase
    [junit] Tests run: 2, Failures: 0, Errors: 0, Time elapsed: 2.06 sec
[server:stop] Shutting down server: scoped-aop-jdk50
[server:stop] shutdownTimeout will be=45
   [delete] Deleting: /qa/services/hudson/hudson_workspace/workspace/JBoss-AS-6.0.x-testSuite-sun16/JBossAS/build/output/jboss-6.0.0.Alpha1/bin/pluggable-instrumentor.jar

jrmp-invoker-tests:
     [echo] creating jrmp-invoker config
     [copy] Copying 304 files to /qa/services/hudson/hudson_workspace/workspace/JBoss-AS-6.0.x-testSuite-sun16/JBossAS/build/output/jboss-6.0.0.Alpha1/server/jrmp-invoker
     [copy] Copied 89 empty directories to 3 empty directories under /qa/services/hudson/hudson_workspace/workspace/JBoss-AS-6.0.x-testSuite-sun16/JBossAS/build/output/jboss-6.0.0.Alpha1/server/jrmp-invoker
     [echo] Overwriting config descriptors
     [copy] Copying 1 file to /qa/services/hudson/hudson_workspace/workspace/JBoss-AS-6.0.x-testSuite-sun16/JBossAS/build/output/jboss-6.0.0.Alpha1/server/jrmp-invoker
[server:start] Starting server "jrmp-invoker", with command (start timeout is 240 seconds ): 
[server:start] /qa/tools/opt/jdk1.6.0_05/bin/java -cp /qa/services/hudson/hudson_workspace/workspace/JBoss-AS-6.0.x-testSuite-sun16/JBossAS/build/output/jboss-6.0.0.Alpha1/bin/run.jar:/qa/tools/opt/jdk1.6.0_05/lib/tools.jar -Xms128m -Xmx512m -XX:MaxPermSize=128m -Djava.net.preferIPv4Stack=true  org.jboss.Main -c jrmp-invoker -b localhost -g DefaultPartition -u 227.43.88.239 
     [echo] Starting patternset=jrmp-invoker.includes config=JRMP-Invoker
    [junit] Running org.jboss.test.bank.test.BankEJB20StressTestCase
    [junit] Tests run: 9, Failures: 0, Errors: 0, Time elapsed: 9.718 sec
    [junit] Running org.jboss.test.cts.test.BmpUnitTestCase
    [junit] Tests run: 11, Failures: 0, Errors: 0, Time elapsed: 15.931 sec
    [junit] Running org.jboss.test.cts.test.CmpUnitTestCase
    [junit] Tests run: 2, Failures: 0, Errors: 0, Time elapsed: 1.84 sec
    [junit] Running org.jboss.test.cts.test.CtsCmp2UnitTestCase
    [junit] Tests run: 4, Failures: 0, Errors: 0, Time elapsed: 2.377 sec
    [junit] Running org.jboss.test.cts.test.IndependentJarsUnitTestCase
    [junit] Tests run: 2, Failures: 0, Errors: 0, Time elapsed: 2.547 sec
    [junit] Running org.jboss.test.cts.test.LocalEjbTestCase
    [junit] Tests run: 1, Failures: 0, Errors: 0, Time elapsed: 1.767 sec
    [junit] Running org.jboss.test.cts.test.LongWaitStatefulSessionUnitTestCase
    [junit] Tests run: 1, Failures: 0, Errors: 0, Time elapsed: 6.95 sec
    [junit] Running org.jboss.test.cts.test.StatefulSessionLocalUnitTestCase
    [junit] Tests run: 1, Failures: 0, Errors: 0, Time elapsed: 132.878 sec
    [junit] Running org.jboss.test.cts.test.StatefulSessionUnitTestCase
    [junit] Tests run: 20, Failures: 0, Errors: 0, Time elapsed: 143.218 sec
    [junit] Running org.jboss.test.cts.test.StatelessSessionStressTestCase
    [junit] Tests run: 3, Failures: 0, Errors: 0, Time elapsed: 1.82 sec
    [junit] Running org.jboss.test.cts.test.StatelessSessionUnitTestCase
    [junit] Tests run: 8, Failures: 0, Errors: 0, Time elapsed: 26.231 sec
    [junit] Running org.jboss.test.testbean.test.BeanUnitTestCase
    [junit] Tests run: 9, Failures: 0, Errors: 0, Time elapsed: 3.919 sec
[server:stop] Shutting down server: jrmp-invoker
[server:stop] shutdownTimeout will be=45

pooled-invoker-tests:
     [echo] creating pooled-invoker config
     [copy] Copying 304 files to /qa/services/hudson/hudson_workspace/workspace/JBoss-AS-6.0.x-testSuite-sun16/JBossAS/build/output/jboss-6.0.0.Alpha1/server/pooled-invoker
     [copy] Copied 89 empty directories to 3 empty directories under /qa/services/hudson/hudson_workspace/workspace/JBoss-AS-6.0.x-testSuite-sun16/JBossAS/build/output/jboss-6.0.0.Alpha1/server/pooled-invoker
     [echo] Overwriting config descriptors
     [copy] Copying 1 file to /qa/services/hudson/hudson_workspace/workspace/JBoss-AS-6.0.x-testSuite-sun16/JBossAS/build/output/jboss-6.0.0.Alpha1/server/pooled-invoker
[server:start] Starting server "pooled-invoker", with command (start timeout is 240 seconds ): 
[server:start] /qa/tools/opt/jdk1.6.0_05/bin/java -cp /qa/services/hudson/hudson_workspace/workspace/JBoss-AS-6.0.x-testSuite-sun16/JBossAS/build/output/jboss-6.0.0.Alpha1/bin/run.jar:/qa/tools/opt/jdk1.6.0_05/lib/tools.jar -Xms128m -Xmx512m -XX:MaxPermSize=128m -Djava.net.preferIPv4Stack=true  org.jboss.Main -c pooled-invoker -b localhost -g DefaultPartition -u 227.43.88.239 
     [echo] Starting patternset=jrmp-invoker.includes config=Pooled-Invoker
    [junit] Running org.jboss.test.bank.test.BankEJB20StressTestCase
    [junit] Tests run: 9, Failures: 0, Errors: 0, Time elapsed: 8.897 sec
    [junit] Running org.jboss.test.cts.test.BmpUnitTestCase
    [junit] Tests run: 11, Failures: 0, Errors: 0, Time elapsed: 15.074 sec
    [junit] Running org.jboss.test.cts.test.CmpUnitTestCase
    [junit] Tests run: 2, Failures: 0, Errors: 0, Time elapsed: 1.827 sec
    [junit] Running org.jboss.test.cts.test.CtsCmp2UnitTestCase
    [junit] Tests run: 4, Failures: 0, Errors: 0, Time elapsed: 2.381 sec
    [junit] Running org.jboss.test.cts.test.IndependentJarsUnitTestCase
    [junit] Tests run: 2, Failures: 0, Errors: 0, Time elapsed: 2.282 sec
    [junit] Running org.jboss.test.cts.test.LocalEjbTestCase
    [junit] Tests run: 1, Failures: 0, Errors: 0, Time elapsed: 1.773 sec
    [junit] Running org.jboss.test.cts.test.LongWaitStatefulSessionUnitTestCase
    [junit] Tests run: 1, Failures: 0, Errors: 0, Time elapsed: 6.83 sec
    [junit] Running org.jboss.test.cts.test.StatefulSessionLocalUnitTestCase
    [junit] Tests run: 1, Failures: 0, Errors: 0, Time elapsed: 132.841 sec
    [junit] Running org.jboss.test.cts.test.StatefulSessionUnitTestCase
    [junit] Tests run: 20, Failures: 0, Errors: 0, Time elapsed: 143.036 sec
    [junit] Running org.jboss.test.cts.test.StatelessSessionStressTestCase
    [junit] Tests run: 3, Failures: 0, Errors: 0, Time elapsed: 1.772 sec
    [junit] Running org.jboss.test.cts.test.StatelessSessionUnitTestCase
    [junit] Tests run: 8, Failures: 0, Errors: 0, Time elapsed: 26.137 sec
    [junit] Running org.jboss.test.testbean.test.BeanUnitTestCase
    [junit] Tests run: 9, Failures: 0, Errors: 0, Time elapsed: 3.27 sec
[server:stop] Shutting down server: pooled-invoker
[server:stop] shutdownTimeout will be=45

tests-clustered-profileservice:
     [echo] creating cluster-profilesvc-0 config, jboss.dist=/qa/services/hudson/hudson_workspace/workspace/JBoss-AS-6.0.x-testSuite-sun16/JBossAS/build/output/jboss-6.0.0.Alpha1
     [copy] Copying 344 files to /qa/services/hudson/hudson_workspace/workspace/JBoss-AS-6.0.x-testSuite-sun16/JBossAS/build/output/jboss-6.0.0.Alpha1/server/cluster-profilesvc-0
     [copy] Copied 107 empty directories to 3 empty directories under /qa/services/hudson/hudson_workspace/workspace/JBoss-AS-6.0.x-testSuite-sun16/JBossAS/build/output/jboss-6.0.0.Alpha1/server/cluster-profilesvc-0
     [echo] Overwriting config descriptors
     [copy] Copying 1 file to /qa/services/hudson/hudson_workspace/workspace/JBoss-AS-6.0.x-testSuite-sun16/JBossAS/build/output/jboss-6.0.0.Alpha1/server/cluster-profilesvc-0
     [echo] creating cluster-profilesvc-1 config, jboss.dist=/qa/services/hudson/hudson_workspace/workspace/JBoss-AS-6.0.x-testSuite-sun16/JBossAS/build/output/jboss-6.0.0.Alpha1
     [copy] Copying 344 files to /qa/services/hudson/hudson_workspace/workspace/JBoss-AS-6.0.x-testSuite-sun16/JBossAS/build/output/jboss-6.0.0.Alpha1/server/cluster-profilesvc-1
     [copy] Copied 107 empty directories to 3 empty directories under /qa/services/hudson/hudson_workspace/workspace/JBoss-AS-6.0.x-testSuite-sun16/JBossAS/build/output/jboss-6.0.0.Alpha1/server/cluster-profilesvc-1
     [echo] Overwriting config descriptors
     [copy] Copying 1 file to /qa/services/hudson/hudson_workspace/workspace/JBoss-AS-6.0.x-testSuite-sun16/JBossAS/build/output/jboss-6.0.0.Alpha1/server/cluster-profilesvc-1
[server:start] Starting server "cluster-profilesvc-0", with command (start timeout is 240 seconds ): 
[server:start] /qa/tools/opt/jdk1.6.0_05/bin/java -cp /qa/services/hudson/hudson_workspace/workspace/JBoss-AS-6.0.x-testSuite-sun16/JBossAS/build/output/jboss-6.0.0.Alpha1/bin/run.jar:/qa/tools/opt/jdk1.6.0_05/lib/tools.jar -Xms128m -Xmx512m -XX:MaxPermSize=512m -XX:+HeapDumpOnOutOfMemoryError -Djava.net.preferIPv4Stack=true -Djava.endorsed.dirs=/qa/services/hudson/hudson_workspace/workspace/JBoss-AS-6.0.x-testSuite-sun16/JBossAS/build/output/jboss-6.0.0.Alpha1/lib/endorsed -Dresolve.dns=false -Djgroups.udp.ip_ttl=0 -Djboss.messaging.ServerPeerID=0 -Djboss.partition.name=DefaultPartition -Djgroups.bind_addr=localhost  org.jboss.Main -c cluster-profilesvc-0 -b localhost -g DefaultPartition -u 227.43.88.239 

BUILD FAILED
/qa/services/hudson/hudson_workspace/workspace/JBoss-AS-6.0.x-testSuite-sun16/JBossAS/testsuite/build.xml:997: The following error occurred while executing this line:
/qa/services/hudson/hudson_workspace/workspace/JBoss-AS-6.0.x-testSuite-sun16/JBossAS/testsuite/imports/config/tests-clustering.xml:344: Error starting server "cluster-profilesvc-1": Found a process already listening on:http://10.16.88.239:8080 or jnp://10.16.88.239:1099

Total time: 224 minutes 4 seconds
Found server "jbm-cluster2" still running; stopping it.
Shutting down server: jbm-cluster2
Found server "cluster-profilesvc-0" still running; stopping it.
Shutting down server: cluster-profilesvc-0
shutdownTimeout will be=45
shutdownTimeout will be=45
+ BSTATUS=1
+ [[ 1 -ne 0 ]]
+ kill-jboss
++ uname -s
+ [[ Linux == \L\i\n\u\x ]]
+ ps -eaf --columns 2200
+ grep run.jar
+ grep -v grep
+ awk '{ print $2; }'
+ xargs kill
usage: kill [ -s signal | -p ] [ -a ] pid ...
       kill -l [ signal ]
+ sleep 10
+ ps -eaf --columns 2200
+ grep run.jar
+ grep -v grep
+ awk '{ print $2; }'
+ xargs kill -9
usage: kill [ -s signal | -p ] [ -a ] pid ...
       kill -l [ signal ]
+ return 0
+ exit 1
[JBoss-AS-6.0.x-testSuite-sun16] $ bash -xe /tmp/hudson3693398162372378902.sh
+ kill 10163
Recording test results




More information about the builds mailing list