Build failed in Jenkins: JBoss-AS-7.x-latest #39

jboss-qa-internal at redhat.com jboss-qa-internal at redhat.com
Mon Nov 21 10:50:44 EST 2011


See <http://hudson.qa.jboss.com/hudson/job/JBoss-AS-7.x-latest/39/changes>

Changes:

[Jason T. Greene] Remove JAXR subsystem

------------------------------------------
[...truncated 10386 lines...]
[debug] execute contextualize
[INFO] Using 'UTF-8' encoding to copy filtered resources.
[INFO] Copying 155 resources
[INFO] Copying 24 resources
[INFO] 
[INFO] --- xml-maven-plugin:1.0:transform (update-ip-addresses-jbossas.server) @ jboss-as-testsuite-integration ---
[INFO] Transforming file: <http://hudson.qa.jboss.com/hudson/job/JBoss-AS-7.x-latest/ws/testsuite/integration/target/jbossas/standalone/configuration/standalone-xts.xml>
[INFO] Transforming file: <http://hudson.qa.jboss.com/hudson/job/JBoss-AS-7.x-latest/ws/testsuite/integration/target/jbossas/standalone/configuration/standalone.xml>
[INFO] Transformed 2 file(s).
[INFO] 
[INFO] --- maven-antrun-plugin:1.6:run (build-smoke.server) @ jboss-as-testsuite-integration ---
[INFO] Executing tasks

main:

build-smoke:
     [echo] Building config smoke from <http://hudson.qa.jboss.com/hudson/job/JBoss-AS-7.x-latest/ws/testsuite/integration/../../build/target/jboss-as-7.1.0.Alpha2-SNAPSHOT>
     [copy] Copying 103 files to <http://hudson.qa.jboss.com/hudson/job/JBoss-AS-7.x-latest/ws/testsuite/integration/target/smoke>
     [copy] Copied 21 empty directories to 4 empty directories under <http://hudson.qa.jboss.com/hudson/job/JBoss-AS-7.x-latest/ws/testsuite/integration/target/smoke>
     [copy] Warning: <http://hudson.qa.jboss.com/hudson/job/JBoss-AS-7.x-latest/ws/testsuite/integration/src/test/resources/test-configs/smoke> does not exist.

changeDefaultDatabase:
     [echo] Changing IP addresses for config smoke
     [xslt] Processing <http://hudson.qa.jboss.com/hudson/job/JBoss-AS-7.x-latest/ws/testsuite/integration/target/smoke/standalone/configuration/standalone-ha.xml> to <http://hudson.qa.jboss.com/hudson/job/JBoss-AS-7.x-latest/ws/testsuite/integration/target/smoke/standalone/configuration/standalone-ha.xml.mod>
     [xslt] Loading stylesheet <http://hudson.qa.jboss.com/hudson/job/JBoss-AS-7.x-latest/ws/testsuite/integration/src/test/xslt/changeIPAddresses.xsl>
     [xslt] Processing <http://hudson.qa.jboss.com/hudson/job/JBoss-AS-7.x-latest/ws/testsuite/integration/target/smoke/standalone/configuration/standalone.xml> to <http://hudson.qa.jboss.com/hudson/job/JBoss-AS-7.x-latest/ws/testsuite/integration/target/smoke/standalone/configuration/standalone.xml.mod>
     [move] Moving 2 files to <http://hudson.qa.jboss.com/hudson/job/JBoss-AS-7.x-latest/ws/testsuite/integration/target/smoke/standalone/configuration>
[INFO] Executed tasks
[INFO] 
[INFO] --- maven-compiler-plugin:2.3.2:testCompile (default-testCompile) @ jboss-as-testsuite-integration ---
[INFO] Compiling 1180 source files to <http://hudson.qa.jboss.com/hudson/job/JBoss-AS-7.x-latest/ws/testsuite/integration/target/test-classes>
[WARNING] <http://hudson.qa.jboss.com/hudson/job/JBoss-AS-7.x-latest/ws/testsuite/integration/src/test/java/org/jboss/as/test/integration/ejb/security/lifecycle/BaseBean.java>:[26,20] [deprecation] java.security.Identity in java.security has been deprecated
[WARNING] <http://hudson.qa.jboss.com/hudson/job/JBoss-AS-7.x-latest/ws/testsuite/integration/src/test/java/org/jboss/as/test/integration/weld/ejb/SessionObjectReferenceTestCase.java>:[30,14] [deprecation] java.io.StringBufferInputStream in java.io has been deprecated
[WARNING] <http://hudson.qa.jboss.com/hudson/job/JBoss-AS-7.x-latest/ws/testsuite/integration/src/test/java/org/jboss/as/test/integration/ejb/security/lifecycle/BaseBean.java>:[26,20] [deprecation] java.security.Identity in java.security has been deprecated
[WARNING] <http://hudson.qa.jboss.com/hudson/job/JBoss-AS-7.x-latest/ws/testsuite/integration/src/test/java/org/jboss/as/test/integration/weld/ejb/SessionObjectReferenceTestCase.java>:[30,14] [deprecation] java.io.StringBufferInputStream in java.io has been deprecated
[WARNING] <http://hudson.qa.jboss.com/hudson/job/JBoss-AS-7.x-latest/ws/testsuite/integration/src/test/java/org/jboss/as/test/integration/ejb/timerservice/schedule/descriptor/DescriptorScheduleTestCase.java>:[62,28] [deprecation] Date(int,int,int,int,int,int) in java.util.Date has been deprecated
[WARNING] <http://hudson.qa.jboss.com/hudson/job/JBoss-AS-7.x-latest/ws/testsuite/integration/src/test/java/org/jboss/as/test/integration/ejb/security/lifecycle/BaseBean.java>:[81,12] [deprecation] java.security.Identity in java.security has been deprecated
[WARNING] <http://hudson.qa.jboss.com/hudson/job/JBoss-AS-7.x-latest/ws/testsuite/integration/src/test/java/org/jboss/as/test/integration/ejb/security/lifecycle/BaseBean.java>:[81,30] [deprecation] java.security.Identity in java.security has been deprecated
[WARNING] <http://hudson.qa.jboss.com/hudson/job/JBoss-AS-7.x-latest/ws/testsuite/integration/src/test/java/org/jboss/as/test/integration/ejb/security/lifecycle/BaseBean.java>:[81,30] [deprecation] java.security.Identity in java.security has been deprecated
[WARNING] <http://hudson.qa.jboss.com/hudson/job/JBoss-AS-7.x-latest/ws/testsuite/integration/src/test/java/org/jboss/as/test/integration/management/api/web/ConnectorTestCase.java>:[320,15] [deprecation] setHostnameVerifier(org.apache.http.conn.ssl.X509HostnameVerifier) in org.apache.http.conn.ssl.SSLSocketFactory has been deprecated
[WARNING] <http://hudson.qa.jboss.com/hudson/job/JBoss-AS-7.x-latest/ws/testsuite/integration/src/test/java/org/jboss/as/test/integration/management/api/web/ConnectorTestCase.java>:[323,24] [deprecation] Scheme(java.lang.String,org.apache.http.conn.scheme.SocketFactory,int) in org.apache.http.conn.scheme.Scheme has been deprecated
[WARNING] <http://hudson.qa.jboss.com/hudson/job/JBoss-AS-7.x-latest/ws/testsuite/integration/src/test/java/org/jboss/as/test/integration/weld/ejb/SessionObjectReferenceTestCase.java>:[87,48] [deprecation] java.io.StringBufferInputStream in java.io has been deprecated
[INFO] 
[INFO] --- maven-surefire-plugin:2.10:test (smoke-default.surefire) @ jboss-as-testsuite-integration ---
[INFO] Surefire report directory: <http://hudson.qa.jboss.com/hudson/job/JBoss-AS-7.x-latest/ws/testsuite/integration/target/surefire-reports>

-------------------------------------------------------
 T E S T S
-------------------------------------------------------
Running org.jboss.as.test.smoke.embedded.demos.jms.JmsTestCase
Tests run: 1, Failures: 0, Errors: 0, Skipped: 0, Time elapsed: 7.882 sec
Running org.jboss.as.test.smoke.embedded.demos.ejb3.jndi.StandaloneModuleEjbJndiBindingTestCase
Tests run: 4, Failures: 0, Errors: 0, Skipped: 0, Time elapsed: 1.058 sec
Running org.jboss.as.test.smoke.embedded.demos.ejb3.jndi.EarDeploymentEjbJndiBindingTestCase
Tests run: 4, Failures: 0, Errors: 0, Skipped: 0, Time elapsed: 0.983 sec
Running org.jboss.as.test.smoke.embedded.demos.ejb3.dd.DDBasedEJBTestCase
Tests run: 4, Failures: 0, Errors: 0, Skipped: 0, Time elapsed: 1.093 sec
Running org.jboss.as.test.smoke.embedded.demos.rar.RarTestCase
Tests run: 2, Failures: 0, Errors: 0, Skipped: 0, Time elapsed: 0.806 sec
Running org.jboss.as.test.smoke.embedded.demos.war.WarTestCase
Tests run: 2, Failures: 0, Errors: 0, Skipped: 0, Time elapsed: 0.544 sec
Running org.jboss.as.test.smoke.embedded.demos.client.jms.JmsClientTestCase
Tests run: 1, Failures: 0, Errors: 0, Skipped: 0, Time elapsed: 0.988 sec
Running org.jboss.as.test.smoke.embedded.demos.client.messaging.MessagingClientTestCase
Tests run: 1, Failures: 0, Errors: 0, Skipped: 0, Time elapsed: 0.179 sec
Running org.jboss.as.test.smoke.embedded.demos.webapp.WebAppTestCase
Tests run: 1, Failures: 0, Errors: 0, Skipped: 1, Time elapsed: 0.001 sec
Running org.jboss.as.test.smoke.embedded.demos.serviceloader.ServiceLoaderTestCase
Tests run: 1, Failures: 0, Errors: 0, Skipped: 0, Time elapsed: 0.577 sec
Running org.jboss.as.test.smoke.embedded.demos.ds.DsTestCase
Tests run: 1, Failures: 0, Errors: 0, Skipped: 0, Time elapsed: 0.731 sec
Running org.jboss.as.test.smoke.embedded.demos.sar.SarTestCase
Tests run: 1, Failures: 0, Errors: 0, Skipped: 0, Time elapsed: 0.155 sec
Running org.jboss.as.test.smoke.embedded.demos.ws.WSTestCase
Tests run: 3, Failures: 0, Errors: 0, Skipped: 0, Time elapsed: 2.87 sec
Running org.jboss.as.test.smoke.embedded.demos.jaxrs.JaxrsTestCase
Tests run: 1, Failures: 0, Errors: 0, Skipped: 0, Time elapsed: 0.413 sec
Running org.jboss.as.test.smoke.embedded.demos.messaging.MessagingTestCase
Tests run: 1, Failures: 0, Errors: 0, Skipped: 0, Time elapsed: 0.582 sec
Running org.jboss.as.test.smoke.embedded.demos.managedbean.ManagedBeanTestCase
Tests run: 1, Failures: 0, Errors: 0, Skipped: 0, Time elapsed: 1.105 sec
Running org.jboss.as.test.smoke.embedded.deployment.rar.AS7_1452.AS7_1452TestCase
Tests run: 1, Failures: 0, Errors: 0, Skipped: 1, Time elapsed: 0.001 sec
Running org.jboss.as.test.smoke.embedded.mgmt.datasource.DataSourceCfgMetricUnitTestCase
Tests run: 1, Failures: 0, Errors: 0, Skipped: 0, Time elapsed: 0.517 sec
Running org.jboss.as.test.smoke.embedded.mgmt.datasource.DataSourceOperationsUnitTestCase
Tests run: 9, Failures: 0, Errors: 0, Skipped: 0, Time elapsed: 1.704 sec
Running org.jboss.as.test.smoke.embedded.mgmt.datasource.AddMySqlDataSourceOperationsUnitTestCase
Tests run: 1, Failures: 0, Errors: 0, Skipped: 1, Time elapsed: 0.001 sec
Running org.jboss.as.test.smoke.embedded.mgmt.datasource.DataSourceResourcesUnitTestCase
Tests run: 2, Failures: 0, Errors: 0, Skipped: 0, Time elapsed: 0.495 sec
Running org.jboss.as.test.smoke.embedded.mgmt.DescribeOperationUnitTestCase
Tests run: 1, Failures: 0, Errors: 0, Skipped: 0, Time elapsed: 1.297 sec
Running org.jboss.as.test.smoke.embedded.mgmt.BasicOperationsUnitTestCase
Tests run: 6, Failures: 0, Errors: 0, Skipped: 0, Time elapsed: 0.639 sec
Running org.jboss.as.test.smoke.embedded.mgmt.PlatformMBeansUnitTestCase
Tests run: 1, Failures: 0, Errors: 0, Skipped: 0, Time elapsed: 0.488 sec
Running org.jboss.as.test.smoke.embedded.parse.ParseAndMarshalModelsTestCase
Tests run: 30, Failures: 0, Errors: 0, Skipped: 0, Time elapsed: 17.169 sec
Running org.jboss.as.test.smoke.flat.xml.XSDValidationUnitTestCase
Tests run: 1, Failures: 0, Errors: 0, Skipped: 0, Time elapsed: 0.956 sec
Running org.jboss.as.test.smoke.flat.xml.StandardConfigsXMLValidationUnitTestCase
Tests run: 4, Failures: 0, Errors: 0, Skipped: 0, Time elapsed: 1.272 sec
Running org.jboss.as.test.smoke.stilts.SimpleStompletTestCase
Tests run: 2, Failures: 0, Errors: 0, Skipped: 0, Time elapsed: 3.584 sec
Running org.jboss.as.test.smoke.osgi.SimpleBundleContextTestCase
Tests run: 1, Failures: 0, Errors: 0, Skipped: 0, Time elapsed: 0.486 sec
Running org.jboss.as.test.smoke.osgi.SimplePackageAdminTestCase
Tests run: 1, Failures: 0, Errors: 0, Skipped: 0, Time elapsed: 0.49 sec
Running org.jboss.as.test.smoke.osgi.SimpleStartLevelTestCase
Tests run: 1, Failures: 0, Errors: 0, Skipped: 0, Time elapsed: 0.878 sec
Running org.jboss.as.test.smoke.osgi.SimpleArquillianDeployerTestCase
Tests run: 1, Failures: 0, Errors: 0, Skipped: 0, Time elapsed: 0.717 sec
Running org.jboss.as.test.smoke.osgi.SimpleModuleRegistrationTestCase
Tests run: 1, Failures: 0, Errors: 0, Skipped: 0, Time elapsed: 0.476 sec
Running org.jboss.as.test.smoke.osgi.SimpleBundleTestCase
Tests run: 1, Failures: 0, Errors: 0, Skipped: 0, Time elapsed: 0.49 sec
Running org.jboss.as.test.smoke.jsr88.EnterpriseDeploymentTestCase
Tests run: 6, Failures: 0, Errors: 0, Skipped: 3, Time elapsed: 0.671 sec
Running org.jboss.as.test.smoke.configadmin.ConfigAdminServiceTestCase
Tests run: 3, Failures: 0, Errors: 0, Skipped: 0, Time elapsed: 3.59 sec
Running org.jboss.as.test.smoke.surefire.servermodule.ValidateModelTestCase
Tests run: 1, Failures: 0, Errors: 0, Skipped: 0, Time elapsed: 0.767 sec
Running org.jboss.as.test.smoke.surefire.servermodule.ServerInModuleStartupTestCase
Tests run: 2, Failures: 0, Errors: 1, Skipped: 0, Time elapsed: 0.175 sec <<< FAILURE!
Running org.jboss.as.test.smoke.surefire.servermodule.HttpDeploymentUploadUnitTestCase
Tests run: 1, Failures: 0, Errors: 0, Skipped: 0, Time elapsed: 0.251 sec
Running org.jboss.as.test.smoke.surefire.servermodule.ServerInModuleDeploymentTestCase
Tests run: 6, Failures: 0, Errors: 0, Skipped: 0, Time elapsed: 10.376 sec

Results :

Tests in error: 
  testReadResourceDescription(org.jboss.as.test.smoke.surefire.servermodule.ServerInModuleStartupTestCase): JBAS010625: Channel closed

Tests run: 113, Failures: 0, Errors: 1, Skipped: 6

[INFO] ------------------------------------------------------------------------
[INFO] Reactor Summary:
[INFO] 
[INFO] JBoss Application Server: Build Configuration ..... SUCCESS [2.252s]
[INFO] JBoss Application Server: Parent Aggregator ....... SUCCESS [1.605s]
[INFO] JBoss Application Server: Exported Java EE Specification APIs  SUCCESS [0.451s]
[INFO] JBoss Application Server: Protocol Utilities ...... SUCCESS [7.114s]
[INFO] JBoss Application Server: Controller Client ....... SUCCESS [4.133s]
[INFO] JBoss Application Server: Public APIs ............. SUCCESS [0.859s]
[INFO] JBoss Application Server: Controller Core ......... SUCCESS [16.043s]
[INFO] JBoss Application Server: Domain Management ....... SUCCESS [2.372s]
[INFO] JBoss Application Server: Domain HTTP Interface ... SUCCESS [0.168s]
[INFO] JBoss Application Server: Domain HTTP Interface ... SUCCESS [2.642s]
[INFO] JBoss Application Server: Deployment Repository ... SUCCESS [1.941s]
[INFO] JBoss Application Server: Embedded ................ SUCCESS [3.093s]
[INFO] JBoss Application Server: Platform MBean integration  SUCCESS [4.460s]
[INFO] JBoss Application Server: Process Controller ...... SUCCESS [5.342s]
[INFO] JBoss Application Server: Network ................. SUCCESS [1.871s]
[INFO] JBoss Application Server: Threading Subsystem ..... SUCCESS [5.205s]
[INFO] JBoss Application Server: Remoting Subsystem ...... SUCCESS [3.104s]
[INFO] JBoss Application Server: Server .................. SUCCESS [9.263s]
[INFO] JBoss Application Server: Subsystem Test Harness .. SUCCESS [4.789s]
[INFO] JBoss Application Server: Naming Subsystem ........ SUCCESS [6.025s]
[INFO] JBoss Application Server: EE ...................... SUCCESS [8.733s]
[INFO] JBoss Application Server: Transaction Subsystem ... SUCCESS [5.350s]
[INFO] JBoss Application Server: Clustering Subsystem .... SUCCESS [0.138s]
[INFO] JBoss Application Server: Common code for clustering subsystems  SUCCESS [7.487s]
[INFO] JBoss Application Server: JGroups Subsystem ....... SUCCESS [5.131s]
[INFO] JBoss Application Server: Infinispan Subsystem .... SUCCESS [9.645s]
[INFO] JBoss Application Server: Security Subsystem ...... SUCCESS [7.279s]
[INFO] JBoss Application Server: Connector Subsystem ..... SUCCESS [10.309s]
[INFO] JBoss Application Server: JacORB Subsystem ........ SUCCESS [9.201s]
[INFO] JBoss Application Server: EJB Subsystem ........... SUCCESS [18.771s]
[INFO] JBoss Application Server: Clustering Server API ... SUCCESS [10.396s]
[INFO] JBoss Application Server: Distributed Web Session SPI  SUCCESS [3.631s]
[INFO] JBoss Application Server: Clustering Server API implementation  SUCCESS [3.079s]
[INFO] JBoss Application Server: Distributed Web Session Infinispan provider  SUCCESS [5.802s]
[INFO] JBoss Application Server: Web Subsystem ........... SUCCESS [13.256s]
[INFO] JBoss Application Server: Web Services Subsystem .. SUCCESS [0.120s]
[INFO] JBoss Application Server: Web Services Server Integration Subsystem  SUCCESS [11.760s]
[INFO] JBoss Application Server: Application Client Bootstrap  SUCCESS [5.617s]
[INFO] JBoss Application Server: Command line interface .. SUCCESS [5.983s]
[INFO] JBoss Application Server: EJB Container Managed Persistence Subsystem  SUCCESS [13.012s]
[INFO] JBoss Application Server: Deployment Scanner ...... SUCCESS [5.347s]
[INFO] JBoss Application Server: Domain Controller ....... SUCCESS [10.032s]
[INFO] JBoss Application Server: EE Deployment ........... SUCCESS [2.820s]
[INFO] JBoss Application Server: JPA Subsystem ........... SUCCESS [0.143s]
[INFO] JBoss Application Server: JPA SPI ................. SUCCESS [4.249s]
[INFO] JBoss Application Server: JPA UTIL ................ SUCCESS [1.612s]
[INFO] JBoss Application Server: JPA Subsystem ........... SUCCESS [5.938s]
[INFO] JBoss Application Server: Weld Integration ........ SUCCESS [9.610s]
[INFO] JBoss Application Server: JAX-RS Integration ...... SUCCESS [5.644s]
[INFO] JBoss Application Server: JBoss Diagnostic Reporter  SUCCESS [0.191s]
[INFO] JBoss Application Server: JDR ..................... SUCCESS [3.513s]
[INFO] JBoss Application Server: JMX Subsystem ........... SUCCESS [10.930s]
[INFO] JBoss Application Server: Host Controller ......... SUCCESS [5.591s]
[INFO] JBoss Application Server: Logging Subsystem ....... SUCCESS [7.238s]
[INFO] JBoss Application Server: Mail subsystem .......... SUCCESS [5.632s]
[INFO] JBoss Application Server: Messaging Subsystem ..... SUCCESS [11.848s]
[INFO] JBoss Application Server: ModCluster Subsystem .... SUCCESS [6.284s]
[INFO] JBoss Application Server: POJO Subsystem .......... SUCCESS [4.052s]
[INFO] JBoss Application Server: OSGi .................... SUCCESS [0.140s]
[INFO] JBoss Application Server: OSGi Subsystem .......... SUCCESS [9.854s]
[INFO] JBoss Application Server: OSGi Config Admin ....... SUCCESS [2.453s]
[INFO] JBoss Application Server: sosreport scripts ....... SUCCESS [0.857s]
[INFO] JBoss Application Server: Service Archive Subsystem  SUCCESS [7.687s]
[INFO] JBoss Application Server: XTS Subsystem ........... SUCCESS [6.787s]
[INFO] JBoss Application Server: Hibernate 3.6.x JPA integration  SUCCESS [2.270s]
[INFO] JBoss Application Server: Hibernate 4.0.x JPA integration  SUCCESS [3.203s]
[INFO] JBoss Application Server: Build ................... SUCCESS [11.031s]
[INFO] JBoss Application Server: Arquillian .............. SUCCESS [0.143s]
[INFO] JBoss Application Server: Arquillian TestEnricher MSC  SUCCESS [1.310s]
[INFO] JBoss Application Server: Arquillian Common ....... SUCCESS [2.452s]
[INFO] JBoss Application Server: Arquillian Protocol JMX . SUCCESS [3.540s]
[INFO] JBoss Application Server: Arquillian Managed Container  SUCCESS [13.059s]
[INFO] JBoss Application Server: Arquillian Remote Container  SUCCESS [2.469s]
[INFO] JBoss Application Server: Arquillian TestNG Integration  SUCCESS [10.390s]
[INFO] JBoss Application Server: Arquillian Managed Domain Container  SUCCESS [4.639s]
[INFO] JBoss Application Server: Demos: Aggregator ....... SUCCESS [0.935s]
[INFO] JBoss Application Server: Demos: AS7 API .......... SUCCESS [1.954s]
[INFO] JBoss Application Server: Demos: Spec ............. SUCCESS [2.613s]
[INFO] JBoss Application Server: Demos: AS7 Internals .... SUCCESS [1.663s]
[INFO] JBoss Application Server: Demos: Legacy TO BE MOVED  SUCCESS [7.452s]
[INFO] JBoss Application Server: Distribution ............ SUCCESS [1.009s]
[INFO] JBoss Application Server: OSGi Integration Plugin . SUCCESS [1.722s]
[INFO] JBoss Application Server: Remoting Subsystem Test . SUCCESS [2.503s]
[INFO] JBoss Application Server: Validation Tests for Exported Java EE Specification APIs  SUCCESS [1.184s]
[INFO] JBoss Application Server: Web Services Tests Integration Subsystem  SUCCESS [1.795s]
[INFO] JBoss Application Server Test Suite: Aggregator ... SUCCESS [2.338s]
[INFO] JBoss Application Server Test Suite: Integration Tests  FAILURE [1:49.618s]
[INFO] ------------------------------------------------------------------------
[INFO] BUILD FAILURE
[INFO] ------------------------------------------------------------------------
[INFO] Total time: 9:19.867s
[INFO] Finished at: Mon Nov 21 10:50:41 EST 2011
[INFO] Final Memory: 301M/456M
[INFO] ------------------------------------------------------------------------
[ERROR] Failed to execute goal org.apache.maven.plugins:maven-surefire-plugin:2.10:test (smoke-default.surefire) on project jboss-as-testsuite-integration: There are test failures.
[ERROR] 
[ERROR] Please refer to <http://hudson.qa.jboss.com/hudson/job/JBoss-AS-7.x-latest/ws/testsuite/integration/target/surefire-reports> for the individual test results.
[ERROR] -> [Help 1]
[ERROR] 
[ERROR] To see the full stack trace of the errors, re-run Maven with the -e switch.
[ERROR] Re-run Maven using the -X switch to enable full debug logging.
[ERROR] 
[ERROR] For more information about the errors and possible solutions, please read the following articles:
[ERROR] [Help 1] http://cwiki.apache.org/confluence/display/MAVEN/MojoFailureException
[ERROR] 
[ERROR] After correcting the problems, you can resume the build with the command
[ERROR]   mvn <goals> -rf :jboss-as-testsuite-integration
Recording test results
Archiving artifacts



More information about the builds mailing list