Build failed in Jenkins: JBoss-AS-7.x-latest #77

jboss-qa-internal at redhat.com jboss-qa-internal at redhat.com
Sat Nov 26 02:06:50 EST 2011


See <http://hudson.qa.jboss.com/hudson/job/JBoss-AS-7.x-latest/77/>

------------------------------------------
[...truncated 10891 lines...]
[INFO] --- xml-maven-plugin:1.0:transform (update-ip-addresses-jbossas.server) @ jboss-as-testsuite-integration-smoke ---
[INFO] Transforming file: <http://hudson.qa.jboss.com/hudson/job/JBoss-AS-7.x-latest/ws/testsuite/integration/smoke/target/jbossas/standalone/configuration/standalone-xts.xml>
[INFO] Transforming file: <http://hudson.qa.jboss.com/hudson/job/JBoss-AS-7.x-latest/ws/testsuite/integration/smoke/target/jbossas/standalone/configuration/standalone-full.xml>
[INFO] Transforming file: <http://hudson.qa.jboss.com/hudson/job/JBoss-AS-7.x-latest/ws/testsuite/integration/smoke/target/jbossas/standalone/configuration/standalone.xml>
[INFO] Transformed 3 file(s).
[INFO] 
[INFO] --- maven-antrun-plugin:1.6:run (build-smoke.server) @ jboss-as-testsuite-integration-smoke ---
[INFO] Executing tasks

main:

build-smoke:
     [echo] Building AS instance "smoke" from <http://hudson.qa.jboss.com/hudson/job/JBoss-AS-7.x-latest/ws/testsuite/integration/smoke/../../../build/target/jboss-as-7.1.0.CR1-SNAPSHOT> to <http://hudson.qa.jboss.com/hudson/job/JBoss-AS-7.x-latest/ws/testsuite/integration/smoke/target>
     [copy] Copying 107 files to <http://hudson.qa.jboss.com/hudson/job/JBoss-AS-7.x-latest/ws/testsuite/integration/smoke/target/jbossas-smoke>
     [copy] Copied 20 empty directories to 3 empty directories under <http://hudson.qa.jboss.com/hudson/job/JBoss-AS-7.x-latest/ws/testsuite/integration/smoke/target/jbossas-smoke>
     [copy] Warning: <http://hudson.qa.jboss.com/hudson/job/JBoss-AS-7.x-latest/ws/testsuite/integration/src/test/resources/test-configs/smoke> does not exist.

changeDefaultDatabase:
     [echo] Changing IP addresses for config smoke
     [xslt] Processing <http://hudson.qa.jboss.com/hudson/job/JBoss-AS-7.x-latest/ws/testsuite/integration/smoke/target/jbossas-smoke/standalone/configuration/standalone-full.xml> to <http://hudson.qa.jboss.com/hudson/job/JBoss-AS-7.x-latest/ws/testsuite/integration/smoke/target/jbossas-smoke/standalone/configuration/standalone-full.xml.mod>
     [xslt] Loading stylesheet <http://hudson.qa.jboss.com/hudson/job/JBoss-AS-7.x-latest/ws/testsuite/integration/src/test/xslt/changeIPAddresses.xsl>
     [xslt] Processing <http://hudson.qa.jboss.com/hudson/job/JBoss-AS-7.x-latest/ws/testsuite/integration/smoke/target/jbossas-smoke/standalone/configuration/standalone-ha.xml> to <http://hudson.qa.jboss.com/hudson/job/JBoss-AS-7.x-latest/ws/testsuite/integration/smoke/target/jbossas-smoke/standalone/configuration/standalone-ha.xml.mod>
     [xslt] Processing <http://hudson.qa.jboss.com/hudson/job/JBoss-AS-7.x-latest/ws/testsuite/integration/smoke/target/jbossas-smoke/standalone/configuration/standalone.xml> to <http://hudson.qa.jboss.com/hudson/job/JBoss-AS-7.x-latest/ws/testsuite/integration/smoke/target/jbossas-smoke/standalone/configuration/standalone.xml.mod>
     [move] Moving 3 files to <http://hudson.qa.jboss.com/hudson/job/JBoss-AS-7.x-latest/ws/testsuite/integration/smoke/target/jbossas-smoke/standalone/configuration>
[INFO] Executed tasks
[INFO] 
[INFO] --- maven-compiler-plugin:2.3.2:testCompile (default-testCompile) @ jboss-as-testsuite-integration-smoke ---
[INFO] Compiling 75 source files to <http://hudson.qa.jboss.com/hudson/job/JBoss-AS-7.x-latest/ws/testsuite/integration/smoke/target/test-classes>
[INFO] 
[INFO] --- maven-surefire-plugin:2.10:test (smoke-full.surefire) @ jboss-as-testsuite-integration-smoke ---
[INFO] Surefire report directory: <http://hudson.qa.jboss.com/hudson/job/JBoss-AS-7.x-latest/ws/testsuite/integration/smoke/target/surefire-reports>

-------------------------------------------------------
 T E S T S
-------------------------------------------------------
Running org.jboss.as.test.smoke.embedded.demos.jms.JmsTestCase
Tests run: 1, Failures: 0, Errors: 0, Skipped: 0, Time elapsed: 17.644 sec
Running org.jboss.as.test.smoke.embedded.demos.client.jms.JmsClientTestCase
Tests run: 1, Failures: 0, Errors: 0, Skipped: 0, Time elapsed: 2.562 sec
Running org.jboss.as.test.smoke.embedded.demos.client.messaging.MessagingClientTestCase
Tests run: 1, Failures: 0, Errors: 0, Skipped: 0, Time elapsed: 0.393 sec
Running org.jboss.as.test.smoke.embedded.demos.messaging.MessagingTestCase
Tests run: 1, Failures: 0, Errors: 0, Skipped: 0, Time elapsed: 1.399 sec

Results :

Tests run: 4, Failures: 0, Errors: 0, Skipped: 0

[INFO] 
[INFO] --- maven-surefire-plugin:2.10:test (smoke-web.surefire) @ jboss-as-testsuite-integration-smoke ---
[INFO] Surefire report directory: <http://hudson.qa.jboss.com/hudson/job/JBoss-AS-7.x-latest/ws/testsuite/integration/smoke/target/surefire-reports>

-------------------------------------------------------
 T E S T S
-------------------------------------------------------
Running org.jboss.as.test.smoke.surefire.servermodule.ServerInModuleStartupTestCase
Tests run: 2, Failures: 0, Errors: 1, Skipped: 0, Time elapsed: 11.004 sec <<< FAILURE!
Running org.jboss.as.test.smoke.surefire.servermodule.ValidateModelTestCase
Tests run: 1, Failures: 0, Errors: 0, Skipped: 0, Time elapsed: 1.762 sec
Running org.jboss.as.test.smoke.surefire.servermodule.ServerInModuleDeploymentTestCase
Tests run: 6, Failures: 0, Errors: 0, Skipped: 0, Time elapsed: 11.837 sec
Running org.jboss.as.test.smoke.surefire.servermodule.HttpDeploymentUploadUnitTestCase
Tests run: 1, Failures: 0, Errors: 0, Skipped: 0, Time elapsed: 0.629 sec
Running org.jboss.as.test.smoke.flat.xml.XSDValidationUnitTestCase
Tests run: 1, Failures: 0, Errors: 0, Skipped: 0, Time elapsed: 3.003 sec
Running org.jboss.as.test.smoke.flat.xml.StandardConfigsXMLValidationUnitTestCase
Tests run: 4, Failures: 0, Errors: 0, Skipped: 0, Time elapsed: 3.697 sec
Running org.jboss.as.test.smoke.TestsuiteSanityTestCase
Tests run: 2, Failures: 0, Errors: 0, Skipped: 0, Time elapsed: 0.021 sec
Running org.jboss.as.test.smoke.stilts.SimpleStompletTestCase
Tests run: 2, Failures: 0, Errors: 0, Skipped: 0, Time elapsed: 7.343 sec
Running org.jboss.as.test.smoke.configadmin.ConfigAdminServiceTestCase
Tests run: 3, Failures: 0, Errors: 0, Skipped: 0, Time elapsed: 7.298 sec
Running org.jboss.as.test.smoke.embedded.deployment.rar.AS7_1452.AS7_1452TestCase
Tests run: 1, Failures: 0, Errors: 0, Skipped: 1, Time elapsed: 0.004 sec
Running org.jboss.as.test.smoke.embedded.demos.ds.DsTestCase
Tests run: 1, Failures: 0, Errors: 0, Skipped: 0, Time elapsed: 1.605 sec
Running org.jboss.as.test.smoke.embedded.demos.serviceloader.ServiceLoaderTestCase
Tests run: 1, Failures: 0, Errors: 0, Skipped: 0, Time elapsed: 1.082 sec
Running org.jboss.as.test.smoke.embedded.demos.rar.RarTestCase
Tests run: 2, Failures: 0, Errors: 0, Skipped: 0, Time elapsed: 1.414 sec
Running org.jboss.as.test.smoke.embedded.demos.ejb3.jndi.EarDeploymentEjbJndiBindingTestCase
Tests run: 4, Failures: 0, Errors: 0, Skipped: 0, Time elapsed: 2.015 sec
Running org.jboss.as.test.smoke.embedded.demos.ejb3.jndi.StandaloneModuleEjbJndiBindingTestCase
Tests run: 4, Failures: 0, Errors: 0, Skipped: 0, Time elapsed: 1.363 sec
Running org.jboss.as.test.smoke.embedded.demos.ejb3.dd.DDBasedEJBTestCase
Tests run: 4, Failures: 0, Errors: 0, Skipped: 0, Time elapsed: 2.429 sec
Running org.jboss.as.test.smoke.embedded.demos.webapp.WebAppTestCase
Tests run: 1, Failures: 0, Errors: 0, Skipped: 1, Time elapsed: 0 sec
Running org.jboss.as.test.smoke.embedded.demos.jaxrs.JaxrsTestCase
Tests run: 1, Failures: 0, Errors: 0, Skipped: 0, Time elapsed: 1.477 sec
Running org.jboss.as.test.smoke.embedded.demos.sar.SarTestCase
Tests run: 1, Failures: 0, Errors: 0, Skipped: 0, Time elapsed: 0.485 sec
Running org.jboss.as.test.smoke.embedded.demos.war.WarTestCase
Tests run: 2, Failures: 0, Errors: 0, Skipped: 0, Time elapsed: 0.386 sec
Running org.jboss.as.test.smoke.embedded.demos.ws.WSTestCase
Tests run: 3, Failures: 0, Errors: 0, Skipped: 0, Time elapsed: 5.78 sec
Running org.jboss.as.test.smoke.embedded.demos.managedbean.ManagedBeanTestCase
Tests run: 1, Failures: 0, Errors: 0, Skipped: 0, Time elapsed: 2.651 sec
Running org.jboss.as.test.smoke.embedded.parse.ParseAndMarshalModelsTestCase
Tests run: 30, Failures: 0, Errors: 0, Skipped: 0, Time elapsed: 34.786 sec
Running org.jboss.as.test.smoke.embedded.mgmt.DescribeOperationUnitTestCase
Tests run: 1, Failures: 0, Errors: 0, Skipped: 0, Time elapsed: 2.306 sec
Running org.jboss.as.test.smoke.embedded.mgmt.BasicOperationsUnitTestCase
Tests run: 6, Failures: 0, Errors: 0, Skipped: 0, Time elapsed: 1.198 sec
Running org.jboss.as.test.smoke.embedded.mgmt.datasource.DataSourceOperationsUnitTestCase
Tests run: 9, Failures: 0, Errors: 0, Skipped: 1, Time elapsed: 2.495 sec
Running org.jboss.as.test.smoke.embedded.mgmt.datasource.AddMySqlDataSourceOperationsUnitTestCase
Tests run: 1, Failures: 0, Errors: 0, Skipped: 1, Time elapsed: 0 sec
Running org.jboss.as.test.smoke.embedded.mgmt.datasource.DataSourceCfgMetricUnitTestCase
Tests run: 1, Failures: 0, Errors: 0, Skipped: 0, Time elapsed: 0.89 sec
Running org.jboss.as.test.smoke.embedded.mgmt.datasource.DataSourceResourcesUnitTestCase
Tests run: 2, Failures: 0, Errors: 0, Skipped: 0, Time elapsed: 0.944 sec
Running org.jboss.as.test.smoke.embedded.mgmt.PlatformMBeansUnitTestCase
Tests run: 1, Failures: 0, Errors: 0, Skipped: 0, Time elapsed: 0.78 sec
Running org.jboss.as.test.smoke.osgi.SimpleBundleContextTestCase
Tests run: 1, Failures: 0, Errors: 0, Skipped: 0, Time elapsed: 0.896 sec
Running org.jboss.as.test.smoke.osgi.SimplePackageAdminTestCase
Tests run: 1, Failures: 0, Errors: 0, Skipped: 0, Time elapsed: 0.939 sec
Running org.jboss.as.test.smoke.osgi.SimpleBundleTestCase
Tests run: 1, Failures: 0, Errors: 0, Skipped: 0, Time elapsed: 1 sec
Running org.jboss.as.test.smoke.osgi.SimpleModuleRegistrationTestCase
Tests run: 1, Failures: 0, Errors: 0, Skipped: 0, Time elapsed: 0.953 sec
Running org.jboss.as.test.smoke.osgi.SimpleStartLevelTestCase
Tests run: 1, Failures: 0, Errors: 0, Skipped: 0, Time elapsed: 1.735 sec
Running org.jboss.as.test.smoke.osgi.SimpleArquillianDeployerTestCase
Tests run: 1, Failures: 0, Errors: 0, Skipped: 0, Time elapsed: 1.144 sec
Running org.jboss.as.test.smoke.jsr88.EnterpriseDeploymentTestCase
Tests run: 6, Failures: 0, Errors: 0, Skipped: 3, Time elapsed: 1.076 sec

Results :

Tests in error: 
  testReadResourceDescription(org.jboss.as.test.smoke.surefire.servermodule.ServerInModuleStartupTestCase): JBAS010625: Channel closed

Tests run: 111, Failures: 0, Errors: 1, Skipped: 7

[INFO] ------------------------------------------------------------------------
[INFO] Reactor Summary:
[INFO] 
[INFO] JBoss Application Server: Build Configuration ..... SUCCESS [5.146s]
[INFO] JBoss Application Server: Parent Aggregator ....... SUCCESS [4.948s]
[INFO] JBoss Application Server: Exported Java EE Specification APIs  SUCCESS [1.804s]
[INFO] JBoss Application Server: Protocol Utilities ...... SUCCESS [18.416s]
[INFO] JBoss Application Server: Controller Client ....... SUCCESS [10.121s]
[INFO] JBoss Application Server: Public APIs ............. SUCCESS [2.387s]
[INFO] JBoss Application Server: Controller Core ......... SUCCESS [41.195s]
[INFO] JBoss Application Server: Domain Management ....... SUCCESS [6.025s]
[INFO] JBoss Application Server: Domain HTTP Interface ... SUCCESS [0.378s]
[INFO] JBoss Application Server: Domain HTTP Interface ... SUCCESS [5.988s]
[INFO] JBoss Application Server: Deployment Repository ... SUCCESS [4.287s]
[INFO] JBoss Application Server: Embedded ................ SUCCESS [6.768s]
[INFO] JBoss Application Server: Platform MBean integration  SUCCESS [10.607s]
[INFO] JBoss Application Server: Process Controller ...... SUCCESS [12.588s]
[INFO] JBoss Application Server: Network ................. SUCCESS [4.434s]
[INFO] JBoss Application Server: Threading Subsystem ..... SUCCESS [13.776s]
[INFO] JBoss Application Server: Remoting Subsystem ...... SUCCESS [11.486s]
[INFO] JBoss Application Server: Server .................. SUCCESS [22.185s]
[INFO] JBoss Application Server: Subsystem Test Harness .. SUCCESS [9.864s]
[INFO] JBoss Application Server: Naming Subsystem ........ SUCCESS [15.038s]
[INFO] JBoss Application Server: EE ...................... SUCCESS [20.214s]
[INFO] JBoss Application Server: Transaction Subsystem ... SUCCESS [12.799s]
[INFO] JBoss Application Server: Clustering Subsystem .... SUCCESS [0.280s]
[INFO] JBoss Application Server: Common code for clustering subsystems  SUCCESS [14.295s]
[INFO] JBoss Application Server: JGroups Subsystem ....... SUCCESS [12.984s]
[INFO] JBoss Application Server: Infinispan Subsystem .... SUCCESS [20.312s]
[INFO] JBoss Application Server: Security Subsystem ...... SUCCESS [18.902s]
[INFO] JBoss Application Server: Connector Subsystem ..... SUCCESS [25.773s]
[INFO] JBoss Application Server: JacORB Subsystem ........ SUCCESS [27.314s]
[INFO] JBoss Application Server: EJB Subsystem ........... SUCCESS [42.347s]
[INFO] JBoss Application Server: Clustering Server API ... SUCCESS [16.799s]
[INFO] JBoss Application Server: Distributed Web Session SPI  SUCCESS [6.838s]
[INFO] JBoss Application Server: Clustering Server API implementation  SUCCESS [7.590s]
[INFO] JBoss Application Server: Distributed Web Session Infinispan provider  SUCCESS [12.368s]
[INFO] JBoss Application Server: Web Subsystem ........... SUCCESS [28.036s]
[INFO] JBoss Application Server: Web Services Subsystem .. SUCCESS [0.287s]
[INFO] JBoss Application Server: Web Services Server Integration Subsystem  SUCCESS [22.218s]
[INFO] JBoss Application Server: Application Client Bootstrap  SUCCESS [9.995s]
[INFO] JBoss Application Server: Command line interface .. SUCCESS [15.296s]
[INFO] JBoss Application Server: EJB Container Managed Persistence Subsystem  SUCCESS [35.991s]
[INFO] JBoss Application Server: Deployment Scanner ...... SUCCESS [18.730s]
[INFO] JBoss Application Server: Domain Controller ....... SUCCESS [15.234s]
[INFO] JBoss Application Server: Domain HTTP Error Context  SUCCESS [1.326s]
[INFO] JBoss Application Server: EE Deployment ........... SUCCESS [7.081s]
[INFO] JBoss Application Server: JPA Subsystem ........... SUCCESS [0.302s]
[INFO] JBoss Application Server: JPA SPI ................. SUCCESS [5.545s]
[INFO] JBoss Application Server: JPA UTIL ................ SUCCESS [3.278s]
[INFO] JBoss Application Server: JPA Subsystem ........... SUCCESS [12.996s]
[INFO] JBoss Application Server: Weld Integration ........ SUCCESS [20.011s]
[INFO] JBoss Application Server: JAX-RS Integration ...... SUCCESS [10.108s]
[INFO] JBoss Application Server: JBoss Diagnostic Reporter  SUCCESS [0.217s]
[INFO] JBoss Application Server: JDR ..................... SUCCESS [7.652s]
[INFO] JBoss Application Server: JMX Subsystem ........... SUCCESS [20.400s]
[INFO] JBoss Application Server: Host Controller ......... SUCCESS [14.252s]
[INFO] JBoss Application Server: Logging Subsystem ....... SUCCESS [18.367s]
[INFO] JBoss Application Server: Mail subsystem .......... SUCCESS [11.128s]
[INFO] JBoss Application Server: Messaging Subsystem ..... SUCCESS [30.631s]
[INFO] JBoss Application Server: ModCluster Subsystem .... SUCCESS [13.681s]
[INFO] JBoss Application Server: POJO Subsystem .......... SUCCESS [8.614s]
[INFO] JBoss Application Server: OSGi .................... SUCCESS [0.247s]
[INFO] JBoss Application Server: OSGi Subsystem .......... SUCCESS [25.170s]
[INFO] JBoss Application Server: OSGi Config Admin ....... SUCCESS [8.466s]
[INFO] JBoss Application Server: sosreport scripts ....... SUCCESS [1.687s]
[INFO] JBoss Application Server: Service Archive Subsystem  SUCCESS [9.006s]
[INFO] JBoss Application Server: XTS Subsystem ........... SUCCESS [10.753s]
[INFO] JBoss Application Server: Hibernate 3.6.x JPA integration  SUCCESS [5.705s]
[INFO] JBoss Application Server: Hibernate 4.0.x JPA integration  SUCCESS [6.215s]
[INFO] JBoss Application Server: Build ................... SUCCESS [29.687s]
[INFO] JBoss Application Server: Arquillian .............. SUCCESS [0.447s]
[INFO] JBoss Application Server: Arquillian TestEnricher MSC  SUCCESS [2.596s]
[INFO] JBoss Application Server: Arquillian Common ....... SUCCESS [5.785s]
[INFO] JBoss Application Server: Arquillian Protocol JMX . SUCCESS [4.989s]
[INFO] JBoss Application Server: Arquillian Managed Container  SUCCESS [27.441s]
[INFO] JBoss Application Server: Arquillian Remote Container  SUCCESS [4.168s]
[INFO] JBoss Application Server: Arquillian TestNG Integration  SUCCESS [21.802s]
[INFO] JBoss Application Server: Arquillian Managed Domain Container  SUCCESS [8.144s]
[INFO] JBoss Application Server: Demos: Aggregator ....... SUCCESS [2.016s]
[INFO] JBoss Application Server: Demos: Spec ............. SUCCESS [5.363s]
[INFO] JBoss Application Server: Demos: Legacy TO BE MOVED  SUCCESS [14.588s]
[INFO] JBoss Application Server: Distribution ............ SUCCESS [1.980s]
[INFO] JBoss Application Server: OSGi Integration Plugin . SUCCESS [4.361s]
[INFO] JBoss Application Server: Remoting Subsystem Test . SUCCESS [6.813s]
[INFO] JBoss Application Server: Validation Tests for Exported Java EE Specification APIs  SUCCESS [2.493s]
[INFO] JBoss Application Server: Web Services Tests Integration Subsystem  SUCCESS [3.863s]
[INFO] JBoss Application Server Test Suite: Aggregator ... SUCCESS [6.878s]
[INFO] JBoss Application Server Test Suite: Integration Aggregator  SUCCESS [6.244s]
[INFO] JBoss AS Test Suite: Integration - Smoke .......... FAILURE [2:43.866s]
[INFO] ------------------------------------------------------------------------
[INFO] BUILD FAILURE
[INFO] ------------------------------------------------------------------------
[INFO] Total time: 19:41.189s
[INFO] Finished at: Sat Nov 26 02:06:43 EST 2011
[INFO] Final Memory: 314M/457M
[INFO] ------------------------------------------------------------------------
[ERROR] Failed to execute goal org.apache.maven.plugins:maven-surefire-plugin:2.10:test (smoke-web.surefire) on project jboss-as-testsuite-integration-smoke: There are test failures.
[ERROR] 
[ERROR] Please refer to <http://hudson.qa.jboss.com/hudson/job/JBoss-AS-7.x-latest/ws/testsuite/integration/smoke/target/surefire-reports> for the individual test results.
[ERROR] -> [Help 1]
[ERROR] 
[ERROR] To see the full stack trace of the errors, re-run Maven with the -e switch.
[ERROR] Re-run Maven using the -X switch to enable full debug logging.
[ERROR] 
[ERROR] For more information about the errors and possible solutions, please read the following articles:
[ERROR] [Help 1] http://cwiki.apache.org/confluence/display/MAVEN/MojoFailureException
[ERROR] 
[ERROR] After correcting the problems, you can resume the build with the command
[ERROR]   mvn <goals> -rf :jboss-as-testsuite-integration-smoke
Recording test results
Archiving artifacts



More information about the builds mailing list