Build failed in Jenkins: JBoss-AS-7.0.x #2024

jboss-qa-internal at redhat.com jboss-qa-internal at redhat.com
Sun Nov 27 23:29:32 EST 2011


See <http://hudson.qa.jboss.com/hudson/job/JBoss-AS-7.0.x/2024/changes>

Changes:

[bstansberry at jboss.com] AS7-2662 Use pool-name as resource name in DMR and jndi-name as service suffix

[bstansberry at jboss.com] fixing log message

------------------------------------------
[...truncated 10910 lines...]
[INFO] Transforming file: <http://hudson.qa.jboss.com/hudson/job/JBoss-AS-7.0.x/ws/testsuite/integration/smoke/target/jbossas/standalone/configuration/standalone.xml>
[INFO] Transformed 3 file(s).
[INFO] 
[INFO] --- maven-antrun-plugin:1.6:run (build-smoke.server) @ jboss-as-testsuite-integration-smoke ---
[INFO] Executing tasks

main:

build-smoke:
     [echo] Building AS instance "smoke" from <http://hudson.qa.jboss.com/hudson/job/JBoss-AS-7.0.x/ws/testsuite/integration/smoke/../../../build/target/jboss-as-7.1.0.CR1-SNAPSHOT> to <http://hudson.qa.jboss.com/hudson/job/JBoss-AS-7.0.x/ws/testsuite/integration/smoke/target>
     [copy] Copying 107 files to <http://hudson.qa.jboss.com/hudson/job/JBoss-AS-7.0.x/ws/testsuite/integration/smoke/target/jbossas-smoke>
     [copy] Copied 20 empty directories to 3 empty directories under <http://hudson.qa.jboss.com/hudson/job/JBoss-AS-7.0.x/ws/testsuite/integration/smoke/target/jbossas-smoke>
     [copy] Warning: <http://hudson.qa.jboss.com/hudson/job/JBoss-AS-7.0.x/ws/testsuite/integration/src/test/resources/test-configs/smoke> does not exist.

changeDefaultDatabase:
     [echo] Changing IP addresses for config smoke
     [xslt] Processing <http://hudson.qa.jboss.com/hudson/job/JBoss-AS-7.0.x/ws/testsuite/integration/smoke/target/jbossas-smoke/standalone/configuration/standalone-full.xml> to <http://hudson.qa.jboss.com/hudson/job/JBoss-AS-7.0.x/ws/testsuite/integration/smoke/target/jbossas-smoke/standalone/configuration/standalone-full.xml.mod>
     [xslt] Loading stylesheet <http://hudson.qa.jboss.com/hudson/job/JBoss-AS-7.0.x/ws/testsuite/integration/src/test/xslt/changeIPAddresses.xsl>
     [xslt] Processing <http://hudson.qa.jboss.com/hudson/job/JBoss-AS-7.0.x/ws/testsuite/integration/smoke/target/jbossas-smoke/standalone/configuration/standalone-ha.xml> to <http://hudson.qa.jboss.com/hudson/job/JBoss-AS-7.0.x/ws/testsuite/integration/smoke/target/jbossas-smoke/standalone/configuration/standalone-ha.xml.mod>
     [xslt] Processing <http://hudson.qa.jboss.com/hudson/job/JBoss-AS-7.0.x/ws/testsuite/integration/smoke/target/jbossas-smoke/standalone/configuration/standalone.xml> to <http://hudson.qa.jboss.com/hudson/job/JBoss-AS-7.0.x/ws/testsuite/integration/smoke/target/jbossas-smoke/standalone/configuration/standalone.xml.mod>
     [move] Moving 3 files to <http://hudson.qa.jboss.com/hudson/job/JBoss-AS-7.0.x/ws/testsuite/integration/smoke/target/jbossas-smoke/standalone/configuration>
[INFO] Executed tasks
[INFO] 
[INFO] --- maven-compiler-plugin:2.3.2:testCompile (default-testCompile) @ jboss-as-testsuite-integration-smoke ---
[INFO] Compiling 75 source files to <http://hudson.qa.jboss.com/hudson/job/JBoss-AS-7.0.x/ws/testsuite/integration/smoke/target/test-classes>
[INFO] 
[INFO] --- maven-surefire-plugin:2.10:test (smoke-full.surefire) @ jboss-as-testsuite-integration-smoke ---
[INFO] Surefire report directory: <http://hudson.qa.jboss.com/hudson/job/JBoss-AS-7.0.x/ws/testsuite/integration/smoke/target/surefire-reports>

-------------------------------------------------------
 T E S T S
-------------------------------------------------------
Running org.jboss.as.test.smoke.embedded.demos.jms.JmsTestCase
Tests run: 1, Failures: 0, Errors: 0, Skipped: 0, Time elapsed: 57.566 sec
Running org.jboss.as.test.smoke.embedded.demos.messaging.MessagingTestCase
Tests run: 1, Failures: 0, Errors: 0, Skipped: 0, Time elapsed: 4.59 sec
Running org.jboss.as.test.smoke.embedded.demos.client.messaging.MessagingClientTestCase
Tests run: 1, Failures: 0, Errors: 0, Skipped: 0, Time elapsed: 2.623 sec
Running org.jboss.as.test.smoke.embedded.demos.client.jms.JmsClientTestCase
Tests run: 1, Failures: 0, Errors: 0, Skipped: 0, Time elapsed: 5.518 sec

Results :

Tests run: 4, Failures: 0, Errors: 0, Skipped: 0

[INFO] 
[INFO] --- maven-surefire-plugin:2.10:test (smoke-web.surefire) @ jboss-as-testsuite-integration-smoke ---
[INFO] Surefire report directory: <http://hudson.qa.jboss.com/hudson/job/JBoss-AS-7.0.x/ws/testsuite/integration/smoke/target/surefire-reports>

-------------------------------------------------------
 T E S T S
-------------------------------------------------------
Running org.jboss.as.test.smoke.embedded.demos.serviceloader.ServiceLoaderTestCase
Tests run: 1, Failures: 0, Errors: 0, Skipped: 0, Time elapsed: 53.853 sec
Running org.jboss.as.test.smoke.embedded.demos.rar.RarTestCase
Tests run: 2, Failures: 0, Errors: 0, Skipped: 0, Time elapsed: 6.583 sec
Running org.jboss.as.test.smoke.embedded.demos.war.WarTestCase
Tests run: 2, Failures: 0, Errors: 0, Skipped: 0, Time elapsed: 4.3 sec
Running org.jboss.as.test.smoke.embedded.demos.jaxrs.JaxrsTestCase
Tests run: 1, Failures: 0, Errors: 0, Skipped: 0, Time elapsed: 4.531 sec
Running org.jboss.as.test.smoke.embedded.demos.ejb3.jndi.EarDeploymentEjbJndiBindingTestCase
Tests run: 4, Failures: 0, Errors: 0, Skipped: 0, Time elapsed: 5.997 sec
Running org.jboss.as.test.smoke.embedded.demos.ejb3.jndi.StandaloneModuleEjbJndiBindingTestCase
Tests run: 4, Failures: 0, Errors: 0, Skipped: 0, Time elapsed: 4.575 sec
Running org.jboss.as.test.smoke.embedded.demos.ejb3.dd.DDBasedEJBTestCase
Tests run: 4, Failures: 0, Errors: 0, Skipped: 0, Time elapsed: 6.697 sec
Running org.jboss.as.test.smoke.embedded.demos.webapp.WebAppTestCase
Tests run: 1, Failures: 0, Errors: 0, Skipped: 1, Time elapsed: 0.003 sec
Running org.jboss.as.test.smoke.embedded.demos.ds.DsTestCase
Tests run: 1, Failures: 0, Errors: 0, Skipped: 0, Time elapsed: 4.177 sec
Running org.jboss.as.test.smoke.embedded.demos.managedbean.ManagedBeanTestCase
Tests run: 1, Failures: 0, Errors: 0, Skipped: 0, Time elapsed: 7.129 sec
Running org.jboss.as.test.smoke.embedded.demos.sar.SarTestCase
Tests run: 1, Failures: 0, Errors: 0, Skipped: 0, Time elapsed: 1.074 sec
Running org.jboss.as.test.smoke.embedded.demos.ws.WSTestCase
Tests run: 3, Failures: 0, Errors: 0, Skipped: 0, Time elapsed: 21.736 sec
Running org.jboss.as.test.smoke.embedded.deployment.rar.AS7_1452.AS7_1452TestCase
Tests run: 1, Failures: 0, Errors: 0, Skipped: 1, Time elapsed: 0.003 sec
Running org.jboss.as.test.smoke.embedded.mgmt.datasource.AddMySqlDataSourceOperationsUnitTestCase
Tests run: 1, Failures: 0, Errors: 0, Skipped: 1, Time elapsed: 0.005 sec
Running org.jboss.as.test.smoke.embedded.mgmt.datasource.DataSourceResourcesUnitTestCase
Tests run: 2, Failures: 0, Errors: 0, Skipped: 0, Time elapsed: 4.326 sec
Running org.jboss.as.test.smoke.embedded.mgmt.datasource.DataSourceOperationsUnitTestCase
Tests run: 9, Failures: 1, Errors: 1, Skipped: 1, Time elapsed: 8.516 sec <<< FAILURE!
Running org.jboss.as.test.smoke.embedded.mgmt.datasource.DataSourceCfgMetricUnitTestCase
Tests run: 1, Failures: 0, Errors: 0, Skipped: 0, Time elapsed: 2.745 sec
Running org.jboss.as.test.smoke.embedded.mgmt.BasicOperationsUnitTestCase
Tests run: 6, Failures: 0, Errors: 0, Skipped: 0, Time elapsed: 3.491 sec
Running org.jboss.as.test.smoke.embedded.mgmt.DescribeOperationUnitTestCase
Tests run: 1, Failures: 0, Errors: 0, Skipped: 0, Time elapsed: 6.788 sec
Running org.jboss.as.test.smoke.embedded.mgmt.PlatformMBeansUnitTestCase
Tests run: 1, Failures: 0, Errors: 0, Skipped: 0, Time elapsed: 3 sec
Running org.jboss.as.test.smoke.embedded.parse.ParseAndMarshalModelsTestCase
Tests run: 30, Failures: 0, Errors: 0, Skipped: 0, Time elapsed: 117.355 sec
Running org.jboss.as.test.smoke.surefire.servermodule.ValidateModelTestCase
Tests run: 1, Failures: 0, Errors: 0, Skipped: 0, Time elapsed: 2.962 sec
Running org.jboss.as.test.smoke.surefire.servermodule.ServerInModuleDeploymentTestCase
Tests run: 6, Failures: 0, Errors: 0, Skipped: 0, Time elapsed: 12.683 sec
Running org.jboss.as.test.smoke.surefire.servermodule.ServerInModuleStartupTestCase
Tests run: 2, Failures: 0, Errors: 0, Skipped: 0, Time elapsed: 11.254 sec
Running org.jboss.as.test.smoke.surefire.servermodule.HttpDeploymentUploadUnitTestCase
Tests run: 1, Failures: 0, Errors: 0, Skipped: 0, Time elapsed: 0.894 sec
Running org.jboss.as.test.smoke.osgi.SimpleBundleTestCase
Tests run: 1, Failures: 0, Errors: 0, Skipped: 0, Time elapsed: 13.691 sec
Running org.jboss.as.test.smoke.osgi.SimpleModuleRegistrationTestCase
Tests run: 1, Failures: 0, Errors: 0, Skipped: 0, Time elapsed: 2.673 sec
Running org.jboss.as.test.smoke.osgi.SimpleBundleContextTestCase
Tests run: 1, Failures: 0, Errors: 0, Skipped: 0, Time elapsed: 2.293 sec
Running org.jboss.as.test.smoke.osgi.SimpleStartLevelTestCase
Tests run: 1, Failures: 0, Errors: 1, Skipped: 0, Time elapsed: 10.234 sec <<< FAILURE!
Running org.jboss.as.test.smoke.osgi.SimplePackageAdminTestCase
Tests run: 1, Failures: 0, Errors: 0, Skipped: 0, Time elapsed: 2.736 sec
Running org.jboss.as.test.smoke.osgi.SimpleArquillianDeployerTestCase
Tests run: 1, Failures: 0, Errors: 0, Skipped: 0, Time elapsed: 3.785 sec
Running org.jboss.as.test.smoke.flat.xml.XSDValidationUnitTestCase
Tests run: 1, Failures: 0, Errors: 0, Skipped: 0, Time elapsed: 6.9 sec
Running org.jboss.as.test.smoke.flat.xml.StandardConfigsXMLValidationUnitTestCase
Tests run: 4, Failures: 0, Errors: 0, Skipped: 0, Time elapsed: 4.551 sec
Running org.jboss.as.test.smoke.TestsuiteSanityTestCase
Tests run: 2, Failures: 0, Errors: 0, Skipped: 0, Time elapsed: 0.055 sec
Running org.jboss.as.test.smoke.configadmin.ConfigAdminServiceTestCase
Tests run: 3, Failures: 0, Errors: 0, Skipped: 0, Time elapsed: 6.988 sec
Running org.jboss.as.test.smoke.stilts.SimpleStompletTestCase
Tests run: 2, Failures: 0, Errors: 0, Skipped: 0, Time elapsed: 2.067 sec
Running org.jboss.as.test.smoke.jsr88.EnterpriseDeploymentTestCase
Tests run: 6, Failures: 0, Errors: 0, Skipped: 3, Time elapsed: 3.181 sec

Results :

Failed tests:   testAddDsWithConnectionProperties(org.jboss.as.test.smoke.embedded.mgmt.datasource.DataSourceOperationsUnitTestCase): {

Tests in error: 
  testAddDisabledDsEnableItAndTestConnection(org.jboss.as.test.smoke.embedded.mgmt.datasource.DataSourceOperationsUnitTestCase): JBAS010625: Channel closed
  testStartLevel(org.jboss.as.test.smoke.osgi.SimpleStartLevelTestCase): Timeout changing start level

Tests run: 111, Failures: 1, Errors: 2, Skipped: 7

[INFO] ------------------------------------------------------------------------
[INFO] Reactor Summary:
[INFO] 
[INFO] JBoss Application Server: Build Configuration ..... SUCCESS [16.765s]
[INFO] JBoss Application Server: Parent Aggregator ....... SUCCESS [13.965s]
[INFO] JBoss Application Server: Exported Java EE Specification APIs  SUCCESS [4.053s]
[INFO] JBoss Application Server: Protocol Utilities ...... SUCCESS [46.354s]
[INFO] JBoss Application Server: Controller Client ....... SUCCESS [30.091s]
[INFO] JBoss Application Server: Public APIs ............. SUCCESS [4.108s]
[INFO] JBoss Application Server: Controller Core ......... SUCCESS [1:32.564s]
[INFO] JBoss Application Server: Domain Management ....... SUCCESS [19.186s]
[INFO] JBoss Application Server: Domain HTTP Interface ... SUCCESS [1.489s]
[INFO] JBoss Application Server: Domain HTTP Interface ... SUCCESS [20.512s]
[INFO] JBoss Application Server: Deployment Repository ... SUCCESS [14.688s]
[INFO] JBoss Application Server: Embedded ................ SUCCESS [25.074s]
[INFO] JBoss Application Server: Platform MBean integration  SUCCESS [34.479s]
[INFO] JBoss Application Server: Process Controller ...... SUCCESS [38.163s]
[INFO] JBoss Application Server: Network ................. SUCCESS [13.936s]
[INFO] JBoss Application Server: Threading Subsystem ..... SUCCESS [37.153s]
[INFO] JBoss Application Server: Remoting Subsystem ...... SUCCESS [21.802s]
[INFO] JBoss Application Server: Server .................. SUCCESS [1:02.576s]
[INFO] JBoss Application Server: Subsystem Test Harness .. SUCCESS [36.440s]
[INFO] JBoss Application Server: Naming Subsystem ........ SUCCESS [40.713s]
[INFO] JBoss Application Server: EE ...................... SUCCESS [1:01.451s]
[INFO] JBoss Application Server: Transaction Subsystem ... SUCCESS [34.272s]
[INFO] JBoss Application Server: Clustering Subsystem .... SUCCESS [0.777s]
[INFO] JBoss Application Server: Common code for clustering subsystems  SUCCESS [48.812s]
[INFO] JBoss Application Server: JGroups Subsystem ....... SUCCESS [39.952s]
[INFO] JBoss Application Server: Infinispan Subsystem .... SUCCESS [52.275s]
[INFO] JBoss Application Server: Security Subsystem ...... SUCCESS [49.156s]
[INFO] JBoss Application Server: Connector Subsystem ..... SUCCESS [1:07.106s]
[INFO] JBoss Application Server: JacORB Subsystem ........ SUCCESS [1:09.896s]
[INFO] JBoss Application Server: EJB Subsystem ........... SUCCESS [1:42.794s]
[INFO] JBoss Application Server: Clustering Server API ... SUCCESS [40.213s]
[INFO] JBoss Application Server: Distributed Web Session SPI  SUCCESS [25.805s]
[INFO] JBoss Application Server: Clustering Server API implementation  SUCCESS [22.938s]
[INFO] JBoss Application Server: Distributed Web Session Infinispan provider  SUCCESS [45.492s]
[INFO] JBoss Application Server: Web Subsystem ........... SUCCESS [1:24.117s]
[INFO] JBoss Application Server: Web Services Subsystem .. SUCCESS [0.812s]
[INFO] JBoss Application Server: Web Services Server Integration Subsystem  SUCCESS [1:03.899s]
[INFO] JBoss Application Server: Application Client Bootstrap  SUCCESS [28.462s]
[INFO] JBoss Application Server: Command line interface .. SUCCESS [41.872s]
[INFO] JBoss Application Server: EJB Container Managed Persistence Subsystem  SUCCESS [1:30.840s]
[INFO] JBoss Application Server: Deployment Scanner ...... SUCCESS [39.160s]
[INFO] JBoss Application Server: Domain Controller ....... SUCCESS [40.903s]
[INFO] JBoss Application Server: Domain HTTP Error Context  SUCCESS [4.485s]
[INFO] JBoss Application Server: EE Deployment ........... SUCCESS [26.328s]
[INFO] JBoss Application Server: JPA Subsystem ........... SUCCESS [0.884s]
[INFO] JBoss Application Server: JPA SPI ................. SUCCESS [21.786s]
[INFO] JBoss Application Server: JPA UTIL ................ SUCCESS [13.298s]
[INFO] JBoss Application Server: JPA Subsystem ........... SUCCESS [42.916s]
[INFO] JBoss Application Server: Weld Integration ........ SUCCESS [1:03.064s]
[INFO] JBoss Application Server: JAX-RS Integration ...... SUCCESS [35.934s]
[INFO] JBoss Application Server: JBoss Diagnostic Reporter  SUCCESS [0.886s]
[INFO] JBoss Application Server: JDR ..................... SUCCESS [25.681s]
[INFO] JBoss Application Server: JMX Subsystem ........... SUCCESS [58.404s]
[INFO] JBoss Application Server: Host Controller ......... SUCCESS [49.292s]
[INFO] JBoss Application Server: Logging Subsystem ....... SUCCESS [51.808s]
[INFO] JBoss Application Server: Mail subsystem .......... SUCCESS [35.495s]
[INFO] JBoss Application Server: Messaging Subsystem ..... SUCCESS [1:14.707s]
[INFO] JBoss Application Server: ModCluster Subsystem .... SUCCESS [40.742s]
[INFO] JBoss Application Server: POJO Subsystem .......... SUCCESS [50.404s]
[INFO] JBoss Application Server: OSGi .................... SUCCESS [0.927s]
[INFO] JBoss Application Server: OSGi Subsystem .......... SUCCESS [47.890s]
[INFO] JBoss Application Server: OSGi Config Admin ....... SUCCESS [19.739s]
[INFO] JBoss Application Server: sosreport scripts ....... SUCCESS [6.814s]
[INFO] JBoss Application Server: Service Archive Subsystem  SUCCESS [40.796s]
[INFO] JBoss Application Server: XTS Subsystem ........... SUCCESS [33.113s]
[INFO] JBoss Application Server: Hibernate 3.6.x JPA integration  SUCCESS [19.492s]
[INFO] JBoss Application Server: Hibernate 4.0.x JPA integration  SUCCESS [22.246s]
[INFO] JBoss Application Server: Build ................... SUCCESS [1:10.975s]
[INFO] JBoss Application Server: Arquillian .............. SUCCESS [0.772s]
[INFO] JBoss Application Server: Arquillian TestEnricher MSC  SUCCESS [10.498s]
[INFO] JBoss Application Server: Arquillian Common ....... SUCCESS [17.464s]
[INFO] JBoss Application Server: Arquillian Protocol JMX . SUCCESS [18.523s]
[INFO] JBoss Application Server: Arquillian Managed Container  SUCCESS [1:19.181s]
[INFO] JBoss Application Server: Arquillian Remote Container  SUCCESS [17.690s]
[INFO] JBoss Application Server: Arquillian TestNG Integration  SUCCESS [1:17.227s]
[INFO] JBoss Application Server: Arquillian Managed Domain Container  SUCCESS [31.768s]
[INFO] JBoss Application Server: Demos: Aggregator ....... SUCCESS [8.418s]
[INFO] JBoss Application Server: Demos: Spec ............. SUCCESS [37.503s]
[INFO] JBoss Application Server: Demos: Legacy TO BE MOVED  SUCCESS [48.721s]
[INFO] JBoss Application Server: Distribution ............ SUCCESS [9.073s]
[INFO] JBoss Application Server: OSGi Integration Plugin . SUCCESS [14.786s]
[INFO] JBoss Application Server: Remoting Subsystem Test . SUCCESS [22.020s]
[INFO] JBoss Application Server: Validation Tests for Exported Java EE Specification APIs  SUCCESS [8.621s]
[INFO] JBoss Application Server: Web Services Tests Integration Subsystem  SUCCESS [13.863s]
[INFO] JBoss Application Server Test Suite: Aggregator ... SUCCESS [21.588s]
[INFO] JBoss Application Server Test Suite: Integration Aggregator  SUCCESS [20.192s]
[INFO] JBoss AS Test Suite: Integration - Smoke .......... FAILURE [8:12.648s]
[INFO] ------------------------------------------------------------------------
[INFO] BUILD FAILURE
[INFO] ------------------------------------------------------------------------
[INFO] Total time: 57:50.353s
[INFO] Finished at: Sun Nov 27 23:28:00 EST 2011
[INFO] Final Memory: 217M/466M
[INFO] ------------------------------------------------------------------------
[ERROR] Failed to execute goal org.apache.maven.plugins:maven-surefire-plugin:2.10:test (smoke-web.surefire) on project jboss-as-testsuite-integration-smoke: There are test failures.
[ERROR] 
[ERROR] Please refer to <http://hudson.qa.jboss.com/hudson/job/JBoss-AS-7.0.x/ws/testsuite/integration/smoke/target/surefire-reports> for the individual test results.
[ERROR] -> [Help 1]
[ERROR] 
[ERROR] To see the full stack trace of the errors, re-run Maven with the -e switch.
[ERROR] Re-run Maven using the -X switch to enable full debug logging.
[ERROR] 
[ERROR] For more information about the errors and possible solutions, please read the following articles:
[ERROR] [Help 1] http://cwiki.apache.org/confluence/display/MAVEN/MojoFailureException
[ERROR] 
[ERROR] After correcting the problems, you can resume the build with the command
[ERROR]   mvn <goals> -rf :jboss-as-testsuite-integration-smoke
Recording test results
Archiving artifacts



More information about the builds mailing list